{"text_format":"3","workbook":"xlsx","n_sheets":18,"sheets":["Übersicht","Wettkampf 1","2","3","4","5","6","7","8","9","10","11","12","Ausdruck","Ausdruck blank","Übersicht Schützen","Formelhilfe","Übersicht Gruppen"],"not_rendered":{"images":2,"macros":1,"defined_names":12},"read":"whole","date_system":"1900"}

{"sheet":"Übersicht","index":0,"n_rows":54,"n_cols":22,"rows_kept":54,"merged":[[0,10,0,11],[0,12,0,14],[0,15,0,16],[2,9,2,10],[2,17,2,18],[2,19,2,20],[3,1,3,2],[3,21,5,21],[5,1,5,2],[6,1,6,2],[7,1,7,2],[8,1,8,2],[9,1,9,2],[10,1,10,2],[14,9,14,10],[14,17,14,18],[14,19,14,20],[14,21,16,21]]}
[{"$nulls":3},"Kreisrundenwettkampf",{"$nulls":5},"Saison","2022/2023",null,"2. Kreisklasse",null,null,"Schützen"]
[]
[null,null,"Wettkampftag:","11.09.","25.09.","09.10.","23.10.","20.11.","04.12.","Hinrunde",null,"22.01.","05.02.","19.02.","05.03.","19.03.","16.04.","Rückrunde",null,"Serie komplett"]
["Pos.","Verein / Gruppe",null,"Sögel ","Ostenwalde ","Neuvrees ","Breddenberg","Neuvrees","Börger","Schnitt","Gesamt ","Sögel ","Ostenwalde ","Neuvrees ","Breddenberg","Neuvrees","Börger","Schnitt","Gesamt ","Schnitt","Gesamt","Differenz"]
[]
[1,{"$f":"'Übersicht Gruppen'!B2","v":"Sögel II"},null,{"$f":"'Übersicht Gruppen'!C2","v":932.8},{"$f":"'Übersicht Gruppen'!D2","v":933.3},{"$f":"'Übersicht Gruppen'!E2","v":941.3},{"$f":"'Übersicht Gruppen'!F2","v":943.4},{"$f":"'Übersicht Gruppen'!G2","v":939.4},{"$f":"'Übersicht Gruppen'!H2","v":940.4},{"$f":"'Übersicht Gruppen'!I2","v":{"v":938.4333333333333,"d":"938.43"}},{"$f":"SUM(D6:I6)","v":{"v":5630.599999999999,"d":"5,630.6"}},{"$f":"'Übersicht Gruppen'!K2","v":{"v":944.0999999999999,"d":"944.1"}},{"$f":"'Übersicht Gruppen'!L2","v":936.4},{"$f":"'Übersicht Gruppen'!M2","v":935.3},{"$f":"'Übersicht Gruppen'!N2","v":932.5},{"$f":"'Übersicht Gruppen'!O2","v":{"v":941.5999999999999,"d":"941.6"}},{"$f":"'Übersicht Gruppen'!P2","v":{"v":0,"d":"0.0"}},{"$f":"IF(Formelhilfe!O2=0,0,'Übersicht Gruppen'!Q2)","v":{"v":937.9799999999999,"d":"937.98"}},{"$f":"SUM(L6:Q6)","v":{"v":4689.9,"d":"4,689.9"}},{"$f":"'Übersicht Gruppen'!S2","v":{"v":938.2272727272725,"d":"938.23"}},{"$f":"SUM(S6+K6)","v":{"v":10320.5,"d":"10,320.5"}}]
[2,{"$f":"'Übersicht Gruppen'!B3","v":"Börger III"},null,{"$f":"'Übersicht Gruppen'!C3","v":923.3},{"$f":"'Übersicht Gruppen'!D3","v":{"v":931.6999999999999,"d":"931.7"}},{"$f":"'Übersicht Gruppen'!E3","v":929.7},{"$f":"'Übersicht Gruppen'!F3","v":{"v":926.3999999999999,"d":"926.4"}},{"$f":"'Übersicht Gruppen'!G3","v":{"v":935,"d":"935.0"}},{"$f":"'Übersicht Gruppen'!H3","v":939.6},{"$f":"'Übersicht Gruppen'!I3","v":{"v":930.9499999999999,"d":"930.95"}},{"v":5585.7,"d":"5,585.7"},{"$f":"'Übersicht Gruppen'!K3","v":{"v":934.3999999999999,"d":"934.4"}},{"$f":"'Übersicht Gruppen'!L3","v":{"v":925.3000000000001,"d":"925.3"}},{"$f":"'Übersicht Gruppen'!M3","v":933.1},{"$f":"'Übersicht Gruppen'!N3","v":934.5},{"$f":"'Übersicht Gruppen'!O3","v":938.2},{"$f":"'Übersicht Gruppen'!P3","v":{"v":0,"d":"0.0"}},{"$f":"IF(Formelhilfe!O3=0,0,'Übersicht Gruppen'!Q3)","v":{"v":933.1,"d":"933.10"}},{"v":4665.5,"d":"4,665.5"},{"$f":"'Übersicht Gruppen'!S3","v":{"v":931.9272727272728,"d":"931.93"}},{"$f":"SUM(S7+K7)","v":{"v":10251.2,"d":"10,251.2"}},{"$f":"(U6-U7)*-1","v":{"v":-69.29999999999927,"d":"-69.3"}}]
[3,{"$f":"'Übersicht Gruppen'!B4","v":"Neuvrees II"},null,{"$f":"'Übersicht Gruppen'!C4","v":{"v":933.6999999999999,"d":"933.7"}},{"$f":"'Übersicht Gruppen'!D4","v":{"v":934.6000000000001,"d":"934.6"}},{"$f":"'Übersicht Gruppen'!E4","v":929.4},{"$f":"'Übersicht Gruppen'!F4","v":930.9},{"$f":"'Übersicht Gruppen'!G4","v":932.3},{"$f":"'Übersicht Gruppen'!H4","v":921.5},{"$f":"'Übersicht Gruppen'!I4","v":{"v":930.4000000000001,"d":"930.40"}},{"v":5582.400000000001,"d":"5,582.4"},{"$f":"'Übersicht Gruppen'!K4","v":{"v":922.8000000000001,"d":"922.8"}},{"$f":"'Übersicht Gruppen'!L4","v":928.9},{"$f":"'Übersicht Gruppen'!M4","v":936.9},{"$f":"'Übersicht Gruppen'!N4","v":934.4},{"$f":"'Übersicht Gruppen'!O4","v":929.4},{"$f":"'Übersicht Gruppen'!P4","v":{"v":0,"d":"0.0"}},{"$f":"IF(Formelhilfe!O4=0,0,'Übersicht Gruppen'!Q4)","v":{"v":930.4799999999999,"d":"930.48"}},{"v":4652.4,"d":"4,652.4"},{"$f":"'Übersicht Gruppen'!S4","v":{"v":930.4363636363636,"d":"930.44"}},{"v":10234.8,"d":"10,234.8"},{"$f":"(U7-U8)*-1","v":{"v":-16.400000000001455,"d":"-16.4"}}]
[4,{"$f":"'Übersicht Gruppen'!B5","v":"Neuvrees I"},null,{"$f":"'Übersicht Gruppen'!C5","v":{"v":930.3000000000001,"d":"930.3"}},{"$f":"'Übersicht Gruppen'!D5","v":929.2},{"$f":"'Übersicht Gruppen'!E5","v":926.4},{"$f":"'Übersicht Gruppen'!F5","v":934.5},{"$f":"'Übersicht Gruppen'!G5","v":{"v":924.8000000000001,"d":"924.8"}},{"$f":"'Übersicht Gruppen'!H5","v":{"v":929.0999999999999,"d":"929.1"}},{"$f":"'Übersicht Gruppen'!I5","v":{"v":929.0499999999998,"d":"929.05"}},{"v":5574.299999999999,"d":"5,574.3"},{"$f":"'Übersicht Gruppen'!K5","v":919.5},{"$f":"'Übersicht Gruppen'!L5","v":{"v":939.5999999999999,"d":"939.6"}},{"$f":"'Übersicht Gruppen'!M5","v":{"v":933,"d":"933.0"}},{"$f":"'Übersicht Gruppen'!N5","v":929.6},{"$f":"'Übersicht Gruppen'!O5","v":929.4},{"$f":"'Übersicht Gruppen'!P5","v":{"v":0,"d":"0.0"}},{"$f":"IF(Formelhilfe!O5=0,0,'Übersicht Gruppen'!Q5)","v":{"v":930.2199999999999,"d":"930.22"}},{"v":4651.099999999999,"d":"4,651.1"},{"$f":"'Übersicht Gruppen'!S5","v":{"v":929.5818181818181,"d":"929.58"}},{"v":10225.399999999998,"d":"10,225.4"},{"v":-9.400000000001455,"d":"-9.4"}]
[5,{"$f":"'Übersicht Gruppen'!B6","v":"Ostenwalde I"},null,{"$f":"'Übersicht Gruppen'!C6","v":922.4},{"$f":"'Übersicht Gruppen'!D6","v":{"v":929,"d":"929.0"}},{"$f":"'Übersicht Gruppen'!E6","v":{"v":923.4000000000001,"d":"923.4"}},{"$f":"'Übersicht Gruppen'!F6","v":923.2},{"$f":"'Übersicht Gruppen'!G6","v":{"v":923,"d":"923.0"}},{"$f":"'Übersicht Gruppen'!H6","v":922.2},{"$f":"'Übersicht Gruppen'!I6","v":{"v":923.8666666666667,"d":"923.87"}},{"v":5543.2,"d":"5,543.2"},{"$f":"'Übersicht Gruppen'!K6","v":925.1},{"$f":"'Übersicht Gruppen'!L6","v":{"v":921.1999999999999,"d":"921.2"}},{"$f":"'Übersicht Gruppen'!M6","v":{"v":912.9000000000001,"d":"912.9"}},{"$f":"'Übersicht Gruppen'!N6","v":{"v":919.9000000000001,"d":"919.9"}},{"$f":"'Übersicht Gruppen'!O6","v":{"v":925,"d":"925.0"}},{"$f":"'Übersicht Gruppen'!P6","v":{"v":0,"d":"0.0"}},{"$f":"IF(Formelhilfe!O6=0,0,'Übersicht Gruppen'!Q6)","v":920.82},{"v":4604.1,"d":"4,604.1"},{"$f":"'Übersicht Gruppen'!S6","v":{"v":922.4818181818181,"d":"922.48"}},{"v":10147.3,"d":"10,147.3"},{"v":-78.09999999999854,"d":"-78.1"}]
[6,{"$f":"'Übersicht Gruppen'!B7","v":"Breddenberg IV"},null,{"$f":"'Übersicht Gruppen'!C7","v":915.7},{"$f":"'Übersicht Gruppen'!D7","v":919.3},{"$f":"'Übersicht Gruppen'!E7","v":{"v":914,"d":"914.0"}},{"$f":"'Übersicht Gruppen'!F7","v":917.9},{"$f":"'Übersicht Gruppen'!G7","v":914.8},{"$f":"'Übersicht Gruppen'!H7","v":921.5},{"$f":"'Übersicht Gruppen'!I7","v":{"v":917.1999999999999,"d":"917.20"}},{"v":5503.2,"d":"5,503.2"},{"$f":"'Übersicht Gruppen'!K7","v":929.8},{"$f":"'Übersicht Gruppen'!L7","v":922.2},{"$f":"'Übersicht Gruppen'!M7","v":909.2},{"$f":"'Übersicht Gruppen'!N7","v":{"v":927.8000000000001,"d":"927.8"}},{"$f":"'Übersicht Gruppen'!O7","v":916.5},{"$f":"'Übersicht Gruppen'!P7","v":{"v":0,"d":"0.0"}},{"$f":"IF(Formelhilfe!O7=0,0,'Übersicht Gruppen'!Q7)","v":{"v":921.1,"d":"921.10"}},{"v":4605.5,"d":"4,605.5"},{"$f":"'Übersicht Gruppen'!S7","v":{"v":918.9727272727272,"d":"918.97"}},{"v":10108.7,"d":"10,108.7"},{"v":-38.599999999998545,"d":"-38.6"}]
[]
[null,null,"Schnitt:",{"$f":"AVERAGE(D6:D11)","v":{"v":926.3666666666667,"d":"926.4"}},{"$f":"AVERAGE(E6:E11)","v":{"v":929.5166666666668,"d":"929.5"}},{"v":927.3666666666668,"d":"927.4"},{"v":929.3833333333332,"d":"929.4"},{"v":928.2166666666667,"d":"928.2"},{"v":929.0500000000001,"d":"929.1"},{"v":928.3166666666666,"d":"928.32"},{"$f":"SUM(K6:K11)/6","v":{"v":5569.900000000001,"d":"5,569.9"}},{"v":929.2833333333333,"d":"929.3"},{"v":928.9333333333333,"d":"928.9"},{"v":926.7333333333335,"d":"926.7"},{"v":929.7833333333333,"d":"929.8"},{"v":930.0166666666668,"d":"930.0"},{"v":0,"d":"0.0"},{"v":928.9499999999999,"d":"928.95"},{"v":4644.75,"d":"4644.8"},{"v":928.6045454545452,"d":"928.60"},{"v":10214.65,"d":"10,214.7"}]
[]
[{"$nulls":9},"Hinrunde",{"$nulls":7},"Rückrunde",null,"Serie komplett",null,"Differenz"]
["Pos.","Vorname Name","Verein / Gruppe",{"$nulls":6},"Schnitt","Gesamt",{"$nulls":6},"Schnitt","Gesamt","Schnitt","Gesamt"]
[1,{"$f":"'Übersicht Schützen'!A2","v":"Robbers Heinz"},{"$f":"'Übersicht Schützen'!B2","v":"Sögel II"},{"$f":"'Übersicht Schützen'!C2","v":308.3},{"$f":"'Übersicht Schützen'!D2","v":312.1},{"$f":"'Übersicht Schützen'!E2","v":312.7},{"$f":"'Übersicht Schützen'!F2","v":315.5},{"$f":"'Übersicht Schützen'!G2","v":315.4},{"$f":"'Übersicht Schützen'!H2","v":314.5},{"$f":"'Übersicht Schützen'!I2","v":{"v":313.0833333333333,"d":"313.08"}},{"$f":"SUM(D17:I17)","v":{"v":1878.5,"d":"1,878.5"}},{"$f":"'Übersicht Schützen'!L2","v":312.2},{"$f":"'Übersicht Schützen'!M2","v":312.9},{"$f":"'Übersicht Schützen'!N2","v":311.4},{"$f":"'Übersicht Schützen'!O2","v":311.6},{"$f":"'Übersicht Schützen'!P2","v":315.6},{"$f":"'Übersicht Schützen'!Q2","v":{"v":0,"d":"0.0"}},{"$f":"IF(Formelhilfe!O9=0,0,'Übersicht Schützen'!R2)","v":{"v":312.73999999999995,"d":"312.74"}},{"$f":"SUM(L17:Q17)","v":{"v":1563.6999999999998,"d":"1,563.7"}},{"$f":"'Übersicht Schützen'!U2","v":{"v":312.92727272727274,"d":"312.93"}},{"$f":"SUM(K17+S17)","v":{"v":3442.2,"d":"3,442.2"}}]
[2,{"$f":"'Übersicht Schützen'!A3","v":"Grünloh Michael"},{"$f":"'Übersicht Schützen'!B3","v":"Sögel II"},{"$f":"'Übersicht Schützen'!C3","v":313.1},{"$f":"'Übersicht Schützen'!D3","v":309.3},{"$f":"'Übersicht Schützen'!E3","v":315.4},{"$f":"'Übersicht Schützen'!F3","v":313.5},{"$f":"'Übersicht Schützen'!G3","v":310.8},{"$f":"'Übersicht Schützen'!H3","v":311.5},{"$f":"'Übersicht Schützen'!I3","v":{"v":312.2666666666667,"d":"312.27"}},{"$f":"SUM(D18:I18)","v":{"v":1873.6000000000001,"d":"1,873.6"}},{"$f":"'Übersicht Schützen'!L3","v":313.9},{"$f":"'Übersicht Schützen'!M3","v":311.2},{"$f":"'Übersicht Schützen'!N3","v":313.4},{"$f":"'Übersicht Schützen'!O3","v":309.8},{"$f":"'Übersicht Schützen'!P3","v":{"v":313.29999999999995,"d":"313.3"}},{"$f":"'Übersicht Schützen'!Q3","v":{"v":0,"d":"0.0"}},{"$f":"IF(Formelhilfe!O10=0,0,'Übersicht Schützen'!R3)","v":312.32},{"$f":"SUM(L18:Q18)","v":{"v":1561.6,"d":"1,561.6"}},{"$f":"'Übersicht Schützen'!U3","v":{"v":312.29090909090905,"d":"312.29"}},{"$f":"SUM(K18+S18)","v":{"v":3435.2,"d":"3,435.2"}},{"$f":"(U17-U18)*-1","v":{"v":-7,"d":"-7.0"}}]
[3,{"$f":"'Übersicht Schützen'!A4","v":"Robbers Bernd"},{"$f":"'Übersicht Schützen'!B4","v":"Sögel II"},{"$f":"'Übersicht Schützen'!C4","v":311.4},{"$f":"'Übersicht Schützen'!D4","v":311.9},{"$f":"'Übersicht Schützen'!E4","v":313.2},{"$f":"'Übersicht Schützen'!F4","v":308.7},{"$f":"'Übersicht Schützen'!G4","v":{"v":311,"d":"311.0"}},{"$f":"'Übersicht Schützen'!H4","v":314.4},{"$f":"'Übersicht Schützen'!I4","v":{"v":311.76666666666665,"d":"311.77"}},{"$f":"SUM(D19:I19)","v":{"v":1870.6,"d":"1,870.6"}},{"$f":"'Übersicht Schützen'!L4","v":{"v":318,"d":"318.0"}},{"$f":"'Übersicht Schützen'!M4","v":312.1},{"$f":"'Übersicht Schützen'!N4","v":310.5},{"$f":"'Übersicht Schützen'!O4","v":308.9},{"$f":"'Übersicht Schützen'!P4","v":{"v":310.90000000000003,"d":"310.9"}},{"$f":"'Übersicht Schützen'!Q4","v":{"v":0,"d":"0.0"}},{"$f":"IF(Formelhilfe!O11=0,0,'Übersicht Schützen'!R4)","v":{"v":312.08000000000004,"d":"312.08"}},{"v":1560.4,"d":"1,560.4"},{"$f":"'Übersicht Schützen'!U4","v":{"v":311.90909090909093,"d":"311.91"}},{"v":3431,"d":"3,431.0"},{"$f":"(U18-U19)*-1","v":{"v":-4.199999999999818,"d":"-4.2"}}]
[4,{"$f":"'Übersicht Schützen'!A5","v":"Henzen Jens"},{"$f":"'Übersicht Schützen'!B5","v":"Börger III"},{"$f":"'Übersicht Schützen'!C5","v":307.6},{"$f":"'Übersicht Schützen'!D5","v":314.2},{"$f":"'Übersicht Schützen'!E5","v":307.8},{"$f":"'Übersicht Schützen'!F5","v":308.9},{"$f":"'Übersicht Schützen'!G5","v":311.5},{"$f":"'Übersicht Schützen'!H5","v":307.9},{"$f":"'Übersicht Schützen'!I5","v":{"v":309.65000000000003,"d":"309.65"}},{"v":1857.9,"d":"1,857.9"},{"$f":"'Übersicht Schützen'!L5","v":313.2},{"$f":"'Übersicht Schützen'!M5","v":309.6},{"$f":"'Übersicht Schützen'!N5","v":313.6},{"$f":"'Übersicht Schützen'!O5","v":313.1},{"$f":"'Übersicht Schützen'!P5","v":314.5},{"$f":"'Übersicht Schützen'!Q5","v":{"v":0,"d":"0.0"}},{"$f":"IF(Formelhilfe!O12=0,0,'Übersicht Schützen'!R5)","v":{"v":312.8,"d":"312.80"}},{"v":1564,"d":"1,564.0"},{"$f":"'Übersicht Schützen'!U5","v":{"v":311.08181818181816,"d":"311.08"}},{"v":3421.9,"d":"3,421.9"},{"v":-9.099999999999909,"d":"-9.1"}]
[5,{"$f":"'Übersicht Schützen'!A6","v":"Köß Wilhelm"},{"$f":"'Übersicht Schützen'!B6","v":"Breddenberg IV"},{"$f":"'Übersicht Schützen'!C6","v":309.4},{"$f":"'Übersicht Schützen'!D6","v":311.7},{"$f":"'Übersicht Schützen'!E6","v":310.2},{"$f":"'Übersicht Schützen'!F6","v":311.3},{"$f":"'Übersicht Schützen'!G6","v":308.8},{"$f":"'Übersicht Schützen'!H6","v":310.1},{"$f":"'Übersicht Schützen'!I6","v":310.25},{"v":1861.5,"d":"1,861.5"},{"$f":"'Übersicht Schützen'!L6","v":313.6},{"$f":"'Übersicht Schützen'!M6","v":309.6},{"$f":"'Übersicht Schützen'!N6","v":310.3},{"$f":"'Übersicht Schützen'!O6","v":311.1},{"$f":"'Übersicht Schützen'!P6","v":309.6},{"$f":"'Übersicht Schützen'!Q6","v":{"v":0,"d":"0.0"}},313.04,{"v":1554.1999999999998,"d":"1,554.2"},{"$f":"'Übersicht Schützen'!U6","v":{"v":310.5181818181818,"d":"310.52"}},{"v":3415.7,"d":"3,415.7"},{"v":-6.200000000000273,"d":"-6.2"}]
[6,{"$f":"'Übersicht Schützen'!A7","v":"Schuckenbrock Simon"},{"$f":"'Übersicht Schützen'!B7","v":"Börger III"},{"$f":"'Übersicht Schützen'!C7","v":307.3},{"$f":"'Übersicht Schützen'!D7","v":306.9},{"$f":"'Übersicht Schützen'!E7","v":310.7},{"$f":"'Übersicht Schützen'!F7","v":306.3},{"$f":"'Übersicht Schützen'!G7","v":311.9},{"$f":"'Übersicht Schützen'!H7","v":311.9},{"$f":"'Übersicht Schützen'!I7","v":{"v":309.1666666666667,"d":"309.17"}},{"v":1855,"d":"1,855.0"},{"$f":"'Übersicht Schützen'!L7","v":311.4},{"$f":"'Übersicht Schützen'!M7","v":309.7},{"$f":"'Übersicht Schützen'!N7","v":312.4},{"$f":"'Übersicht Schützen'!O7","v":{"v":314,"d":"314.0"}},{"$f":"'Übersicht Schützen'!P7","v":313.2},{"$f":"'Übersicht Schützen'!Q7","v":{"v":0,"d":"0.0"}},311.88,{"v":1560.7,"d":"1,560.7"},{"$f":"'Übersicht Schützen'!U7","v":{"v":310.5181818181818,"d":"310.52"}},{"v":3415.7,"d":"3,415.7"},{"v":0,"d":"0.0"}]
[7,{"$f":"'Übersicht Schützen'!A8","v":"Witting Bernhard"},{"$f":"'Übersicht Schützen'!B8","v":"Neuvrees II"},{"$f":"'Übersicht Schützen'!C8","v":313.2},{"$f":"'Übersicht Schützen'!D8","v":314.3},{"$f":"'Übersicht Schützen'!E8","v":312.5},{"$f":"'Übersicht Schützen'!F8","v":309.8},{"$f":"'Übersicht Schützen'!G8","v":309.5},{"$f":"'Übersicht Schützen'!H8","v":308.2},{"$f":"'Übersicht Schützen'!I8","v":311.25},{"v":1867.5,"d":"1,867.5"},{"$f":"'Übersicht Schützen'!L8","v":306.4},{"$f":"'Übersicht Schützen'!M8","v":310.8},{"$f":"'Übersicht Schützen'!N8","v":307.4},{"$f":"'Übersicht Schützen'!O8","v":311.3},{"$f":"'Übersicht Schützen'!P8","v":{"v":312,"d":"312.0"}},{"$f":"'Übersicht Schützen'!Q8","v":{"v":0,"d":"0.0"}},{"$f":"IF(Formelhilfe!O15=0,0,'Übersicht Schützen'!R8)","v":{"v":309.58000000000004,"d":"309.58"}},{"v":1547.9,"d":"1,547.9"},{"$f":"'Übersicht Schützen'!U8","v":{"v":310.49090909090916,"d":"310.49"}},{"v":3415.4,"d":"3,415.4"},{"v":-0.29999999999972715,"d":"-0.3"}]
[8,{"$f":"'Übersicht Schützen'!A9","v":"Trempeck Marco"},{"$f":"'Übersicht Schützen'!B9","v":"Sögel II"},{"$f":"'Übersicht Schützen'!C9","v":308.1},{"$f":"'Übersicht Schützen'!D9","v":305.8},{"$f":"'Übersicht Schützen'!E9","v":311.4},{"$f":"'Übersicht Schützen'!F9","v":314.4},{"$f":"'Übersicht Schützen'!G9","v":{"v":313,"d":"313.0"}},{"$f":"'Übersicht Schützen'!H9","v":309.2},{"$f":"'Übersicht Schützen'!I9","v":{"v":310.31666666666666,"d":"310.32"}},{"v":1861.9,"d":"1,861.9"},{"$f":"'Übersicht Schützen'!L9","v":307.9},{"$f":"'Übersicht Schützen'!M9","v":311.4},{"$f":"'Übersicht Schützen'!N9","v":309.5},{"$f":"'Übersicht Schützen'!O9","v":311.1},{"$f":"'Übersicht Schützen'!P9","v":312.7},{"$f":"'Übersicht Schützen'!Q9","v":{"v":0,"d":"0.0"}},{"$f":"IF(Formelhilfe!O16=0,0,'Übersicht Schützen'!R9)","v":{"v":310.52000000000004,"d":"310.52"}},{"v":1552.6000000000001,"d":"1,552.6"},{"$f":"'Übersicht Schützen'!U9","v":{"v":310.40909090909093,"d":"310.41"}},{"v":3414.5,"d":"3,414.5"},{"v":-0.900000000000091,"d":"-0.9"}]
[9,{"$f":"'Übersicht Schützen'!A10","v":"Schrand Karl-Heinz"},{"$f":"'Übersicht Schützen'!B10","v":"Neuvrees II"},{"$f":"'Übersicht Schützen'!C10","v":308.4},{"$f":"'Übersicht Schützen'!D10","v":313.1},{"$f":"'Übersicht Schützen'!E10","v":307.1},{"$f":"'Übersicht Schützen'!F10","v":313.7},{"$f":"'Übersicht Schützen'!G10","v":311.7},{"$f":"'Übersicht Schützen'!H10","v":305.3},{"$f":"'Übersicht Schützen'!I10","v":{"v":309.8833333333333,"d":"309.88"}},{"v":1859.3,"d":"1,859.3"},{"$f":"'Übersicht Schützen'!L10","v":309.6},{"$f":"'Übersicht Schützen'!M10","v":308.9},{"$f":"'Übersicht Schützen'!N10","v":313.7},{"$f":"'Übersicht Schützen'!O10","v":{"v":312,"d":"312.0"}},{"$f":"'Übersicht Schützen'!P10","v":308.9},{"$f":"'Übersicht Schützen'!Q10","v":{"v":0,"d":"0.0"}},{"$f":"IF(Formelhilfe!O17=0,0,'Übersicht Schützen'!R10)","v":310.62},{"v":1553.1,"d":"1,553.1"},{"$f":"'Übersicht Schützen'!U10","v":{"v":310.21818181818185,"d":"310.22"}},{"v":3412.3999999999996,"d":"3,412.4"},{"v":-2.100000000000364,"d":"-2.1"}]
[10,{"$f":"'Übersicht Schützen'!A11","v":"Rolfes Willi"},{"$f":"'Übersicht Schützen'!B11","v":"Neuvrees I"},{"$f":"'Übersicht Schützen'!C11","v":310.6},{"$f":"'Übersicht Schützen'!D11","v":308.8},{"$f":"'Übersicht Schützen'!E11","v":308.1},{"$f":"'Übersicht Schützen'!F11","v":{"v":312,"d":"312.0"}},{"$f":"'Übersicht Schützen'!G11","v":309.5},{"$f":"'Übersicht Schützen'!H11","v":311.3},{"$f":"'Übersicht Schützen'!I11","v":310.05},{"v":1860.3,"d":"1,860.3"},{"$f":"'Übersicht Schützen'!L11","v":309.2},{"$f":"'Übersicht Schützen'!M11","v":311.8},{"$f":"'Übersicht Schützen'!N11","v":312.1},{"$f":"'Übersicht Schützen'!O11","v":309.3},{"$f":"'Übersicht Schützen'!P11","v":309.5},{"$f":"'Übersicht Schützen'!Q11","v":{"v":0,"d":"0.0"}},{"$f":"IF(Formelhilfe!O18=0,0,'Übersicht Schützen'!R11)","v":310.38},{"v":1551.9,"d":"1,551.9"},{"$f":"'Übersicht Schützen'!U11","v":{"v":310.20000000000005,"d":"310.20"}},{"v":3412.2,"d":"3,412.2"},{"v":-0.1999999999998181,"d":"-0.2"}]
[11,{"$f":"'Übersicht Schützen'!A12","v":"Breyer Wilfried"},{"$f":"'Übersicht Schützen'!B12","v":"Neuvrees I"},{"$f":"'Übersicht Schützen'!C12","v":308.9},{"$f":"'Übersicht Schützen'!D12","v":312.4},{"$f":"'Übersicht Schützen'!E12","v":310.9},{"$f":"'Übersicht Schützen'!F12","v":312.2},{"$f":"'Übersicht Schützen'!G12","v":309.2},{"$f":"'Übersicht Schützen'!H12","v":308.8},{"$f":"'Übersicht Schützen'!I12","v":{"v":310.4,"d":"310.40"}},{"v":1862.3999999999999,"d":"1,862.4"},{"$f":"'Übersicht Schützen'!L12","v":300.1},{"$f":"'Übersicht Schützen'!M12","v":314.8},{"$f":"'Übersicht Schützen'!N12","v":310.6},{"$f":"'Übersicht Schützen'!O12","v":308.6},{"$f":"'Übersicht Schützen'!P12","v":{"v":310,"d":"310.0"}},{"$f":"'Übersicht Schützen'!Q12","v":{"v":0,"d":"0.0"}},310.88,{"v":1544.1000000000001,"d":"1,544.1"},{"$f":"'Übersicht Schützen'!U12","v":{"v":309.6818181818182,"d":"309.68"}},{"v":3406.5,"d":"3,406.5"},{"v":-5.699999999999818,"d":"-5.7"}]
[12,{"$f":"'Übersicht Schützen'!A13","v":"Sebers Daniel"},{"$f":"'Übersicht Schützen'!B13","v":"Börger III"},{"$f":"'Übersicht Schützen'!C13","v":{"v":307,"d":"307.0"}},{"$f":"'Übersicht Schützen'!D13","v":306.6},{"$f":"'Übersicht Schützen'!E13","v":310.3},{"$f":"'Übersicht Schützen'!F13","v":311.2},{"$f":"'Übersicht Schützen'!G13","v":311.6},{"$f":"'Übersicht Schützen'!H13","v":314.6},{"$f":"'Übersicht Schützen'!I13","v":{"v":310.2166666666667,"d":"310.22"}},{"v":1861.3000000000002,"d":"1,861.3"},{"$f":"'Übersicht Schützen'!L13","v":309.8},{"$f":"'Übersicht Schützen'!M13","v":305.5},{"$f":"'Übersicht Schützen'!N13","v":310.2},{"$f":"'Übersicht Schützen'!O13","v":307.4},{"$f":"'Übersicht Schützen'!P13","v":310.5},{"$f":"'Übersicht Schützen'!Q13","v":{"v":0,"d":"0.0"}},309.32,{"v":1543.4,"d":"1,543.4"},{"$f":"'Übersicht Schützen'!U13","v":{"v":309.51818181818186,"d":"309.52"}},{"v":3404.7000000000003,"d":"3,404.7"},{"v":-1.7999999999997272,"d":"-1.8"}]
[13,{"$f":"'Übersicht Schützen'!A14","v":"Thunert  Dirk"},{"$f":"'Übersicht Schützen'!B14","v":"Neuvrees II"},{"$f":"'Übersicht Schützen'!C14","v":308.4},{"$f":"'Übersicht Schützen'!D14","v":309.6},{"$f":"'Übersicht Schützen'!E14","v":309.8},{"$f":"'Übersicht Schützen'!F14","v":307.4},{"$f":"'Übersicht Schützen'!G14","v":307.5},{"$f":"'Übersicht Schützen'!H14","v":306.6},{"$f":"'Übersicht Schützen'!I14","v":{"v":308.21666666666664,"d":"308.22"}},{"v":1849.2999999999997,"d":"1,849.3"},{"$f":"'Übersicht Schützen'!L14","v":308.8},{"$f":"'Übersicht Schützen'!M14","v":310.9},{"$f":"'Übersicht Schützen'!N14","v":311.4},{"$f":"'Übersicht Schützen'!O14","v":309.6},{"$f":"'Übersicht Schützen'!P14","v":{"v":305.70000000000005,"d":"305.7"}},{"$f":"'Übersicht Schützen'!Q14","v":{"v":0,"d":"0.0"}},{"$f":"IF(Formelhilfe!O21=0,0,'Übersicht Schützen'!R14)","v":{"v":309.28000000000003,"d":"309.28"}},{"v":1546.4,"d":"1,546.4"},{"$f":"'Übersicht Schützen'!U14","v":{"v":308.7,"d":"308.70"}},{"v":3395.7,"d":"3,395.7"},{"v":-9.000000000000455,"d":"-9.0"}]
[14,{"$f":"'Übersicht Schützen'!A15","v":"Meiners Bernd"},{"$f":"'Übersicht Schützen'!B15","v":"Ostenwalde I"},{"$f":"'Übersicht Schützen'!C15","v":310.5},{"$f":"'Übersicht Schützen'!D15","v":306.5},{"$f":"'Übersicht Schützen'!E15","v":305.3},{"$f":"'Übersicht Schützen'!F15","v":312.5},{"$f":"'Übersicht Schützen'!G15","v":307.4},{"$f":"'Übersicht Schützen'!H15","v":306.8},{"$f":"'Übersicht Schützen'!I15","v":{"v":308.16666666666663,"d":"308.17"}},{"v":1848.9999999999998,"d":"1,849.0"},{"$f":"'Übersicht Schützen'!L15","v":{"v":310,"d":"310.0"}},{"$f":"'Übersicht Schützen'!M15","v":303.9},{"$f":"'Übersicht Schützen'!N15","v":308.1},{"$f":"'Übersicht Schützen'!O15","v":309.6},{"$f":"'Übersicht Schützen'!P15","v":312.7},{"$f":"'Übersicht Schützen'!Q15","v":{"v":0,"d":"0.0"}},{"$f":"IF(Formelhilfe!O22=0,0,'Übersicht Schützen'!R15)","v":308.86},{"v":1544.3,"d":"1,544.3"},{"$f":"'Übersicht Schützen'!U15","v":{"v":308.48181818181814,"d":"308.48"}},{"v":3393.2999999999997,"d":"3,393.3"},{"v":-2.400000000000091,"d":"-2.4"}]
[15,{"$f":"'Übersicht Schützen'!A16","v":"Rode Bernd"},{"$f":"'Übersicht Schützen'!B16","v":"Börger III"},{"$f":"'Übersicht Schützen'!C16","v":308.4},{"$f":"'Übersicht Schützen'!D16","v":310.6},{"$f":"'Übersicht Schützen'!E16","v":311.2},{"$f":"'Übersicht Schützen'!F16","v":305.6},{"$f":"'Übersicht Schützen'!G16","v":306.9},{"$f":"'Übersicht Schützen'!H16","v":313.1},{"$f":"'Übersicht Schützen'!I16","v":{"v":309.3,"d":"309.30"}},{"v":1855.8000000000002,"d":"1,855.8"},{"$f":"'Übersicht Schützen'!L16","v":305.8},{"$f":"'Übersicht Schützen'!M16","v":306.9},{"$f":"'Übersicht Schützen'!N16","v":307.1},{"$f":"'Übersicht Schützen'!O16","v":306.1},{"$f":"'Übersicht Schützen'!P16","v":308.6},{"$f":"'Übersicht Schützen'!Q16","v":{"v":0,"d":"0.0"}},311.76,{"v":1534.5,"d":"1,534.5"},{"$f":"'Übersicht Schützen'!U16","v":{"v":308.20909090909095,"d":"308.21"}},{"v":3390.3,"d":"3,390.3"},{"v":-2.9999999999995453,"d":"-3.0"}]
[16,{"$f":"'Übersicht Schützen'!A17","v":"Meiners Martin"},{"$f":"'Übersicht Schützen'!B17","v":"Ostenwalde I"},{"$f":"'Übersicht Schützen'!C17","v":305.1},{"$f":"'Übersicht Schützen'!D17","v":312.8},{"$f":"'Übersicht Schützen'!E17","v":311.1},{"$f":"'Übersicht Schützen'!F17","v":308.4},{"$f":"'Übersicht Schützen'!G17","v":309.9},{"$f":"'Übersicht Schützen'!H17","v":308.1},{"$f":"'Übersicht Schützen'!I17","v":{"v":309.23333333333335,"d":"309.23"}},{"v":1855.4,"d":"1,855.4"},{"$f":"'Übersicht Schützen'!L17","v":307.1},{"$f":"'Übersicht Schützen'!M17","v":{"v":310,"d":"310.0"}},{"$f":"'Übersicht Schützen'!N17","v":302.2},{"$f":"'Übersicht Schützen'!O17","v":{"v":306,"d":"306.0"}},{"$f":"'Übersicht Schützen'!P17","v":{"v":308,"d":"308.0"}},{"$f":"'Übersicht Schützen'!Q17","v":{"v":0,"d":"0.0"}},{"$f":"IF(Formelhilfe!O24=0,0,'Übersicht Schützen'!R17)","v":{"v":306.65999999999997,"d":"306.66"}},{"v":1533.3,"d":"1,533.3"},{"$f":"'Übersicht Schützen'!U17","v":{"v":308.06363636363636,"d":"308.06"}},{"v":3388.7,"d":"3,388.7"},{"v":-1.6000000000003638,"d":"-1.6"}]
[17,{"$f":"'Übersicht Schützen'!A18","v":"Preut Hans"},{"$f":"'Übersicht Schützen'!B18","v":"Neuvrees II"},{"$f":"'Übersicht Schützen'!C18","v":312.1},{"$f":"'Übersicht Schützen'!D18","v":307.2},{"$f":"'Übersicht Schützen'!E18","v":304.3},{"$f":"'Übersicht Schützen'!F18","v":304.4},{"$f":"'Übersicht Schützen'!G18","v":306.1},{"$f":"'Übersicht Schützen'!H18","v":{"v":309,"d":"309.0"}},{"$f":"'Übersicht Schützen'!I18","v":{"v":307.18333333333334,"d":"307.18"}},{"v":1843.1,"d":"1,843.1"},{"$f":"'Übersicht Schützen'!L18","v":{"v":305,"d":"305.0"}},{"$f":"'Übersicht Schützen'!M18","v":309.2},{"$f":"'Übersicht Schützen'!N18","v":311.8},{"$f":"'Übersicht Schützen'!O18","v":311.1},{"$f":"'Übersicht Schützen'!P18","v":308.5},{"$f":"'Übersicht Schützen'!Q18","v":{"v":0,"d":"0.0"}},{"v":308.8,"d":"308.80"},{"v":1545.6,"d":"1,545.6"},{"$f":"'Übersicht Schützen'!U18","v":{"v":308.06363636363636,"d":"308.06"}},{"v":3388.7,"d":"3,388.7"},{"v":0,"d":"0.0"}]
[18,{"$f":"'Übersicht Schützen'!A19","v":"Janßen Markus"},{"$f":"'Übersicht Schützen'!B19","v":"Neuvrees I"},{"$f":"'Übersicht Schützen'!C19","v":305.7},{"$f":"'Übersicht Schützen'!D19","v":301.8},{"$f":"'Übersicht Schützen'!E19","v":303.2},{"$f":"'Übersicht Schützen'!F19","v":{"v":308,"d":"308.0"}},{"$f":"'Übersicht Schützen'!G19","v":306.1},{"$f":"'Übersicht Schützen'!H19","v":{"v":309,"d":"309.0"}},{"$f":"'Übersicht Schützen'!I19","v":{"v":305.6333333333334,"d":"305.63"}},{"v":1833.8000000000002,"d":"1,833.8"},{"$f":"'Übersicht Schützen'!L19","v":305.6},{"$f":"'Übersicht Schützen'!M19","v":{"v":313,"d":"313.0"}},{"$f":"'Übersicht Schützen'!N19","v":310.3},{"$f":"'Übersicht Schützen'!O19","v":311.7},{"$f":"'Übersicht Schützen'!P19","v":309.9},{"$f":"'Übersicht Schützen'!Q19","v":{"v":0,"d":"0.0"}},306.88,{"v":1550.5,"d":"1,550.5"},{"$f":"'Übersicht Schützen'!U19","v":{"v":307.6636363636364,"d":"307.66"}},{"v":3384.3,"d":"3,384.3"},{"v":-4.399999999999636,"d":"-4.4"}]
[19,{"$f":"'Übersicht Schützen'!A20","v":"Szczepanski Holger"},{"$f":"'Übersicht Schützen'!B20","v":"Neuvrees II"},{"$f":"'Übersicht Schützen'!C20","v":308.2},{"$f":"'Übersicht Schützen'!D20","v":{"v":306,"d":"306.0"}},{"$f":"'Übersicht Schützen'!E20","v":308.7},{"$f":"'Übersicht Schützen'!F20","v":306.2},{"$f":"'Übersicht Schützen'!G20","v":311.1},{"$f":"'Übersicht Schützen'!H20","v":306.7},{"$f":"'Übersicht Schützen'!I20","v":{"v":307.8166666666667,"d":"307.82"}},{"v":1846.9000000000003,"d":"1,846.9"},{"$f":"'Übersicht Schützen'!L20","v":306.8},{"$f":"'Übersicht Schützen'!M20","v":307.7},{"$f":"'Übersicht Schützen'!N20","v":305.2},{"$f":"'Übersicht Schützen'!O20","v":309.7},{"$f":"'Übersicht Schützen'!P20","v":304.3},{"$f":"'Übersicht Schützen'!Q20","v":{"v":0,"d":"0.0"}},{"$f":"IF(Formelhilfe!O27=0,0,'Übersicht Schützen'!R20)","v":306.74},{"v":1533.7,"d":"1,533.7"},{"$f":"'Übersicht Schützen'!U20","v":{"v":307.3272727272727,"d":"307.33"}},{"v":3380.6000000000004,"d":"3,380.6"},{"v":-3.699999999999818,"d":"-3.7"}]
[20,{"$f":"'Übersicht Schützen'!A21","v":"Schroer Jürgen"},{"$f":"'Übersicht Schützen'!B21","v":"Börger III"},{"$f":"'Übersicht Schützen'!C21","v":306.7},{"$f":"'Übersicht Schützen'!D21","v":307.7},{"$f":"'Übersicht Schützen'!E21","v":307.8},{"$f":"'Übersicht Schützen'!F21","v":307.4},{"$f":"'Übersicht Schützen'!G21","v":303.1},{"$f":"'Übersicht Schützen'!H21","v":307.1},{"$f":"'Übersicht Schützen'!I21","v":{"v":306.63333333333327,"d":"306.63"}},{"v":1839.7999999999997,"d":"1,839.8"},{"$f":"'Übersicht Schützen'!L21","v":306.5},{"$f":"'Übersicht Schützen'!M21","v":308.8},{"$f":"'Übersicht Schützen'!N21","v":305.5},{"$f":"'Übersicht Schützen'!O21","v":303.6},{"$f":"'Übersicht Schützen'!P21","v":{"v":304.20000000000005,"d":"304.2"}},{"$f":"'Übersicht Schützen'!Q21","v":{"v":0,"d":"0.0"}},{"$f":"IF(Formelhilfe!O28=0,0,'Übersicht Schützen'!R21)","v":305.72},{"v":1528.6000000000001,"d":"1,528.6"},{"$f":"'Übersicht Schützen'!U21","v":{"v":306.2181818181818,"d":"306.22"}},{"v":3368.3999999999996,"d":"3,368.4"},{"v":-12.200000000000728,"d":"-12.2"}]
[21,{"$f":"'Übersicht Schützen'!A22","v":"Bunten Manfred"},{"$f":"'Übersicht Schützen'!B22","v":"Ostenwalde I"},{"$f":"'Übersicht Schützen'!C22","v":306.8},{"$f":"'Übersicht Schützen'!D22","v":309.7},{"$f":"'Übersicht Schützen'!E22","v":{"v":307,"d":"307.0"}},{"$f":"'Übersicht Schützen'!F22","v":302.3},{"$f":"'Übersicht Schützen'!G22","v":305.7},{"$f":"'Übersicht Schützen'!H22","v":304.6},{"$f":"'Übersicht Schützen'!I22","v":{"v":306.01666666666665,"d":"306.02"}},{"v":1836.1,"d":"1,836.1"},{"$f":"'Übersicht Schützen'!L22","v":{"v":308,"d":"308.0"}},{"$f":"'Übersicht Schützen'!M22","v":307.3},{"$f":"'Übersicht Schützen'!N22","v":302.6},{"$f":"'Übersicht Schützen'!O22","v":304.3},{"$f":"'Übersicht Schützen'!P22","v":304.3},{"$f":"'Übersicht Schützen'!Q22","v":{"v":0,"d":"0.0"}},{"$f":"IF(Formelhilfe!O29=0,0,'Übersicht Schützen'!R22)","v":{"v":305.3,"d":"305.30"}},{"v":1526.5,"d":"1,526.5"},{"$f":"'Übersicht Schützen'!U22","v":{"v":305.69090909090914,"d":"305.69"}},{"v":3362.6,"d":"3,362.6"},{"v":-5.799999999999727,"d":"-5.8"}]
[22,{"$f":"'Übersicht Schützen'!A23","v":"Hömmen Bernd"},{"$f":"'Übersicht Schützen'!B23","v":"Breddenberg IV"},{"$f":"'Übersicht Schützen'!C23","v":{"v":306,"d":"306.0"}},{"$f":"'Übersicht Schützen'!D23","v":305.2},{"$f":"'Übersicht Schützen'!E23","v":302.1},{"$f":"'Übersicht Schützen'!F23","v":302.6},{"$f":"'Übersicht Schützen'!G23","v":301.3},{"$f":"'Übersicht Schützen'!H23","v":305.9},{"$f":"'Übersicht Schützen'!I23","v":{"v":303.84999999999997,"d":"303.85"}},{"v":1823.1,"d":"1,823.1"},{"$f":"'Übersicht Schützen'!L23","v":308.4},{"$f":"'Übersicht Schützen'!M23","v":309.9},{"$f":"'Übersicht Schützen'!N23","v":299.3},{"$f":"'Übersicht Schützen'!O23","v":{"v":306,"d":"306.0"}},{"$f":"'Übersicht Schützen'!P23","v":300.8},{"$f":"'Übersicht Schützen'!Q23","v":{"v":0,"d":"0.0"}},{"$f":"IF(Formelhilfe!O30=0,0,'Übersicht Schützen'!R23)","v":304.88},{"v":1524.3999999999999,"d":"1,524.4"},{"$f":"'Übersicht Schützen'!U23","v":{"v":304.31818181818187,"d":"304.32"}},{"v":3347.5,"d":"3,347.5"},{"v":-15.099999999999909,"d":"-15.1"}]
[23,{"$f":"'Übersicht Schützen'!A24","v":"Thyen Werner"},{"$f":"'Übersicht Schützen'!B24","v":"Neuvrees I"},{"$f":"'Übersicht Schützen'!C24","v":304.2},{"$f":"'Übersicht Schützen'!D24","v":297.7},{"$f":"'Übersicht Schützen'!E24","v":305.6},{"$f":"'Übersicht Schützen'!F24","v":309.1},{"$f":"'Übersicht Schützen'!G24","v":303.3},{"$f":"'Übersicht Schützen'!H24","v":300.9},{"$f":"'Übersicht Schützen'!I24","v":{"v":303.46666666666664,"d":"303.47"}},{"v":1820.7999999999997,"d":"1,820.8"},{"$f":"'Übersicht Schützen'!L24","v":304.7},{"$f":"'Übersicht Schützen'!M24","v":304.5},{"$f":"'Übersicht Schützen'!N24","v":304.9},{"$f":"'Übersicht Schützen'!O24","v":307.2},{"$f":"'Übersicht Schützen'!P24","v":{"v":305,"d":"305.0"}},{"$f":"'Übersicht Schützen'!Q24","v":{"v":0,"d":"0.0"}},{"v":304.7,"d":"304.70"},{"v":1526.3,"d":"1,526.3"},{"$f":"'Übersicht Schützen'!U24","v":{"v":304.28181818181815,"d":"304.28"}},{"v":3347.0999999999995,"d":"3,347.1"},{"v":-0.4000000000005457,"d":"-0.4"}]
[24,{"$f":"'Übersicht Schützen'!A25","v":"Husmann Michael"},{"$f":"'Übersicht Schützen'!B25","v":"Sögel II"},{"$f":"'Übersicht Schützen'!C25","v":290.4},{"$f":"'Übersicht Schützen'!D25","v":305.1},{"$f":"'Übersicht Schützen'!E25","v":296.5},{"$f":"'Übersicht Schützen'!F25","v":305.5},{"$f":"'Übersicht Schützen'!G25","v":301.9},{"$f":"'Übersicht Schützen'!H25","v":302.7},{"$f":"'Übersicht Schützen'!I25","v":300.35},{"v":1802.1000000000001,"d":"1,802.1"},{"$f":"'Übersicht Schützen'!L25","v":305.9},{"$f":"'Übersicht Schützen'!M25","v":305.2},{"$f":"'Übersicht Schützen'!N25","v":307.9},{"$f":"'Übersicht Schützen'!O25","v":307.3},{"$f":"'Übersicht Schützen'!P25","v":{"v":303.79999999999995,"d":"303.8"}},{"$f":"'Übersicht Schützen'!Q25","v":{"v":0,"d":"0.0"}},306.33,{"v":1530.1,"d":"1,530.1"},{"$f":"'Übersicht Schützen'!U25","v":{"v":302.92727272727274,"d":"302.93"}},{"v":3332.2,"d":"3,332.2"},{"v":-14.899999999999636,"d":"-14.9"}]
[25,{"$f":"'Übersicht Schützen'!A26","v":"Jansen  Martin"},{"$f":"'Übersicht Schützen'!B26","v":"Breddenberg IV"},{"$f":"'Übersicht Schützen'!C26","v":300.3},{"$f":"'Übersicht Schützen'!D26","v":302.4},{"$f":"'Übersicht Schützen'!E26","v":293.3},{"$f":"'Übersicht Schützen'!F26","v":302.6},{"$f":"'Übersicht Schützen'!G26","v":304.7},{"$f":"'Übersicht Schützen'!H26","v":300.2},{"$f":"'Übersicht Schützen'!I26","v":{"v":300.5833333333333,"d":"300.58"}},{"v":1803.5,"d":"1,803.5"},{"$f":"'Übersicht Schützen'!L26","v":307.8},{"$f":"'Übersicht Schützen'!M26","v":302.7},{"$f":"'Übersicht Schützen'!N26","v":299.2},{"$f":"'Übersicht Schützen'!O26","v":307.1},{"$f":"'Übersicht Schützen'!P26","v":294.6},{"$f":"'Übersicht Schützen'!Q26","v":{"v":0,"d":"0.0"}},{"$f":"IF(Formelhilfe!O33=0,0,'Übersicht Schützen'!R26)","v":{"v":302.28000000000003,"d":"302.28"}},{"v":1511.4,"d":"1,511.4"},{"$f":"'Übersicht Schützen'!U26","v":{"v":301.3545454545454,"d":"301.35"}},{"v":3314.9,"d":"3,314.9"},{"v":-17.299999999999727,"d":"-17.3"}]
[26,{"$f":"'Übersicht Schützen'!A27","v":"Hanekamp Rudi"},{"$f":"'Übersicht Schützen'!B27","v":"Breddenberg IV"},{"$f":"'Übersicht Schützen'!C27","v":294.8},{"$f":"'Übersicht Schützen'!D27","v":299.2},{"$f":"'Übersicht Schützen'!E27","v":301.7},{"$f":"'Übersicht Schützen'!F27","v":{"v":304,"d":"304.0"}},{"$f":"'Übersicht Schützen'!G27","v":291.9},{"$f":"'Übersicht Schützen'!H27","v":305.5},{"$f":"'Übersicht Schützen'!I27","v":{"v":299.51666666666665,"d":"299.52"}},{"v":1797.1,"d":"1,797.1"},{"$f":"'Übersicht Schützen'!L27","v":299.4},{"$f":"'Übersicht Schützen'!M27","v":301.9},{"$f":"'Übersicht Schützen'!N27","v":299.6},{"$f":"'Übersicht Schützen'!O27","v":309.6},{"$f":"'Übersicht Schützen'!P27","v":306.1},{"$f":"'Übersicht Schützen'!Q27","v":{"v":0,"d":"0.0"}},{"$f":"IF(Formelhilfe!O34=0,0,'Übersicht Schützen'!R27)","v":303.32},{"v":1516.6,"d":"1,516.6"},{"$f":"'Übersicht Schützen'!U27","v":{"v":301.24545454545455,"d":"301.25"}},{"v":3313.7,"d":"3,313.7"},{"v":-1.2000000000002728,"d":"-1.2"}]
[27,{"$f":"'Übersicht Schützen'!A28","v":"Benten Helmut"},{"$f":"'Übersicht Schützen'!B28","v":"Ostenwalde I"},{"$f":"'Übersicht Schützen'!C28","v":301.3},{"$f":"'Übersicht Schützen'!D28","v":295.6},{"$f":"'Übersicht Schützen'!E28","v":299.1},{"$f":"'Übersicht Schützen'!F28","v":297.6},{"$f":"'Übersicht Schützen'!G28","v":299.7},{"$f":"'Übersicht Schützen'!H28","v":307.3},{"$f":"'Übersicht Schützen'!I28","v":{"v":300.1,"d":"300.10"}},{"v":1800.6000000000001,"d":"1,800.6"},{"$f":"'Übersicht Schützen'!L28","v":295.9},{"$f":"'Übersicht Schützen'!M28","v":303.6},{"$f":"'Übersicht Schützen'!N28","v":296.8},{"$f":"'Übersicht Schützen'!O28","v":301.3},{"$f":"'Übersicht Schützen'!P28","v":{"v":300,"d":"300.0"}},{"$f":"'Übersicht Schützen'!Q28","v":{"v":0,"d":"0.0"}},{"$f":"IF(Formelhilfe!O35=0,0,'Übersicht Schützen'!R28)","v":299.52},{"v":1497.6,"d":"1,497.6"},{"$f":"'Übersicht Schützen'!U28","v":{"v":299.83636363636367,"d":"299.84"}},{"v":3298.2,"d":"3,298.2"},-15.5]
[28,{"$f":"'Übersicht Schützen'!A29","v":"Steenken Klaus"},{"$f":"'Übersicht Schützen'!B29","v":"Neuvrees I"},{"$f":"'Übersicht Schützen'!C29","v":310.8},{"$f":"'Übersicht Schützen'!D29","v":{"v":308,"d":"308.0"}},{"$f":"'Übersicht Schützen'!E29","v":307.4},{"$f":"'Übersicht Schützen'!F29","v":310.3},{"$f":"'Übersicht Schützen'!G29","v":{"v":0,"d":"0.0"}},{"$f":"'Übersicht Schützen'!H29","v":{"v":0,"d":"0.0"}},{"$f":"'Übersicht Schützen'!I29","v":{"v":309.125,"d":"309.13"}},{"v":1236.5,"d":"1,236.5"},{"$f":"'Übersicht Schützen'!L29","v":{"v":0,"d":"0.0"}},{"$f":"'Übersicht Schützen'!M29","v":{"v":0,"d":"0.0"}},{"$f":"'Übersicht Schützen'!N29","v":{"v":0,"d":"0.0"}},{"$f":"'Übersicht Schützen'!O29","v":{"v":0,"d":"0.0"}},{"$f":"'Übersicht Schützen'!P29","v":{"v":0,"d":"0.0"}},{"$f":"'Übersicht Schützen'!Q29","v":{"v":0,"d":"0.0"}},{"v":0,"d":"0.00"},{"v":0,"d":"0.0"},{"$f":"'Übersicht Schützen'!U29","v":{"v":309.125,"d":"309.13"}},{"v":1236.5,"d":"1,236.5"},{"v":-2061.7,"d":"-2,061.7"}]
[29,{"$f":"'Übersicht Schützen'!A30","v":"Schütze 6"},{"$f":"'Übersicht Schützen'!B30","v":"Sögel II"},{"$f":"'Übersicht Schützen'!C30","v":{"v":0,"d":"0.0"}},{"$f":"'Übersicht Schützen'!D30","v":{"v":0,"d":"0.0"}},{"$f":"'Übersicht Schützen'!E30","v":{"v":0,"d":"0.0"}},{"$f":"'Übersicht Schützen'!F30","v":{"v":0,"d":"0.0"}},{"$f":"'Übersicht Schützen'!G30","v":{"v":0,"d":"0.0"}},{"$f":"'Übersicht Schützen'!H30","v":{"v":0,"d":"0.0"}},{"v":0,"d":"0.00"},{"v":0,"d":"0.0"},{"$f":"'Übersicht Schützen'!L30","v":{"v":0,"d":"0.0"}},{"$f":"'Übersicht Schützen'!M30","v":{"v":0,"d":"0.0"}},{"$f":"'Übersicht Schützen'!N30","v":{"v":0,"d":"0.0"}},{"$f":"'Übersicht Schützen'!O30","v":{"v":0,"d":"0.0"}},{"$f":"'Übersicht Schützen'!P30","v":{"v":0,"d":"0.0"}},{"$f":"'Übersicht Schützen'!Q30","v":{"v":0,"d":"0.0"}},{"v":0,"d":"0.00"},{"v":0,"d":"0.0"},{"v":0,"d":"0.00"},{"v":0,"d":"0.0"},{"v":0,"d":"0.0"}]
[30,{"$f":"'Übersicht Schützen'!A31","v":"Schütze 11"},{"$f":"'Übersicht Schützen'!B31","v":"Ostenwalde I"},{"$f":"'Übersicht Schützen'!C31","v":{"v":0,"d":"0.0"}},{"$f":"'Übersicht Schützen'!D31","v":{"v":0,"d":"0.0"}},{"$f":"'Übersicht Schützen'!E31","v":{"v":0,"d":"0.0"}},{"$f":"'Übersicht Schützen'!F31","v":{"v":0,"d":"0.0"}},{"$f":"'Übersicht Schützen'!G31","v":{"v":0,"d":"0.0"}},{"$f":"'Übersicht Schützen'!H31","v":{"v":0,"d":"0.0"}},{"v":0,"d":"0.00"},{"v":0,"d":"0.0"},{"$f":"'Übersicht Schützen'!L31","v":{"v":0,"d":"0.0"}},{"$f":"'Übersicht Schützen'!M31","v":{"v":0,"d":"0.0"}},{"$f":"'Übersicht Schützen'!N31","v":{"v":0,"d":"0.0"}},{"$f":"'Übersicht Schützen'!O31","v":{"v":0,"d":"0.0"}},{"$f":"'Übersicht Schützen'!P31","v":{"v":0,"d":"0.0"}},{"$f":"'Übersicht Schützen'!Q31","v":{"v":0,"d":"0.0"}},{"$f":"IF(Formelhilfe!O38=0,0,'Übersicht Schützen'!R31)","v":{"v":0,"d":"0.00"}},{"v":0,"d":"0.0"},{"v":0,"d":"0.00"},{"v":0,"d":"0.0"},{"v":0,"d":"0.0"}]
[31,{"$f":"'Übersicht Schützen'!A32","v":"Schütze 12"},{"$f":"'Übersicht Schützen'!B32","v":"Ostenwalde I"},{"$f":"'Übersicht Schützen'!C32","v":{"v":0,"d":"0.0"}},{"$f":"'Übersicht Schützen'!D32","v":{"v":0,"d":"0.0"}},{"$f":"'Übersicht Schützen'!E32","v":{"v":0,"d":"0.0"}},{"$f":"'Übersicht Schützen'!F32","v":{"v":0,"d":"0.0"}},{"$f":"'Übersicht Schützen'!G32","v":{"v":0,"d":"0.0"}},{"$f":"'Übersicht Schützen'!H32","v":{"v":0,"d":"0.0"}},{"v":0,"d":"0.00"},{"v":0,"d":"0.0"},{"$f":"'Übersicht Schützen'!L32","v":{"v":0,"d":"0.0"}},{"$f":"'Übersicht Schützen'!M32","v":{"v":0,"d":"0.0"}},{"$f":"'Übersicht Schützen'!N32","v":{"v":0,"d":"0.0"}},{"$f":"'Übersicht Schützen'!O32","v":{"v":0,"d":"0.0"}},{"$f":"'Übersicht Schützen'!P32","v":{"v":0,"d":"0.0"}},{"$f":"'Übersicht Schützen'!Q32","v":{"v":0,"d":"0.0"}},{"v":0,"d":"0.00"},{"v":0,"d":"0.0"},{"v":0,"d":"0.00"},{"v":0,"d":"0.0"},{"$f":"(U46-U47)*-1","v":{"v":0,"d":"0.0"}}]
[32,{"$f":"'Übersicht Schützen'!A33","v":"Schütze 18"},{"$f":"'Übersicht Schützen'!B33","v":"Neuvrees II"},{"$f":"'Übersicht Schützen'!C33","v":{"v":0,"d":"0.0"}},{"$f":"'Übersicht Schützen'!D33","v":{"v":0,"d":"0.0"}},{"$f":"'Übersicht Schützen'!E33","v":{"v":0,"d":"0.0"}},{"$f":"'Übersicht Schützen'!F33","v":{"v":0,"d":"0.0"}},{"$f":"'Übersicht Schützen'!G33","v":{"v":0,"d":"0.0"}},{"$f":"'Übersicht Schützen'!H33","v":{"v":0,"d":"0.0"}},{"v":0,"d":"0.00"},{"v":0,"d":"0.0"},{"$f":"'Übersicht Schützen'!L33","v":{"v":0,"d":"0.0"}},{"$f":"'Übersicht Schützen'!M33","v":{"v":0,"d":"0.0"}},{"$f":"'Übersicht Schützen'!N33","v":{"v":0,"d":"0.0"}},{"$f":"'Übersicht Schützen'!O33","v":{"v":0,"d":"0.0"}},{"$f":"'Übersicht Schützen'!P33","v":{"v":0,"d":"0.0"}},{"$f":"'Übersicht Schützen'!Q33","v":{"v":0,"d":"0.0"}},{"v":0,"d":"0.00"},{"v":0,"d":"0.0"},{"v":0,"d":"0.00"},{"v":0,"d":"0.0"},{"v":0,"d":"0.0"}]
[33,{"$f":"'Übersicht Schützen'!A34","v":"Schütze 23"},{"$f":"'Übersicht Schützen'!B34","v":"Breddenberg IV"},{"$f":"'Übersicht Schützen'!C34","v":{"v":0,"d":"0.0"}},{"$f":"'Übersicht Schützen'!D34","v":{"v":0,"d":"0.0"}},{"$f":"'Übersicht Schützen'!E34","v":{"v":0,"d":"0.0"}},{"$f":"'Übersicht Schützen'!F34","v":{"v":0,"d":"0.0"}},{"$f":"'Übersicht Schützen'!G34","v":{"v":0,"d":"0.0"}},{"$f":"'Übersicht Schützen'!H34","v":{"v":0,"d":"0.0"}},{"v":0,"d":"0.00"},{"v":0,"d":"0.0"},{"$f":"'Übersicht Schützen'!L34","v":{"v":0,"d":"0.0"}},{"$f":"'Übersicht Schützen'!M34","v":{"v":0,"d":"0.0"}},{"$f":"'Übersicht Schützen'!N34","v":{"v":0,"d":"0.0"}},{"$f":"'Übersicht Schützen'!O34","v":{"v":0,"d":"0.0"}},{"$f":"'Übersicht Schützen'!P34","v":{"v":0,"d":"0.0"}},{"$f":"'Übersicht Schützen'!Q34","v":{"v":0,"d":"0.0"}},{"v":0,"d":"0.00"},{"v":0,"d":"0.0"},{"v":0,"d":"0.00"},{"v":0,"d":"0.0"},{"v":0,"d":"0.0"}]
[34,{"$f":"'Übersicht Schützen'!A35","v":"Schütze 24"},{"$f":"'Übersicht Schützen'!B35","v":"Breddenberg IV"},{"$f":"'Übersicht Schützen'!C35","v":{"v":0,"d":"0.0"}},{"$f":"'Übersicht Schützen'!D35","v":{"v":0,"d":"0.0"}},{"$f":"'Übersicht Schützen'!E35","v":{"v":0,"d":"0.0"}},{"$f":"'Übersicht Schützen'!F35","v":{"v":0,"d":"0.0"}},{"$f":"'Übersicht Schützen'!G35","v":{"v":0,"d":"0.0"}},{"$f":"'Übersicht Schützen'!H35","v":{"v":0,"d":"0.0"}},{"v":0,"d":"0.00"},{"v":0,"d":"0.0"},{"$f":"'Übersicht Schützen'!L35","v":{"v":0,"d":"0.0"}},{"$f":"'Übersicht Schützen'!M35","v":{"v":0,"d":"0.0"}},{"$f":"'Übersicht Schützen'!N35","v":{"v":0,"d":"0.0"}},{"$f":"'Übersicht Schützen'!O35","v":{"v":0,"d":"0.0"}},{"$f":"'Übersicht Schützen'!P35","v":{"v":0,"d":"0.0"}},{"$f":"'Übersicht Schützen'!Q35","v":{"v":0,"d":"0.0"}},{"$f":"IF(Formelhilfe!O42=0,0,'Übersicht Schützen'!R35)","v":{"$error":"#DIV/0!"}},{"v":0,"d":"0.0"},{"v":0,"d":"0.00"},{"v":0,"d":"0.0"},{"v":0,"d":"0.0"}]
[35,{"$f":"'Übersicht Schützen'!A36","v":"Schütze 30"},{"$f":"'Übersicht Schützen'!B36","v":"Neuvrees I"},{"$f":"'Übersicht Schützen'!C36","v":{"v":0,"d":"0.0"}},{"$f":"'Übersicht Schützen'!D36","v":{"v":0,"d":"0.0"}},{"$f":"'Übersicht Schützen'!E36","v":{"v":0,"d":"0.0"}},{"$f":"'Übersicht Schützen'!F36","v":{"v":0,"d":"0.0"}},{"$f":"'Übersicht Schützen'!G36","v":{"v":0,"d":"0.0"}},{"$f":"'Übersicht Schützen'!H36","v":{"v":0,"d":"0.0"}},{"v":0,"d":"0.00"},{"v":0,"d":"0.0"},{"$f":"'Übersicht Schützen'!L36","v":{"v":0,"d":"0.0"}},{"$f":"'Übersicht Schützen'!M36","v":{"v":0,"d":"0.0"}},{"$f":"'Übersicht Schützen'!N36","v":{"v":0,"d":"0.0"}},{"$f":"'Übersicht Schützen'!O36","v":{"v":0,"d":"0.0"}},{"$f":"'Übersicht Schützen'!P36","v":{"v":0,"d":"0.0"}},{"$f":"'Übersicht Schützen'!Q36","v":{"v":0,"d":"0.0"}},{"v":0,"d":"0.00"},{"v":0,"d":"0.0"},{"v":0,"d":"0.00"},{"v":0,"d":"0.0"},{"$f":"(U50-U51)*-1","v":{"v":0,"d":"0.0"}}]
[36,{"$f":"'Übersicht Schützen'!A37","v":"Schütze 36"},{"$f":"'Übersicht Schützen'!B37","v":"Börger III"},{"$f":"'Übersicht Schützen'!C37","v":{"v":0,"d":"0.0"}},{"$f":"'Übersicht Schützen'!D37","v":{"v":0,"d":"0.0"}},{"$f":"'Übersicht Schützen'!E37","v":{"v":0,"d":"0.0"}},{"$f":"'Übersicht Schützen'!F37","v":{"v":0,"d":"0.0"}},{"$f":"'Übersicht Schützen'!G37","v":{"v":0,"d":"0.0"}},{"$f":"'Übersicht Schützen'!H37","v":{"v":0,"d":"0.0"}},{"v":0,"d":"0.00"},{"v":0,"d":"0.0"},{"$f":"'Übersicht Schützen'!L37","v":{"v":0,"d":"0.0"}},{"$f":"'Übersicht Schützen'!M37","v":{"v":0,"d":"0.0"}},{"$f":"'Übersicht Schützen'!N37","v":{"v":0,"d":"0.0"}},{"$f":"'Übersicht Schützen'!O37","v":{"v":0,"d":"0.0"}},{"$f":"'Übersicht Schützen'!P37","v":{"v":0,"d":"0.0"}},{"$f":"'Übersicht Schützen'!Q37","v":{"v":0,"d":"0.0"}},{"v":0,"d":"0.00"},{"v":0,"d":"0.0"},{"v":0,"d":"0.00"},{"v":0,"d":"0.0"},{"v":0,"d":"0.0"}]
[]
[null,null,"Schnitt:",{"$f":"SUM(D17:D52)/Formelhilfe!B45","v":{"v":306.89285714285717,"d":"306.9"}},{"$f":"SUM(E17:E52)/Formelhilfe!C45","v":{"v":307.5785714285715,"d":"307.6"}},{"$f":"SUM(F17:F52)/Formelhilfe!D45","v":{"v":307.30000000000007,"d":"307.3"}},{"$f":"SUM(G17:G52)/Formelhilfe!E45","v":{"v":308.2642857142857,"d":"308.3"}},{"$f":"SUM(H17:H52)/Formelhilfe!F45","v":{"v":307.4259259259259,"d":"307.4"}},{"$f":"SUM(I17:I52)/Formelhilfe!G45","v":{"v":308.19259259259263,"d":"308.2"}},{"$f":"AVERAGE(J17:J52)","v":{"v":239.2636574074074,"d":"239.26"}},{"$f":"AVERAGE(K17:K52)","v":{"v":1418.4083333333333,"d":"1418.41"}},{"$f":"SUM(L17:L52)/Formelhilfe!I45","v":{"v":307.81481481481484,"d":"307.8"}},{"$f":"SUM(M17:M52)/Formelhilfe!J45","v":{"v":308.6592592592592,"d":"308.7"}},{"$f":"SUM(N17:N52)/Formelhilfe!K45","v":{"v":307.6666666666667,"d":"307.7"}},{"$f":"SUM(O17:O52)/Formelhilfe!L45","v":{"v":308.82962962962966,"d":"308.8"}},{"$f":"SUM(P17:P52)/Formelhilfe!M45","v":{"v":308.0444444444445,"d":"308.0"}},{"$f":"SUM(Q17:Q52)/Formelhilfe!N45","v":{"$error":"#DIV/0!"}},{"$f":"AVERAGE(R17:R52)","v":{"$error":"#DIV/0!"}},{"$f":"AVERAGE(S17:S52)","v":{"v":1155.7611111111112,"d":"1155.76"}},{"$f":"AVERAGE(T17:T52)","v":{"v":239.4797348484849,"d":"239.48"}},{"$f":"(K54+S54)","v":{"v":2574.1694444444447,"d":"2,574.17 "}}]

{"sheet":"Wettkampf 1","index":1,"n_rows":47,"n_cols":29,"rows_kept":47,"merged":[[0,24,0,25],[1,24,1,25],[4,24,4,25],[5,24,5,25],[6,24,6,25],[8,22,8,25]]}
[null,"Verein / Gruppe",null,"Ergebnisse",{"$nulls":19},"Austragungsort:",{"$f":"Übersicht!D4","v":"Sögel "}]
[1,"Sögel II",null,{"$f":"G46","v":932.8},{"$f":"IF(H46>4,\"Es sind zu viele Schützen in Wertung!\",\" \")","v":" "},{"$nulls":18},"Wettkampftag:",{"$f":"Übersicht!D3","v":"11.09."}]
[2,"Ostenwalde I",null,{"$f":"I46","v":922.4},{"$f":"IF(J46>4,\"Es sind zu viele Schützen in Wertung!\",\" \")","v":" "}]
[3,"Neuvrees II",null,{"$f":"K46","v":{"v":933.6999999999999,"d":"933.7"}},{"$f":"IF(L46>4,\"Es sind zu viele Schützen in Wertung!\",\" \")","v":" "},{"$nulls":20},"Ansprechpartner für Rückfragen:"]
[4,"Breddenberg IV",null,{"$f":"M46","v":915.7},{"$f":"IF(N46>4,\"Es sind zu viele Schützen in Wertung!\",\" \")","v":" "},{"$nulls":18},"Name:"]
[5,"Neuvrees I",null,{"$f":"O46","v":{"v":930.3000000000001,"d":"930.3"}},{"$f":"IF(P46>4,\"Es sind zu viele Schützen in Wertung!\",\" \")","v":" "},{"$nulls":18},"Tel:"]
[6,"Börger III",null,{"$f":"Q46","v":923.3},{"$f":"IF(R46>4,\"Es sind zu viele Schützen in Wertung!\",\" \")","v":" "},{"$nulls":18},"Standaufsicht:","eintragen"]
[]
[null,"Einzelergebnisse:","Verein/Gruppe (per Dropdown-Feld einzutragen)","Ergebnisse","AW? Dann x eintippen",null,"Verein 1",null,"Verein 2",null,"Verein 3",null,"Verein 4",null,"Verein 5",null,"Verein 6",{"$nulls":3},"Geburtsdatum",null,"Proberechnung bei Streifen:"]
[1,"Grünloh Michael","Sögel II",313.1,null,{"$f":"IF(E10=\"x\",\"0\",D10)","v":313.1},{"$f":"IF(C10=$B$2,F10,0)","v":313.1},{"$f":"(IF(AND($E10=\"\",$C10=$B$2),1,0))","v":1},{"$f":"IF($C10=$B$3,F10,0)","v":0},{"$f":"(IF(AND($E10=\"\",$C10=$B$3),1,0))","v":0},{"$f":"IF($C10=$B$4,F10,0)","v":0},{"$f":"(IF(AND($E10=\"\",$C10=$B$4),1,0))","v":0},{"$f":"IF($C10=$B$5,F10,0)","v":0},{"$f":"(IF(AND($E10=\"\",$C10=$B$5),1,0))","v":0},{"$f":"IF($C10=$B$6,F10,0)","v":0},{"$f":"(IF(AND($E10=\"\",$C10=$B$6),1,0))","v":0},{"$f":"IF($C10=$B$7,F10,0)","v":0},{"$f":"(IF(AND($E10=\"\",$C10=$B$7),1,0))","v":0},{"$nulls":7},{"$f":"W10+X10+Y10","v":{"v":0,"d":"0.0"}},{"$f":"IF(Z10=D10,1,0)","v":0},{"$f":"IF(Z10=0,0,1)","v":0},{"$f":"IF(AA10+AB10=2,\"Korrekt\",\"\")","v":""}]
[2,"Trempeck Marco","Sögel II",308.1,null,{"$f":"IF(E11=\"x\",\"0\",D11)","v":308.1},{"$f":"IF(C11=$B$2,F11,0)","v":308.1},{"$f":"(IF(AND($E11=\"\",$C11=$B$2),1,0))","v":1},{"$f":"IF($C11=$B$3,F11,0)","v":0},{"$f":"(IF(AND($E11=\"\",$C11=$B$3),1,0))","v":0},{"$f":"IF($C11=$B$4,F11,0)","v":0},{"$f":"(IF(AND($E11=\"\",$C11=$B$4),1,0))","v":0},{"$f":"IF($C11=$B$5,F11,0)","v":0},{"$f":"(IF(AND($E11=\"\",$C11=$B$5),1,0))","v":0},{"$f":"IF($C11=$B$6,F11,0)","v":0},{"$f":"(IF(AND($E11=\"\",$C11=$B$6),1,0))","v":0},{"$f":"IF($C11=$B$7,F11,0)","v":0},{"$f":"(IF(AND($E11=\"\",$C11=$B$7),1,0))","v":0},{"$nulls":7},{"$f":"W11+X11+Y11","v":{"v":0,"d":"0.0"}},{"$f":"IF(Z11=D11,1,0)","v":0},{"$f":"IF(Z11=0,0,1)","v":0},{"$f":"IF(AA11+AB11=2,\"Korrekt\",\"\")","v":""}]
[3,"Robbers Heinz","Sögel II",308.3,null,308.3,308.3,1,0,0,0,0,0,0,0,0,0,0,{"$nulls":7},{"v":0,"d":"0.0"},0,0,""]
[4,"Robbers Bernd","Sögel II",311.4,null,311.4,311.4,1,0,0,0,0,0,0,0,0,0,0,{"$nulls":7},{"v":0,"d":"0.0"},0,0,""]
[5,"Husmann Michael","Sögel II",290.4,"x","0","0",0,0,0,0,0,0,0,0,0,0,0,{"$nulls":7},{"v":0,"d":"0.0"},0,0,""]
[6,"Schütze 6","Sögel II",{"v":0,"d":"0.0"},"x","0","0",0,0,0,0,0,0,0,0,0,0,0,{"$nulls":7},{"v":0,"d":"0.0"},1,0,""]
[7,"Bunten Manfred","Ostenwalde I",306.8,null,306.8,0,0,306.8,1,0,0,0,0,0,0,0,0,{"$nulls":7},{"v":0,"d":"0.0"},0,0,""]
[8,"Benten Helmut","Ostenwalde I",301.3,null,301.3,0,0,301.3,1,0,0,0,0,0,0,0,0,{"$nulls":7},{"v":0,"d":"0.0"},0,0,""]
[9,"Meiners Bernd","Ostenwalde I",310.5,null,310.5,0,0,310.5,1,0,0,0,0,0,0,0,0,{"$nulls":7},{"v":0,"d":"0.0"},0,0,""]
[10,"Meiners Martin","Ostenwalde I",305.1,null,305.1,0,0,305.1,1,0,0,0,0,0,0,0,0,{"$nulls":7},{"v":0,"d":"0.0"},0,0,""]
[11,"Schütze 11","Ostenwalde I",null,"x","0",0,0,"0",0,0,0,0,0,0,0,0,0,{"$nulls":7},{"v":0,"d":"0.0"},1,0,""]
[12,"Schütze 12","Ostenwalde I",{"v":0,"d":"0.0"},"x","0",0,0,"0",0,0,0,0,0,0,0,0,0,{"$nulls":7},{"v":0,"d":"0.0"},1,0,""]
[13,"Witting Bernhard","Neuvrees II",313.2,null,313.2,0,0,0,0,313.2,1,0,0,0,0,0,0,{"$nulls":7},{"v":0,"d":"0.0"},0,0,""]
[14,"Szczepanski Holger","Neuvrees II",308.2,null,308.2,0,0,0,0,308.2,1,0,0,0,0,0,0,{"$nulls":7},{"v":0,"d":"0.0"},0,0,""]
[15,"Schrand Karl-Heinz","Neuvrees II",308.4,null,308.4,0,0,0,0,308.4,1,0,0,0,0,0,0,{"$nulls":7},{"v":0,"d":"0.0"},0,0,""]
[16,"Preut Hans","Neuvrees II",312.1,null,312.1,0,0,0,0,312.1,1,0,0,0,0,0,0,{"$nulls":7},{"v":0,"d":"0.0"},0,0,""]
[17,"Thunert  Dirk","Neuvrees II",308.4,"x","0",0,0,0,0,"0",0,0,0,0,0,0,0,{"$nulls":7},{"v":0,"d":"0.0"},0,0,""]
[18,"Schütze 18","Neuvrees II",{"v":0,"d":"0.0"},"x","0",0,0,0,0,"0",0,0,0,0,0,0,0,{"$nulls":7},{"v":0,"d":"0.0"},1,0,""]
[19,"Hömmen Bernd","Breddenberg IV",{"v":306,"d":"306.0"},null,306,0,0,0,0,0,0,306,1,0,0,0,0,{"$nulls":7},{"v":0,"d":"0.0"},0,0,""]
[20,"Hanekamp Rudi","Breddenberg IV",294.8,null,294.8,0,0,0,0,0,0,294.8,1,0,0,0,0,{"$nulls":7},{"v":0,"d":"0.0"},0,0,""]
[21,"Köß Wilhelm","Breddenberg IV",309.4,null,309.4,0,0,0,0,0,0,309.4,1,0,0,0,0,{"$nulls":7},{"v":0,"d":"0.0"},0,0,""]
[22,"Jansen  Martin","Breddenberg IV",300.3,null,300.3,0,0,0,0,0,0,300.3,1,0,0,0,0,{"$nulls":7},{"v":0,"d":"0.0"},0,0,""]
[23,"Schütze 23","Breddenberg IV",{"v":0,"d":"0.0"},"x","0",0,0,0,0,0,0,"0",0,0,0,0,0,{"$nulls":7},{"v":0,"d":"0.0"},1,0,""]
[24,"Schütze 24","Breddenberg IV",{"v":0,"d":"0.0"},"x","0",0,0,0,0,0,0,"0",0,0,0,0,0,{"$nulls":7},{"v":0,"d":"0.0"},1,0,""]
[25,"Rolfes Willi","Neuvrees I",310.6,null,310.6,0,0,0,0,0,0,0,0,310.6,1,0,0,{"$nulls":7},{"v":0,"d":"0.0"},0,0,""]
[26,"Breyer Wilfried","Neuvrees I",308.9,null,308.9,0,0,0,0,0,0,0,0,308.9,1,0,0,{"$nulls":7},{"v":0,"d":"0.0"},0,0,""]
[27,"Janßen Markus","Neuvrees I",305.7,null,305.7,0,0,0,0,0,0,0,0,305.7,1,0,0,{"$nulls":7},{"v":0,"d":"0.0"},0,0,""]
[28,"Steenken Klaus","Neuvrees I",310.8,null,310.8,0,0,0,0,0,0,0,0,310.8,1,0,0,{"$nulls":7},{"v":0,"d":"0.0"},0,0,""]
[29,"Thyen Werner","Neuvrees I",304.2,"x","0",0,0,0,0,0,0,0,0,"0",0,0,0,{"$nulls":7},{"v":0,"d":"0.0"},0,0,""]
[30,"Schütze 30","Neuvrees I",{"v":0,"d":"0.0"},"x","0",0,0,0,0,0,0,0,0,"0",0,0,0,{"$nulls":7},{"v":0,"d":"0.0"},1,0,""]
[31,"Schuckenbrock Simon","Börger III",307.3,null,307.3,0,0,0,0,0,0,0,0,0,0,307.3,1,{"$nulls":7},{"$f":"W40+X40+Y40","v":{"v":0,"d":"0.0"}},{"$f":"IF(Z40=D40,1,0)","v":0},{"$f":"IF(Z40=0,0,1)","v":0},{"$f":"IF(AA40+AB40=2,\"Korrekt\",\"\")","v":""}]
[32,"Henzen Jens","Börger III",307.6,null,307.6,0,0,0,0,0,0,0,0,0,0,307.6,1,{"$nulls":7},{"v":0,"d":"0.0"},0,0,""]
[33,"Sebers Daniel","Börger III",{"v":307,"d":"307.0"},null,307,0,0,0,0,0,0,0,0,0,0,307,1,{"$nulls":7},{"v":0,"d":"0.0"},0,0,""]
[34,"Rode Bernd","Börger III",308.4,null,308.4,0,0,0,0,0,0,0,0,0,0,308.4,1,{"$nulls":7},{"v":0,"d":"0.0"},0,0,""]
[35,"Schroer Jürgen","Börger III",306.7,"x","0",0,0,0,0,0,0,0,0,0,0,"0",0,{"$nulls":7},{"v":0,"d":"0.0"},0,0,""]
[36,"Schütze 36","Börger III",{"v":0,"d":"0.0"},"x","0",0,0,0,0,0,0,0,0,0,0,"0",0,{"$nulls":7},{"$f":"W45+X45+Y45","v":{"v":0,"d":"0.0"}},{"$f":"IF(Z45=D45,1,0)","v":1},{"$f":"IF(Z45=0,0,1)","v":0},{"$f":"IF(AA45+AB45=2,\"Korrekt\",\"\")","v":""}]
[{"$nulls":6},{"$f":"LARGE(G10:G45,1)+LARGE(G10:G45,2)+LARGE(G10:G45,3)","v":932.8},{"$f":"SUM(H10:H45)","v":4},{"$f":"LARGE(I10:I45,1)+LARGE(I10:I45,2)+LARGE(I10:I45,3)","v":922.4},{"$f":"SUM(J10:J45)","v":4},{"$f":"LARGE(K10:K45,1)+LARGE(K10:K45,2)+LARGE(K10:K45,3)","v":933.6999999999999},{"$f":"SUM(L10:L45)","v":4},{"$f":"LARGE(M10:M45,1)+LARGE(M10:M45,2)+LARGE(M10:M45,3)","v":915.7},{"$f":"SUM(N10:N45)","v":4},{"$f":"LARGE(O10:O45,1)+LARGE(O10:O45,2)+LARGE(O10:O45,3)","v":930.3000000000001},{"$f":"SUM(P10:P45)","v":4},{"$f":"LARGE(Q10:Q45,1)+LARGE(Q10:Q45,2)+LARGE(Q10:Q45,3)","v":923.3},{"$f":"SUM(R10:S45)","v":4}]
[null,null,"per Email an: sk-huemmling@gmx.de"]

{"sheet":"2","index":2,"n_rows":47,"n_cols":27,"rows_kept":47,"merged":[[0,22,0,23],[1,22,1,23],[4,22,4,23],[5,22,5,23],[6,22,6,23],[8,20,8,23]]}
[null,"Verein / Gruppe",null,"Ergebnisse",{"$nulls":17},"Austragungsort:",{"$f":"Übersicht!E4","v":"Ostenwalde "}]
[1,{"$f":"'Wettkampf 1'!B2","v":"Sögel II"},null,{"$f":"G46","v":933.3},{"$f":"IF(H46>4,\"Es sind zu viele Schützen in Wertung!\",\" \")","v":" "},{"$nulls":16},"Wettkampftag:",{"$f":"Übersicht!E3","v":"25.09."}]
[2,{"$f":"'Wettkampf 1'!B3","v":"Ostenwalde I"},null,{"$f":"I46","v":{"v":929,"d":"929.0"}},{"$f":"IF(J46>4,\"Es sind zu viele Schützen in Wertung!\",\" \")","v":" "}]
[3,{"$f":"'Wettkampf 1'!B4","v":"Neuvrees II"},null,{"$f":"K46","v":{"v":934.6000000000001,"d":"934.6"}},{"$f":"IF(L46>4,\"Es sind zu viele Schützen in Wertung!\",\" \")","v":" "},{"$nulls":18},"Ansprechpartner für Rückfragen:"]
[4,{"$f":"'Wettkampf 1'!B5","v":"Breddenberg IV"},null,{"$f":"M46","v":919.3},{"$f":"IF(N46>4,\"Es sind zu viele Schützen in Wertung!\",\" \")","v":" "},{"$nulls":16},"Name:"]
[5,{"$f":"'Wettkampf 1'!B6","v":"Neuvrees I"},null,{"$f":"O46","v":929.2},{"$f":"IF(P46>4,\"Es sind zu viele Schützen in Wertung!\",\" \")","v":" "},{"$nulls":16},"Tel:"]
[6,{"$f":"'Wettkampf 1'!B7","v":"Börger III"},null,{"$f":"Q46","v":{"v":931.6999999999999,"d":"931.7"}},{"$f":"IF(R46>4,\"Es sind zu viele Schützen in Wertung!\",\" \")","v":" "},{"$nulls":16},"Standaufsicht:","eintragen"]
[]
[null,"Einzelergebnisse:","Verein / Gruppe","Ergebnisse (mindestens 0 eintragen)","AW? Dann x eintippen",null,"Verein 1",null,"Verein 2",null,"Verein 3",null,"Verein 4",null,"Verein 5",null,"Verein 6",{"$nulls":3},"Proberechnung bei Streifen:"]
[1,{"$f":"'Wettkampf 1'!B10","v":"Grünloh Michael"},{"$f":"'Wettkampf 1'!C10","v":"Sögel II"},309.3,null,{"$f":"IF(E10=\"x\",\"0\",D10)","v":309.3},{"$f":"IF(C10=$B$2,F10,0)","v":309.3},{"$f":"(IF(AND($E10=\"\",$C10=$B$2),1,0))","v":1},{"$f":"IF($C10=$B$3,F10,0)","v":0},{"$f":"(IF(AND($E10=\"\",$C10=$B$3),1,0))","v":0},{"$f":"IF($C10=$B$4,F10,0)","v":0},{"$f":"(IF(AND($E10=\"\",$C10=$B$4),1,0))","v":0},{"$f":"IF($C10=$B$5,F10,0)","v":0},{"$f":"(IF(AND($E10=\"\",$C10=$B$5),1,0))","v":0},{"$f":"IF($C10=$B$6,F10,0)","v":0},{"$f":"(IF(AND($E10=\"\",$C10=$B$6),1,0))","v":0},{"$f":"IF($C10=$B$7,F10,0)","v":0},{"$f":"(IF(AND($E10=\"\",$C10=$B$7),1,0))","v":0},{"$nulls":5},{"$f":"U10+V10+W10","v":{"v":0,"d":"0.0"}},{"$f":"IF(X10=D10,1,0)","v":0},{"$f":"IF(X10=0,0,1)","v":0},{"$f":"IF(Y10+Z10=2,\"Korrekt\",\"\")","v":""}]
[2,{"$f":"'Wettkampf 1'!B11","v":"Trempeck Marco"},{"$f":"'Wettkampf 1'!C11","v":"Sögel II"},305.8,null,{"$f":"IF(E11=\"x\",\"0\",D11)","v":305.8},{"$f":"IF(C11=$B$2,F11,0)","v":305.8},{"$f":"(IF(AND($E11=\"\",$C11=$B$2),1,0))","v":1},{"$f":"IF($C11=$B$3,F11,0)","v":0},{"$f":"(IF(AND($E11=\"\",$C11=$B$3),1,0))","v":0},{"$f":"IF($C11=$B$4,F11,0)","v":0},{"$f":"(IF(AND($E11=\"\",$C11=$B$4),1,0))","v":0},{"$f":"IF($C11=$B$5,F11,0)","v":0},{"$f":"(IF(AND($E11=\"\",$C11=$B$5),1,0))","v":0},{"$f":"IF($C11=$B$6,F11,0)","v":0},{"$f":"(IF(AND($E11=\"\",$C11=$B$6),1,0))","v":0},{"$f":"IF($C11=$B$7,F11,0)","v":0},{"$f":"(IF(AND($E11=\"\",$C11=$B$7),1,0))","v":0},{"$nulls":5},{"$f":"U11+V11+W11","v":{"v":0,"d":"0.0"}},{"$f":"IF(X11=D11,1,0)","v":0},{"$f":"IF(X11=0,0,1)","v":0},{"$f":"IF(Y11+Z11=2,\"Korrekt\",\"\")","v":""}]
[3,{"$f":"'Wettkampf 1'!B12","v":"Robbers Heinz"},{"$f":"'Wettkampf 1'!C12","v":"Sögel II"},312.1,null,312.1,312.1,1,0,0,0,0,0,0,0,0,0,0,{"$nulls":5},{"v":0,"d":"0.0"},0,0,""]
[4,{"$f":"'Wettkampf 1'!B13","v":"Robbers Bernd"},{"$f":"'Wettkampf 1'!C13","v":"Sögel II"},311.9,null,311.9,311.9,1,0,0,0,0,0,0,0,0,0,0,{"$nulls":5},{"v":0,"d":"0.0"},0,0,""]
[5,{"$f":"'Wettkampf 1'!B14","v":"Husmann Michael"},{"$f":"'Wettkampf 1'!C14","v":"Sögel II"},305.1,"x","0","0",0,0,0,0,0,0,0,0,0,0,0,{"$nulls":5},{"v":0,"d":"0.0"},0,0,""]
[6,{"$f":"'Wettkampf 1'!B15","v":"Schütze 6"},{"$f":"'Wettkampf 1'!C15","v":"Sögel II"},null,"x","0","0",0,0,0,0,0,0,0,0,0,0,0,{"$nulls":5},{"v":0,"d":"0.0"},1,0,""]
[7,{"$f":"'Wettkampf 1'!B16","v":"Bunten Manfred"},{"$f":"'Wettkampf 1'!C16","v":"Ostenwalde I"},309.7,null,309.7,0,0,309.7,1,0,0,0,0,0,0,0,0,{"$nulls":5},{"v":0,"d":"0.0"},0,0,""]
[8,{"$f":"'Wettkampf 1'!B17","v":"Benten Helmut"},{"$f":"'Wettkampf 1'!C17","v":"Ostenwalde I"},295.6,"x","0",0,0,"0",0,0,0,0,0,0,0,0,0,{"$nulls":5},{"v":0,"d":"0.0"},0,0,""]
[9,{"$f":"'Wettkampf 1'!B18","v":"Meiners Bernd"},{"$f":"'Wettkampf 1'!C18","v":"Ostenwalde I"},306.5,null,306.5,0,0,306.5,1,0,0,0,0,0,0,0,0,{"$nulls":5},{"v":0,"d":"0.0"},0,0,""]
[10,{"$f":"'Wettkampf 1'!B19","v":"Meiners Martin"},{"$f":"'Wettkampf 1'!C19","v":"Ostenwalde I"},312.8,null,312.8,0,0,312.8,1,0,0,0,0,0,0,0,0,{"$nulls":5},{"v":0,"d":"0.0"},0,0,""]
[11,{"$f":"'Wettkampf 1'!B20","v":"Schütze 11"},{"$f":"'Wettkampf 1'!C20","v":"Ostenwalde I"},null,"x","0",0,0,"0",0,0,0,0,0,0,0,0,0,{"$nulls":5},{"v":0,"d":"0.0"},1,0,""]
[12,{"$f":"'Wettkampf 1'!B21","v":"Schütze 12"},{"$f":"'Wettkampf 1'!C21","v":"Ostenwalde I"},null,"x","0",0,0,"0",0,0,0,0,0,0,0,0,0,{"$nulls":5},{"v":0,"d":"0.0"},1,0,""]
[13,{"$f":"'Wettkampf 1'!B22","v":"Witting Bernhard"},{"$f":"'Wettkampf 1'!C22","v":"Neuvrees II"},314.3,null,314.3,0,0,0,0,314.3,1,0,0,0,0,0,0,{"$nulls":5},{"v":0,"d":"0.0"},0,0,""]
[14,{"$f":"'Wettkampf 1'!B23","v":"Szczepanski Holger"},{"$f":"'Wettkampf 1'!C23","v":"Neuvrees II"},{"v":306,"d":"306.0"},null,{"v":306,"d":"306.0"},0,0,0,0,306,1,0,0,0,0,0,0,{"$nulls":5},{"v":0,"d":"0.0"},0,0,""]
[15,{"$f":"'Wettkampf 1'!B24","v":"Schrand Karl-Heinz"},{"$f":"'Wettkampf 1'!C24","v":"Neuvrees II"},313.1,null,313.1,0,0,0,0,313.1,1,0,0,0,0,0,0,{"$nulls":5},{"v":0,"d":"0.0"},0,0,""]
[16,{"$f":"'Wettkampf 1'!B25","v":"Preut Hans"},{"$f":"'Wettkampf 1'!C25","v":"Neuvrees II"},307.2,null,307.2,0,0,0,0,307.2,1,0,0,0,0,0,0,{"$nulls":5},{"v":0,"d":"0.0"},0,0,""]
[17,{"$f":"'Wettkampf 1'!B26","v":"Thunert  Dirk"},{"$f":"'Wettkampf 1'!C26","v":"Neuvrees II"},309.6,"x","0",0,0,0,0,"0",0,0,0,0,0,0,0,{"$nulls":5},{"v":0,"d":"0.0"},0,0,""]
[18,{"$f":"'Wettkampf 1'!B27","v":"Schütze 18"},{"$f":"'Wettkampf 1'!C27","v":"Neuvrees II"},null,"x","0",0,0,0,0,"0",0,0,0,0,0,0,0,{"$nulls":5},{"v":0,"d":"0.0"},1,0,""]
[19,{"$f":"'Wettkampf 1'!B28","v":"Hömmen Bernd"},{"$f":"'Wettkampf 1'!C28","v":"Breddenberg IV"},305.2,null,305.2,0,0,0,0,0,0,305.2,1,0,0,0,0,{"$nulls":5},{"v":0,"d":"0.0"},0,0,""]
[20,{"$f":"'Wettkampf 1'!B29","v":"Hanekamp Rudi"},{"$f":"'Wettkampf 1'!C29","v":"Breddenberg IV"},299.2,null,299.2,0,0,0,0,0,0,299.2,1,0,0,0,0,{"$nulls":5},{"v":0,"d":"0.0"},0,0,""]
[21,{"$f":"'Wettkampf 1'!B30","v":"Köß Wilhelm"},{"$f":"'Wettkampf 1'!C30","v":"Breddenberg IV"},311.7,null,311.7,0,0,0,0,0,0,311.7,1,0,0,0,0,{"$nulls":5},{"v":0,"d":"0.0"},0,0,""]
[22,{"$f":"'Wettkampf 1'!B31","v":"Jansen  Martin"},{"$f":"'Wettkampf 1'!C31","v":"Breddenberg IV"},302.4,null,302.4,0,0,0,0,0,0,302.4,1,0,0,0,0,{"$nulls":5},{"v":0,"d":"0.0"},0,0,""]
[23,{"$f":"'Wettkampf 1'!B32","v":"Schütze 23"},{"$f":"'Wettkampf 1'!C32","v":"Breddenberg IV"},null,"x","0",0,0,0,0,0,0,"0",0,0,0,0,0,{"$nulls":5},{"v":0,"d":"0.0"},1,0,""]
[24,{"$f":"'Wettkampf 1'!B33","v":"Schütze 24"},{"$f":"'Wettkampf 1'!C33","v":"Breddenberg IV"},null,"x","0",0,0,0,0,0,0,"0",0,0,0,0,0,{"$nulls":5},{"v":0,"d":"0.0"},1,0,""]
[25,{"$f":"'Wettkampf 1'!B34","v":"Rolfes Willi"},{"$f":"'Wettkampf 1'!C34","v":"Neuvrees I"},308.8,null,308.8,0,0,0,0,0,0,0,0,308.8,1,0,0,{"$nulls":5},{"v":0,"d":"0.0"},0,0,""]
[26,{"$f":"'Wettkampf 1'!B35","v":"Breyer Wilfried"},{"$f":"'Wettkampf 1'!C35","v":"Neuvrees I"},312.4,null,312.4,0,0,0,0,0,0,0,0,312.4,1,0,0,{"$nulls":5},{"v":0,"d":"0.0"},0,0,""]
[27,{"$f":"'Wettkampf 1'!B36","v":"Janßen Markus"},{"$f":"'Wettkampf 1'!C36","v":"Neuvrees I"},301.8,null,301.8,0,0,0,0,0,0,0,0,301.8,1,0,0,{"$nulls":5},{"v":0,"d":"0.0"},0,0,""]
[28,{"$f":"'Wettkampf 1'!B37","v":"Steenken Klaus"},{"$f":"'Wettkampf 1'!C37","v":"Neuvrees I"},{"v":308,"d":"308.0"},null,{"v":308,"d":"308.0"},0,0,0,0,0,0,0,0,308,1,0,0,{"$nulls":5},{"v":0,"d":"0.0"},0,0,""]
[29,{"$f":"'Wettkampf 1'!B38","v":"Thyen Werner"},{"$f":"'Wettkampf 1'!C38","v":"Neuvrees I"},297.7,"x","0",0,0,0,0,0,0,0,0,"0",0,0,0,{"$nulls":5},{"v":0,"d":"0.0"},0,0,""]
[30,{"$f":"'Wettkampf 1'!B39","v":"Schütze 30"},{"$f":"'Wettkampf 1'!C39","v":"Neuvrees I"},null,"x","0",0,0,0,0,0,0,0,0,"0",0,0,0,{"$nulls":5},{"v":0,"d":"0.0"},1,0,""]
[31,{"$f":"'Wettkampf 1'!B40","v":"Schuckenbrock Simon"},{"$f":"'Wettkampf 1'!C40","v":"Börger III"},306.9,null,306.9,0,0,0,0,0,0,0,0,0,0,306.9,1,{"$nulls":5},{"$f":"U40+V40+W40","v":{"v":0,"d":"0.0"}},{"$f":"IF(X40=D40,1,0)","v":0},{"$f":"IF(X40=0,0,1)","v":0},{"$f":"IF(Y40+Z40=2,\"Korrekt\",\"\")","v":""}]
[32,{"$f":"'Wettkampf 1'!B41","v":"Henzen Jens"},{"$f":"'Wettkampf 1'!C41","v":"Börger III"},314.2,null,314.2,0,0,0,0,0,0,0,0,0,0,314.2,1,{"$nulls":5},{"v":0,"d":"0.0"},0,0,""]
[33,{"$f":"'Wettkampf 1'!B42","v":"Sebers Daniel"},{"$f":"'Wettkampf 1'!C42","v":"Börger III"},306.6,null,306.6,0,0,0,0,0,0,0,0,0,0,306.6,1,{"$nulls":5},{"v":0,"d":"0.0"},0,0,""]
[34,{"$f":"'Wettkampf 1'!B43","v":"Rode Bernd"},{"$f":"'Wettkampf 1'!C43","v":"Börger III"},310.6,null,310.6,0,0,0,0,0,0,0,0,0,0,310.6,1,{"$nulls":5},{"v":0,"d":"0.0"},0,0,""]
[35,{"$f":"'Wettkampf 1'!B44","v":"Schroer Jürgen"},{"$f":"'Wettkampf 1'!C44","v":"Börger III"},307.7,"x","0",0,0,0,0,0,0,0,0,0,0,"0",0,{"$nulls":5},{"v":0,"d":"0.0"},0,0,""]
[36,{"$f":"'Wettkampf 1'!B45","v":"Schütze 36"},{"$f":"'Wettkampf 1'!C45","v":"Börger III"},null,"x","0",0,0,0,0,0,0,0,0,0,0,"0",0,{"$nulls":5},{"$f":"U45+V45+W45","v":{"v":0,"d":"0.0"}},{"$f":"IF(X45=D45,1,0)","v":1},{"$f":"IF(X45=0,0,1)","v":0},{"$f":"IF(Y45+Z45=2,\"Korrekt\",\"\")","v":""}]
[{"$nulls":6},{"$f":"LARGE(G10:G45,1)+LARGE(G10:G45,2)+LARGE(G10:G45,3)","v":933.3},{"$f":"SUM(H10:H45)","v":4},{"$f":"LARGE(I10:I45,1)+LARGE(I10:I45,2)+LARGE(I10:I45,3)","v":929},{"$f":"SUM(J10:J45)","v":3},{"$f":"LARGE(K10:K45,1)+LARGE(K10:K45,2)+LARGE(K10:K45,3)","v":934.6000000000001},{"$f":"SUM(L10:L45)","v":4},{"$f":"LARGE(M10:M45,1)+LARGE(M10:M45,2)+LARGE(M10:M45,3)","v":919.3},{"$f":"SUM(N10:N45)","v":4},{"$f":"LARGE(O10:O45,1)+LARGE(O10:O45,2)+LARGE(O10:O45,3)","v":929.2},{"$f":"SUM(P10:P45)","v":4},{"$f":"LARGE(Q10:Q45,1)+LARGE(Q10:Q45,2)+LARGE(Q10:Q45,3)","v":931.6999999999999},{"$f":"SUM(R10:S45)","v":4}]
[null,null,"per Email an: sk-huemmling@gmx.de"]

{"sheet":"3","index":3,"n_rows":47,"n_cols":27,"rows_kept":47,"merged":[[0,22,0,23],[1,22,1,23],[4,22,4,23],[5,22,5,23],[6,22,6,23],[8,20,8,23]]}
[null,"Verein / Gruppe",null,"Ergebnisse",{"$nulls":17},"Austragungsort:",{"$f":"Übersicht!F4","v":"Neuvrees "}]
[1,{"$f":"'Wettkampf 1'!B2","v":"Sögel II"},null,{"$f":"G46","v":941.3},{"$f":"IF(H46>4,\"Es sind zu viele Schützen in Wertung!\",\" \")","v":" "},{"$nulls":16},"Wettkampftag:",{"$f":"Übersicht!F3","v":"09.10."}]
[2,{"$f":"'Wettkampf 1'!B3","v":"Ostenwalde I"},null,{"$f":"I46","v":{"v":923.4000000000001,"d":"923.4"}},{"$f":"IF(J46>4,\"Es sind zu viele Schützen in Wertung!\",\" \")","v":" "}]
[3,{"$f":"'Wettkampf 1'!B4","v":"Neuvrees II"},null,{"$f":"K46","v":929.4},{"$f":"IF(L46>4,\"Es sind zu viele Schützen in Wertung!\",\" \")","v":" "},{"$nulls":18},"Ansprechpartner für Rückfragen:"]
[4,{"$f":"'Wettkampf 1'!B5","v":"Breddenberg IV"},null,{"$f":"M46","v":{"v":914,"d":"914.0"}},{"$f":"IF(N46>4,\"Es sind zu viele Schützen in Wertung!\",\" \")","v":" "},{"$nulls":16},"Name:"]
[5,{"$f":"'Wettkampf 1'!B6","v":"Neuvrees I"},null,{"$f":"O46","v":926.4},{"$f":"IF(P46>4,\"Es sind zu viele Schützen in Wertung!\",\" \")","v":" "},{"$nulls":16},"Tel:"]
[6,{"$f":"'Wettkampf 1'!B7","v":"Börger III"},null,{"$f":"Q46","v":929.7},{"$f":"IF(R46>4,\"Es sind zu viele Schützen in Wertung!\",\" \")","v":" "},{"$nulls":16},"Standaufsicht:","eintragen"]
[]
[null,"Einzelergebnisse:","Verein / Gruppe","Ergebnisse (mindestens 0 eintragen)","AW? Dann x eintippen",null,"Verein 1",null,"Verein 2",null,"Verein 3",null,"Verein 4",null,"Verein 5",null,"Verein 6",{"$nulls":3},"Proberechnung bei Streifen:"]
[1,{"$f":"'Wettkampf 1'!B10","v":"Grünloh Michael"},{"$f":"'Wettkampf 1'!C10","v":"Sögel II"},315.4,null,{"$f":"IF(E10=\"x\",\"0\",D10)","v":315.4},{"$f":"IF(C10=$B$2,F10,0)","v":315.4},{"$f":"(IF(AND($E10=\"\",$C10=$B$2),1,0))","v":1},{"$f":"IF($C10=$B$3,F10,0)","v":0},{"$f":"(IF(AND($E10=\"\",$C10=$B$3),1,0))","v":0},{"$f":"IF($C10=$B$4,F10,0)","v":0},{"$f":"(IF(AND($E10=\"\",$C10=$B$4),1,0))","v":0},{"$f":"IF($C10=$B$5,F10,0)","v":0},{"$f":"(IF(AND($E10=\"\",$C10=$B$5),1,0))","v":0},{"$f":"IF($C10=$B$6,F10,0)","v":0},{"$f":"(IF(AND($E10=\"\",$C10=$B$6),1,0))","v":0},{"$f":"IF($C10=$B$7,F10,0)","v":0},{"$f":"(IF(AND($E10=\"\",$C10=$B$7),1,0))","v":0},{"$nulls":5},{"$f":"U10+V10+W10","v":{"v":0,"d":"0.0"}},{"$f":"IF(X10=D10,1,0)","v":0},{"$f":"IF(X10=0,0,1)","v":0},{"$f":"IF(Y10+Z10=2,\"Korrekt\",\"\")","v":""}]
[2,{"$f":"'Wettkampf 1'!B11","v":"Trempeck Marco"},{"$f":"'Wettkampf 1'!C11","v":"Sögel II"},311.4,null,{"$f":"IF(E11=\"x\",\"0\",D11)","v":311.4},{"$f":"IF(C11=$B$2,F11,0)","v":311.4},{"$f":"(IF(AND($E11=\"\",$C11=$B$2),1,0))","v":1},{"$f":"IF($C11=$B$3,F11,0)","v":0},{"$f":"(IF(AND($E11=\"\",$C11=$B$3),1,0))","v":0},{"$f":"IF($C11=$B$4,F11,0)","v":0},{"$f":"(IF(AND($E11=\"\",$C11=$B$4),1,0))","v":0},{"$f":"IF($C11=$B$5,F11,0)","v":0},{"$f":"(IF(AND($E11=\"\",$C11=$B$5),1,0))","v":0},{"$f":"IF($C11=$B$6,F11,0)","v":0},{"$f":"(IF(AND($E11=\"\",$C11=$B$6),1,0))","v":0},{"$f":"IF($C11=$B$7,F11,0)","v":0},{"$f":"(IF(AND($E11=\"\",$C11=$B$7),1,0))","v":0},{"$nulls":5},{"$f":"U11+V11+W11","v":{"v":0,"d":"0.0"}},{"$f":"IF(X11=D11,1,0)","v":0},{"$f":"IF(X11=0,0,1)","v":0},{"$f":"IF(Y11+Z11=2,\"Korrekt\",\"\")","v":""}]
[3,{"$f":"'Wettkampf 1'!B12","v":"Robbers Heinz"},{"$f":"'Wettkampf 1'!C12","v":"Sögel II"},312.7,null,312.7,312.7,1,0,0,0,0,0,0,0,0,0,0,{"$nulls":5},{"v":0,"d":"0.0"},0,0,""]
[4,{"$f":"'Wettkampf 1'!B13","v":"Robbers Bernd"},{"$f":"'Wettkampf 1'!C13","v":"Sögel II"},313.2,null,313.2,313.2,1,0,0,0,0,0,0,0,0,0,0,{"$nulls":5},{"v":0,"d":"0.0"},0,0,""]
[5,{"$f":"'Wettkampf 1'!B14","v":"Husmann Michael"},{"$f":"'Wettkampf 1'!C14","v":"Sögel II"},296.5,"x","0","0",0,0,0,0,0,0,0,0,0,0,0,{"$nulls":5},{"v":0,"d":"0.0"},0,0,""]
[6,{"$f":"'Wettkampf 1'!B15","v":"Schütze 6"},{"$f":"'Wettkampf 1'!C15","v":"Sögel II"},{"v":0,"d":"0.0"},"x","0","0",0,0,0,0,0,0,0,0,0,0,0,{"$nulls":5},{"v":0,"d":"0.0"},1,0,""]
[7,{"$f":"'Wettkampf 1'!B16","v":"Bunten Manfred"},{"$f":"'Wettkampf 1'!C16","v":"Ostenwalde I"},{"v":307,"d":"307.0"},null,{"v":307,"d":"307.0"},0,0,307,1,0,0,0,0,0,0,0,0,{"$nulls":5},{"v":0,"d":"0.0"},0,0,""]
[8,{"$f":"'Wettkampf 1'!B17","v":"Benten Helmut"},{"$f":"'Wettkampf 1'!C17","v":"Ostenwalde I"},299.1,null,299.1,0,0,299.1,1,0,0,0,0,0,0,0,0,{"$nulls":5},{"v":0,"d":"0.0"},0,0,""]
[9,{"$f":"'Wettkampf 1'!B18","v":"Meiners Bernd"},{"$f":"'Wettkampf 1'!C18","v":"Ostenwalde I"},305.3,null,305.3,0,0,305.3,1,0,0,0,0,0,0,0,0,{"$nulls":5},{"v":0,"d":"0.0"},0,0,""]
[10,{"$f":"'Wettkampf 1'!B19","v":"Meiners Martin"},{"$f":"'Wettkampf 1'!C19","v":"Ostenwalde I"},311.1,null,311.1,0,0,311.1,1,0,0,0,0,0,0,0,0,{"$nulls":5},{"v":0,"d":"0.0"},0,0,""]
[11,{"$f":"'Wettkampf 1'!B20","v":"Schütze 11"},{"$f":"'Wettkampf 1'!C20","v":"Ostenwalde I"},{"v":0,"d":"0.0"},"x","0",0,0,"0",0,0,0,0,0,0,0,0,0,{"$nulls":5},{"v":0,"d":"0.0"},1,0,""]
[12,{"$f":"'Wettkampf 1'!B21","v":"Schütze 12"},{"$f":"'Wettkampf 1'!C21","v":"Ostenwalde I"},{"v":0,"d":"0.0"},"x","0",0,0,"0",0,0,0,0,0,0,0,0,0,{"$nulls":5},{"v":0,"d":"0.0"},1,0,""]
[13,{"$f":"'Wettkampf 1'!B22","v":"Witting Bernhard"},{"$f":"'Wettkampf 1'!C22","v":"Neuvrees II"},312.5,null,312.5,0,0,0,0,312.5,1,0,0,0,0,0,0,{"$nulls":5},{"v":0,"d":"0.0"},0,0,""]
[14,{"$f":"'Wettkampf 1'!B23","v":"Szczepanski Holger"},{"$f":"'Wettkampf 1'!C23","v":"Neuvrees II"},308.7,"x","0",0,0,0,0,"0",0,0,0,0,0,0,0,{"$nulls":5},{"v":0,"d":"0.0"},0,0,""]
[15,{"$f":"'Wettkampf 1'!B24","v":"Schrand Karl-Heinz"},{"$f":"'Wettkampf 1'!C24","v":"Neuvrees II"},307.1,null,307.1,0,0,0,0,307.1,1,0,0,0,0,0,0,{"$nulls":5},{"v":0,"d":"0.0"},0,0,""]
[16,{"$f":"'Wettkampf 1'!B25","v":"Preut Hans"},{"$f":"'Wettkampf 1'!C25","v":"Neuvrees II"},304.3,null,304.3,0,0,0,0,304.3,1,0,0,0,0,0,0,{"$nulls":5},{"v":0,"d":"0.0"},0,0,""]
[17,{"$f":"'Wettkampf 1'!B26","v":"Thunert  Dirk"},{"$f":"'Wettkampf 1'!C26","v":"Neuvrees II"},309.8,null,309.8,0,0,0,0,309.8,1,0,0,0,0,0,0,{"$nulls":5},{"v":0,"d":"0.0"},0,0,""]
[18,{"$f":"'Wettkampf 1'!B27","v":"Schütze 18"},{"$f":"'Wettkampf 1'!C27","v":"Neuvrees II"},{"v":0,"d":"0.0"},"x","0",0,0,0,0,"0",0,0,0,0,0,0,0,{"$nulls":5},{"v":0,"d":"0.0"},1,0,""]
[19,{"$f":"'Wettkampf 1'!B28","v":"Hömmen Bernd"},{"$f":"'Wettkampf 1'!C28","v":"Breddenberg IV"},302.1,null,302.1,0,0,0,0,0,0,302.1,1,0,0,0,0,{"$nulls":5},{"v":0,"d":"0.0"},0,0,""]
[20,{"$f":"'Wettkampf 1'!B29","v":"Hanekamp Rudi"},{"$f":"'Wettkampf 1'!C29","v":"Breddenberg IV"},301.7,null,301.7,0,0,0,0,0,0,301.7,1,0,0,0,0,{"$nulls":5},{"v":0,"d":"0.0"},0,0,""]
[21,{"$f":"'Wettkampf 1'!B30","v":"Köß Wilhelm"},{"$f":"'Wettkampf 1'!C30","v":"Breddenberg IV"},310.2,null,310.2,0,0,0,0,0,0,310.2,1,0,0,0,0,{"$nulls":5},{"v":0,"d":"0.0"},0,0,""]
[22,{"$f":"'Wettkampf 1'!B31","v":"Jansen  Martin"},{"$f":"'Wettkampf 1'!C31","v":"Breddenberg IV"},293.3,null,293.3,0,0,0,0,0,0,293.3,1,0,0,0,0,{"$nulls":5},{"v":0,"d":"0.0"},0,0,""]
[23,{"$f":"'Wettkampf 1'!B32","v":"Schütze 23"},{"$f":"'Wettkampf 1'!C32","v":"Breddenberg IV"},{"v":0,"d":"0.0"},"x","0",0,0,0,0,0,0,"0",0,0,0,0,0,{"$nulls":5},{"v":0,"d":"0.0"},1,0,""]
[24,{"$f":"'Wettkampf 1'!B33","v":"Schütze 24"},{"$f":"'Wettkampf 1'!C33","v":"Breddenberg IV"},{"v":0,"d":"0.0"},"x","0",0,0,0,0,0,0,"0",0,0,0,0,0,{"$nulls":5},{"v":0,"d":"0.0"},1,0,""]
[25,{"$f":"'Wettkampf 1'!B34","v":"Rolfes Willi"},{"$f":"'Wettkampf 1'!C34","v":"Neuvrees I"},308.1,null,308.1,0,0,0,0,0,0,0,0,308.1,1,0,0,{"$nulls":5},{"v":0,"d":"0.0"},0,0,""]
[26,{"$f":"'Wettkampf 1'!B35","v":"Breyer Wilfried"},{"$f":"'Wettkampf 1'!C35","v":"Neuvrees I"},310.9,null,310.9,0,0,0,0,0,0,0,0,310.9,1,0,0,{"$nulls":5},{"v":0,"d":"0.0"},0,0,""]
[27,{"$f":"'Wettkampf 1'!B36","v":"Janßen Markus"},{"$f":"'Wettkampf 1'!C36","v":"Neuvrees I"},303.2,null,303.2,0,0,0,0,0,0,0,0,303.2,1,0,0,{"$nulls":5},{"v":0,"d":"0.0"},0,0,""]
[28,{"$f":"'Wettkampf 1'!B37","v":"Steenken Klaus"},{"$f":"'Wettkampf 1'!C37","v":"Neuvrees I"},307.4,null,307.4,0,0,0,0,0,0,0,0,307.4,1,0,0,{"$nulls":5},{"v":0,"d":"0.0"},0,0,""]
[29,{"$f":"'Wettkampf 1'!B38","v":"Thyen Werner"},{"$f":"'Wettkampf 1'!C38","v":"Neuvrees I"},305.6,"x","0",0,0,0,0,0,0,0,0,"0",0,0,0,{"$nulls":5},{"v":0,"d":"0.0"},0,0,""]
[30,{"$f":"'Wettkampf 1'!B39","v":"Schütze 30"},{"$f":"'Wettkampf 1'!C39","v":"Neuvrees I"},{"v":0,"d":"0.0"},"x","0",0,0,0,0,0,0,0,0,"0",0,0,0,{"$nulls":5},{"v":0,"d":"0.0"},1,0,""]
[31,{"$f":"'Wettkampf 1'!B40","v":"Schuckenbrock Simon"},{"$f":"'Wettkampf 1'!C40","v":"Börger III"},310.7,null,310.7,0,0,0,0,0,0,0,0,0,0,310.7,1,{"$nulls":5},{"v":0,"d":"0.0"},0,0,""]
[32,{"$f":"'Wettkampf 1'!B41","v":"Henzen Jens"},{"$f":"'Wettkampf 1'!C41","v":"Börger III"},307.8,null,307.8,0,0,0,0,0,0,0,0,0,0,307.8,1,{"$nulls":5},{"v":0,"d":"0.0"},0,0,""]
[33,{"$f":"'Wettkampf 1'!B42","v":"Sebers Daniel"},{"$f":"'Wettkampf 1'!C42","v":"Börger III"},310.3,"x","0",0,0,0,0,0,0,0,0,0,0,"0",0,{"$nulls":5},{"v":0,"d":"0.0"},0,0,""]
[34,{"$f":"'Wettkampf 1'!B43","v":"Rode Bernd"},{"$f":"'Wettkampf 1'!C43","v":"Börger III"},311.2,null,311.2,0,0,0,0,0,0,0,0,0,0,311.2,1,{"$nulls":5},{"v":0,"d":"0.0"},0,0,""]
[35,{"$f":"'Wettkampf 1'!B44","v":"Schroer Jürgen"},{"$f":"'Wettkampf 1'!C44","v":"Börger III"},307.8,null,307.8,0,0,0,0,0,0,0,0,0,0,307.8,1,{"$nulls":5},{"v":0,"d":"0.0"},0,0,""]
[36,{"$f":"'Wettkampf 1'!B45","v":"Schütze 36"},{"$f":"'Wettkampf 1'!C45","v":"Börger III"},{"v":0,"d":"0.0"},"x","0",0,0,0,0,0,0,0,0,0,0,"0",0,{"$nulls":5},{"v":0,"d":"0.0"},1,0,""]
[{"$nulls":6},{"$f":"LARGE(G10:G45,1)+LARGE(G10:G45,2)+LARGE(G10:G45,3)","v":941.3},{"$f":"SUM(H10:H45)","v":4},{"$f":"LARGE(I10:I45,1)+LARGE(I10:I45,2)+LARGE(I10:I45,3)","v":923.4000000000001},{"$f":"SUM(J10:J45)","v":4},{"$f":"LARGE(K10:K45,1)+LARGE(K10:K45,2)+LARGE(K10:K45,3)","v":929.4},{"$f":"SUM(L10:L45)","v":4},{"$f":"LARGE(M10:M45,1)+LARGE(M10:M45,2)+LARGE(M10:M45,3)","v":914},{"$f":"SUM(N10:N45)","v":4},{"$f":"LARGE(O10:O45,1)+LARGE(O10:O45,2)+LARGE(O10:O45,3)","v":926.4},{"$f":"SUM(P10:P45)","v":4},{"$f":"LARGE(Q10:Q45,1)+LARGE(Q10:Q45,2)+LARGE(Q10:Q45,3)","v":929.7},{"$f":"SUM(R10:S45)","v":4}]
[null,null,"per Email an: sk-huemmling@gmx.de"]

{"sheet":"4","index":4,"n_rows":47,"n_cols":27,"rows_kept":47,"merged":[[0,22,0,23],[1,22,1,23],[4,22,4,23],[5,22,5,23],[6,22,6,23],[8,20,8,23]]}
[null,"Verein / Gruppe",null,"Ergebnisse",{"$nulls":17},"Austragungsort:",{"$f":"Übersicht!G4","v":"Breddenberg"}]
[1,{"$f":"'Wettkampf 1'!B2","v":"Sögel II"},null,{"$f":"G46","v":943.4},{"$f":"IF(H46>4,\"Es sind zu viele Schützen in Wertung!\",\" \")","v":" "},{"$nulls":16},"Wettkampftag:",{"$f":"Übersicht!G3","v":"23.10."}]
[2,{"$f":"'Wettkampf 1'!B3","v":"Ostenwalde I"},null,{"$f":"I46","v":923.2},{"$f":"IF(J46>4,\"Es sind zu viele Schützen in Wertung!\",\" \")","v":" "}]
[3,{"$f":"'Wettkampf 1'!B4","v":"Neuvrees II"},null,{"$f":"K46","v":930.9},{"$f":"IF(L46>4,\"Es sind zu viele Schützen in Wertung!\",\" \")","v":" "},{"$nulls":18},"Ansprechpartner für Rückfragen:"]
[4,{"$f":"'Wettkampf 1'!B5","v":"Breddenberg IV"},null,{"$f":"M46","v":917.9},{"$f":"IF(N46>4,\"Es sind zu viele Schützen in Wertung!\",\" \")","v":" "},{"$nulls":16},"Name:"]
[5,{"$f":"'Wettkampf 1'!B6","v":"Neuvrees I"},null,{"$f":"O46","v":934.5},{"$f":"IF(P46>4,\"Es sind zu viele Schützen in Wertung!\",\" \")","v":" "},{"$nulls":16},"Tel:"]
[6,{"$f":"'Wettkampf 1'!B7","v":"Börger III"},null,{"$f":"Q46","v":{"v":926.3999999999999,"d":"926.4"}},{"$f":"IF(R46>4,\"Es sind zu viele Schützen in Wertung!\",\" \")","v":" "},{"$nulls":16},"Standaufsicht:","eintragen"]
[]
[null,"Einzelergebnisse:","Verein / Gruppe","Ergebnisse (mindestens 0 eintragen)","AW? Dann x eintippen",null,"Verein 1",null,"Verein 2",null,"Verein 3",null,"Verein 4",null,"Verein 5",null,"Verein 6",{"$nulls":3},"Proberechnung bei Streifen:"]
[1,{"$f":"'Wettkampf 1'!B10","v":"Grünloh Michael"},{"$f":"'Wettkampf 1'!C10","v":"Sögel II"},313.5,null,{"$f":"IF(E10=\"x\",\"0\",D10)","v":313.5},{"$f":"IF(C10=$B$2,F10,0)","v":313.5},{"$f":"(IF(AND($E10=\"\",$C10=$B$2),1,0))","v":1},{"$f":"IF($C10=$B$3,F10,0)","v":0},{"$f":"(IF(AND($E10=\"\",$C10=$B$3),1,0))","v":0},{"$f":"IF($C10=$B$4,F10,0)","v":0},{"$f":"(IF(AND($E10=\"\",$C10=$B$4),1,0))","v":0},{"$f":"IF($C10=$B$5,F10,0)","v":0},{"$f":"(IF(AND($E10=\"\",$C10=$B$5),1,0))","v":0},{"$f":"IF($C10=$B$6,F10,0)","v":0},{"$f":"(IF(AND($E10=\"\",$C10=$B$6),1,0))","v":0},{"$f":"IF($C10=$B$7,F10,0)","v":0},{"$f":"(IF(AND($E10=\"\",$C10=$B$7),1,0))","v":0},{"$nulls":5},{"$f":"U10+V10+W10","v":{"v":0,"d":"0.0"}},{"$f":"IF(X10=D10,1,0)","v":0},{"$f":"IF(X10=0,0,1)","v":0},{"$f":"IF(Y10+Z10=2,\"Korrekt\",\"\")","v":""}]
[2,{"$f":"'Wettkampf 1'!B11","v":"Trempeck Marco"},{"$f":"'Wettkampf 1'!C11","v":"Sögel II"},314.4,null,{"$f":"IF(E11=\"x\",\"0\",D11)","v":314.4},{"$f":"IF(C11=$B$2,F11,0)","v":314.4},{"$f":"(IF(AND($E11=\"\",$C11=$B$2),1,0))","v":1},{"$f":"IF($C11=$B$3,F11,0)","v":0},{"$f":"(IF(AND($E11=\"\",$C11=$B$3),1,0))","v":0},{"$f":"IF($C11=$B$4,F11,0)","v":0},{"$f":"(IF(AND($E11=\"\",$C11=$B$4),1,0))","v":0},{"$f":"IF($C11=$B$5,F11,0)","v":0},{"$f":"(IF(AND($E11=\"\",$C11=$B$5),1,0))","v":0},{"$f":"IF($C11=$B$6,F11,0)","v":0},{"$f":"(IF(AND($E11=\"\",$C11=$B$6),1,0))","v":0},{"$f":"IF($C11=$B$7,F11,0)","v":0},{"$f":"(IF(AND($E11=\"\",$C11=$B$7),1,0))","v":0},{"$nulls":5},{"$f":"U11+V11+W11","v":{"v":0,"d":"0.0"}},{"$f":"IF(X11=D11,1,0)","v":0},{"$f":"IF(X11=0,0,1)","v":0},{"$f":"IF(Y11+Z11=2,\"Korrekt\",\"\")","v":""}]
[3,{"$f":"'Wettkampf 1'!B12","v":"Robbers Heinz"},{"$f":"'Wettkampf 1'!C12","v":"Sögel II"},315.5,null,315.5,315.5,1,0,0,0,0,0,0,0,0,0,0,{"$nulls":5},{"v":0,"d":"0.0"},0,0,""]
[4,{"$f":"'Wettkampf 1'!B13","v":"Robbers Bernd"},{"$f":"'Wettkampf 1'!C13","v":"Sögel II"},308.7,null,308.7,308.7,1,0,0,0,0,0,0,0,0,0,0,{"$nulls":5},{"v":0,"d":"0.0"},0,0,""]
[5,{"$f":"'Wettkampf 1'!B14","v":"Husmann Michael"},{"$f":"'Wettkampf 1'!C14","v":"Sögel II"},305.5,"x","0","0",0,0,0,0,0,0,0,0,0,0,0,{"$nulls":5},{"v":0,"d":"0.0"},0,0,""]
[6,{"$f":"'Wettkampf 1'!B15","v":"Schütze 6"},{"$f":"'Wettkampf 1'!C15","v":"Sögel II"},null,"x","0","0",0,0,0,0,0,0,0,0,0,0,0,{"$nulls":5},{"v":0,"d":"0.0"},1,0,""]
[7,{"$f":"'Wettkampf 1'!B16","v":"Bunten Manfred"},{"$f":"'Wettkampf 1'!C16","v":"Ostenwalde I"},302.3,null,302.3,0,0,302.3,1,0,0,0,0,0,0,0,0,{"$nulls":5},{"v":0,"d":"0.0"},0,0,""]
[8,{"$f":"'Wettkampf 1'!B17","v":"Benten Helmut"},{"$f":"'Wettkampf 1'!C17","v":"Ostenwalde I"},297.6,null,297.6,0,0,297.6,1,0,0,0,0,0,0,0,0,{"$nulls":5},{"v":0,"d":"0.0"},0,0,""]
[9,{"$f":"'Wettkampf 1'!B18","v":"Meiners Bernd"},{"$f":"'Wettkampf 1'!C18","v":"Ostenwalde I"},312.5,null,312.5,0,0,312.5,1,0,0,0,0,0,0,0,0,{"$nulls":5},{"v":0,"d":"0.0"},0,0,""]
[10,{"$f":"'Wettkampf 1'!B19","v":"Meiners Martin"},{"$f":"'Wettkampf 1'!C19","v":"Ostenwalde I"},308.4,null,308.4,0,0,308.4,1,0,0,0,0,0,0,0,0,{"$nulls":5},{"v":0,"d":"0.0"},0,0,""]
[11,{"$f":"'Wettkampf 1'!B20","v":"Schütze 11"},{"$f":"'Wettkampf 1'!C20","v":"Ostenwalde I"},null,"x","0",0,0,"0",0,0,0,0,0,0,0,0,0,{"$nulls":5},{"v":0,"d":"0.0"},1,0,""]
[12,{"$f":"'Wettkampf 1'!B21","v":"Schütze 12"},{"$f":"'Wettkampf 1'!C21","v":"Ostenwalde I"},null,"x","0",0,0,"0",0,0,0,0,0,0,0,0,0,{"$nulls":5},{"v":0,"d":"0.0"},1,0,""]
[13,{"$f":"'Wettkampf 1'!B22","v":"Witting Bernhard"},{"$f":"'Wettkampf 1'!C22","v":"Neuvrees II"},309.8,null,309.8,0,0,0,0,309.8,1,0,0,0,0,0,0,{"$nulls":5},{"v":0,"d":"0.0"},0,0,""]
[14,{"$f":"'Wettkampf 1'!B23","v":"Szczepanski Holger"},{"$f":"'Wettkampf 1'!C23","v":"Neuvrees II"},306.2,null,306.2,0,0,0,0,306.2,1,0,0,0,0,0,0,{"$nulls":5},{"v":0,"d":"0.0"},0,0,""]
[15,{"$f":"'Wettkampf 1'!B24","v":"Schrand Karl-Heinz"},{"$f":"'Wettkampf 1'!C24","v":"Neuvrees II"},313.7,null,313.7,0,0,0,0,313.7,1,0,0,0,0,0,0,{"$nulls":5},{"v":0,"d":"0.0"},0,0,""]
[16,{"$f":"'Wettkampf 1'!B25","v":"Preut Hans"},{"$f":"'Wettkampf 1'!C25","v":"Neuvrees II"},304.4,"x","0",0,0,0,0,"0",0,0,0,0,0,0,0,{"$nulls":5},{"v":0,"d":"0.0"},0,0,""]
[17,{"$f":"'Wettkampf 1'!B26","v":"Thunert  Dirk"},{"$f":"'Wettkampf 1'!C26","v":"Neuvrees II"},307.4,null,307.4,0,0,0,0,307.4,1,0,0,0,0,0,0,{"$nulls":5},{"v":0,"d":"0.0"},0,0,""]
[18,{"$f":"'Wettkampf 1'!B27","v":"Schütze 18"},{"$f":"'Wettkampf 1'!C27","v":"Neuvrees II"},null,"x","0",0,0,0,0,"0",0,0,0,0,0,0,0,{"$nulls":5},{"v":0,"d":"0.0"},1,0,""]
[19,{"$f":"'Wettkampf 1'!B28","v":"Hömmen Bernd"},{"$f":"'Wettkampf 1'!C28","v":"Breddenberg IV"},302.6,null,302.6,0,0,0,0,0,0,302.6,1,0,0,0,0,{"$nulls":5},{"v":0,"d":"0.0"},0,0,""]
[20,{"$f":"'Wettkampf 1'!B29","v":"Hanekamp Rudi"},{"$f":"'Wettkampf 1'!C29","v":"Breddenberg IV"},{"v":304,"d":"304.0"},null,{"v":304,"d":"304.0"},0,0,0,0,0,0,304,1,0,0,0,0,{"$nulls":5},{"v":0,"d":"0.0"},0,0,""]
[21,{"$f":"'Wettkampf 1'!B30","v":"Köß Wilhelm"},{"$f":"'Wettkampf 1'!C30","v":"Breddenberg IV"},311.3,null,311.3,0,0,0,0,0,0,311.3,1,0,0,0,0,{"$nulls":5},{"v":0,"d":"0.0"},0,0,""]
[22,{"$f":"'Wettkampf 1'!B31","v":"Jansen  Martin"},{"$f":"'Wettkampf 1'!C31","v":"Breddenberg IV"},302.6,null,302.6,0,0,0,0,0,0,302.6,1,0,0,0,0,{"$nulls":5},{"v":0,"d":"0.0"},0,0,""]
[23,{"$f":"'Wettkampf 1'!B32","v":"Schütze 23"},{"$f":"'Wettkampf 1'!C32","v":"Breddenberg IV"},null,"x","0",0,0,0,0,0,0,"0",0,0,0,0,0,{"$nulls":5},{"v":0,"d":"0.0"},1,0,""]
[24,{"$f":"'Wettkampf 1'!B33","v":"Schütze 24"},{"$f":"'Wettkampf 1'!C33","v":"Breddenberg IV"},null,"x","0",0,0,0,0,0,0,"0",0,0,0,0,0,{"$nulls":5},{"v":0,"d":"0.0"},1,0,""]
[25,{"$f":"'Wettkampf 1'!B34","v":"Rolfes Willi"},{"$f":"'Wettkampf 1'!C34","v":"Neuvrees I"},{"v":312,"d":"312.0"},null,{"v":312,"d":"312.0"},0,0,0,0,0,0,0,0,312,1,0,0,{"$nulls":5},{"v":0,"d":"0.0"},0,0,""]
[26,{"$f":"'Wettkampf 1'!B35","v":"Breyer Wilfried"},{"$f":"'Wettkampf 1'!C35","v":"Neuvrees I"},312.2,null,312.2,0,0,0,0,0,0,0,0,312.2,1,0,0,{"$nulls":5},{"v":0,"d":"0.0"},0,0,""]
[27,{"$f":"'Wettkampf 1'!B36","v":"Janßen Markus"},{"$f":"'Wettkampf 1'!C36","v":"Neuvrees I"},{"v":308,"d":"308.0"},null,{"v":308,"d":"308.0"},0,0,0,0,0,0,0,0,308,1,0,0,{"$nulls":5},{"v":0,"d":"0.0"},0,0,""]
[28,{"$f":"'Wettkampf 1'!B37","v":"Steenken Klaus"},{"$f":"'Wettkampf 1'!C37","v":"Neuvrees I"},310.3,null,310.3,0,0,0,0,0,0,0,0,310.3,1,0,0,{"$nulls":5},{"v":0,"d":"0.0"},0,0,""]
[29,{"$f":"'Wettkampf 1'!B38","v":"Thyen Werner"},{"$f":"'Wettkampf 1'!C38","v":"Neuvrees I"},309.1,"x","0",0,0,0,0,0,0,0,0,"0",0,0,0,{"$nulls":5},{"v":0,"d":"0.0"},0,0,""]
[30,{"$f":"'Wettkampf 1'!B39","v":"Schütze 30"},{"$f":"'Wettkampf 1'!C39","v":"Neuvrees I"},null,"x","0",0,0,0,0,0,0,0,0,"0",0,0,0,{"$nulls":5},{"v":0,"d":"0.0"},1,0,""]
[31,{"$f":"'Wettkampf 1'!B40","v":"Schuckenbrock Simon"},{"$f":"'Wettkampf 1'!C40","v":"Börger III"},306.3,null,306.3,0,0,0,0,0,0,0,0,0,0,306.3,1,{"$nulls":5},{"v":0,"d":"0.0"},0,0,""]
[32,{"$f":"'Wettkampf 1'!B41","v":"Henzen Jens"},{"$f":"'Wettkampf 1'!C41","v":"Börger III"},308.9,null,308.9,0,0,0,0,0,0,0,0,0,0,308.9,1,{"$nulls":5},{"v":0,"d":"0.0"},0,0,""]
[33,{"$f":"'Wettkampf 1'!B42","v":"Sebers Daniel"},{"$f":"'Wettkampf 1'!C42","v":"Börger III"},311.2,null,311.2,0,0,0,0,0,0,0,0,0,0,311.2,1,{"$nulls":5},{"v":0,"d":"0.0"},0,0,""]
[34,{"$f":"'Wettkampf 1'!B43","v":"Rode Bernd"},{"$f":"'Wettkampf 1'!C43","v":"Börger III"},305.6,null,305.6,0,0,0,0,0,0,0,0,0,0,305.6,1,{"$nulls":5},{"v":0,"d":"0.0"},0,0,""]
[35,{"$f":"'Wettkampf 1'!B44","v":"Schroer Jürgen"},{"$f":"'Wettkampf 1'!C44","v":"Börger III"},307.4,"x","0",0,0,0,0,0,0,0,0,0,0,"0",0,{"$nulls":5},{"v":0,"d":"0.0"},0,0,""]
[36,{"$f":"'Wettkampf 1'!B45","v":"Schütze 36"},{"$f":"'Wettkampf 1'!C45","v":"Börger III"},null,"x","0",0,0,0,0,0,0,0,0,0,0,"0",0,{"$nulls":5},{"v":0,"d":"0.0"},1,0,""]
[{"$nulls":6},{"$f":"LARGE(G10:G45,1)+LARGE(G10:G45,2)+LARGE(G10:G45,3)","v":943.4},{"$f":"SUM(H10:H45)","v":4},{"$f":"LARGE(I10:I45,1)+LARGE(I10:I45,2)+LARGE(I10:I45,3)","v":923.2},{"$f":"SUM(J10:J45)","v":4},{"$f":"LARGE(K10:K45,1)+LARGE(K10:K45,2)+LARGE(K10:K45,3)","v":930.9},{"$f":"SUM(L10:L45)","v":4},{"$f":"LARGE(M10:M45,1)+LARGE(M10:M45,2)+LARGE(M10:M45,3)","v":917.9},{"$f":"SUM(N10:N45)","v":4},{"$f":"LARGE(O10:O45,1)+LARGE(O10:O45,2)+LARGE(O10:O45,3)","v":934.5},{"$f":"SUM(P10:P45)","v":4},{"$f":"LARGE(Q10:Q45,1)+LARGE(Q10:Q45,2)+LARGE(Q10:Q45,3)","v":926.3999999999999},{"$f":"SUM(R10:S45)","v":4}]
[null,null,"per Email an: sk-huemmling@gmx.de"]

{"sheet":"5","index":5,"n_rows":47,"n_cols":27,"rows_kept":47,"merged":[[0,22,0,23],[1,22,1,23],[4,22,4,23],[5,22,5,23],[6,22,6,23],[8,20,8,23]]}
[null,"Verein / Gruppe",null,"Ergebnisse",{"$nulls":17},"Austragungsort:",{"$f":"Übersicht!H4","v":"Neuvrees"}]
[1,{"$f":"'Wettkampf 1'!B2","v":"Sögel II"},null,{"$f":"G46","v":939.4},{"$f":"IF(H46>4,\"Es sind zu viele Schützen in Wertung!\",\" \")","v":" "},{"$nulls":16},"Wettkampftag:",{"$f":"Übersicht!H3","v":"20.11."}]
[2,{"$f":"'Wettkampf 1'!B3","v":"Ostenwalde I"},null,{"$f":"I46","v":{"v":923,"d":"923.0"}},{"$f":"IF(J46>4,\"Es sind zu viele Schützen in Wertung!\",\" \")","v":" "}]
[3,{"$f":"'Wettkampf 1'!B4","v":"Neuvrees II"},null,{"$f":"K46","v":932.3},{"$f":"IF(L46>4,\"Es sind zu viele Schützen in Wertung!\",\" \")","v":" "},{"$nulls":18},"Ansprechpartner für Rückfragen:"]
[4,{"$f":"'Wettkampf 1'!B5","v":"Breddenberg IV"},null,{"$f":"M46","v":914.8},{"$f":"IF(N46>4,\"Es sind zu viele Schützen in Wertung!\",\" \")","v":" "},{"$nulls":16},"Name:"]
[5,{"$f":"'Wettkampf 1'!B6","v":"Neuvrees I"},null,{"$f":"O46","v":{"v":924.8000000000001,"d":"924.8"}},{"$f":"IF(P46>4,\"Es sind zu viele Schützen in Wertung!\",\" \")","v":" "},{"$nulls":16},"Tel:"]
[6,{"$f":"'Wettkampf 1'!B7","v":"Börger III"},null,{"$f":"Q46","v":{"v":935,"d":"935.0"}},{"$f":"IF(R46>4,\"Es sind zu viele Schützen in Wertung!\",\" \")","v":" "},{"$nulls":16},"Standaufsicht:","eintragen"]
[]
[null,"Einzelergebnisse:","Verein / Gruppe","Ergebnisse (mindestens 0 eintragen)","AW? Dann x eintippen",null,"Verein 1",null,"Verein 2",null,"Verein 3",null,"Verein 4",null,"Verein 5",null,"Verein 6",{"$nulls":3},"Proberechnung bei Streifen:"]
[1,{"$f":"'Wettkampf 1'!B10","v":"Grünloh Michael"},{"$f":"'Wettkampf 1'!C10","v":"Sögel II"},310.8,null,{"$f":"IF(E10=\"x\",\"0\",D10)","v":310.8},{"$f":"IF(C10=$B$2,F10,0)","v":310.8},{"$f":"(IF(AND($E10=\"\",$C10=$B$2),1,0))","v":1},{"$f":"IF($C10=$B$3,F10,0)","v":0},{"$f":"(IF(AND($E10=\"\",$C10=$B$3),1,0))","v":0},{"$f":"IF($C10=$B$4,F10,0)","v":0},{"$f":"(IF(AND($E10=\"\",$C10=$B$4),1,0))","v":0},{"$f":"IF($C10=$B$5,F10,0)","v":0},{"$f":"(IF(AND($E10=\"\",$C10=$B$5),1,0))","v":0},{"$f":"IF($C10=$B$6,F10,0)","v":0},{"$f":"(IF(AND($E10=\"\",$C10=$B$6),1,0))","v":0},{"$f":"IF($C10=$B$7,F10,0)","v":0},{"$f":"(IF(AND($E10=\"\",$C10=$B$7),1,0))","v":0},{"$nulls":5},{"$f":"U10+V10+W10","v":{"v":0,"d":"0.0"}},{"$f":"IF(X10=D10,1,0)","v":0},{"$f":"IF(X10=0,0,1)","v":0},{"$f":"IF(Y10+Z10=2,\"Korrekt\",\"\")","v":""}]
[2,{"$f":"'Wettkampf 1'!B11","v":"Trempeck Marco"},{"$f":"'Wettkampf 1'!C11","v":"Sögel II"},{"v":313,"d":"313.0"},null,{"$f":"IF(E11=\"x\",\"0\",D11)","v":{"v":313,"d":"313.0"}},{"$f":"IF(C11=$B$2,F11,0)","v":313},{"$f":"(IF(AND($E11=\"\",$C11=$B$2),1,0))","v":1},{"$f":"IF($C11=$B$3,F11,0)","v":0},{"$f":"(IF(AND($E11=\"\",$C11=$B$3),1,0))","v":0},{"$f":"IF($C11=$B$4,F11,0)","v":0},{"$f":"(IF(AND($E11=\"\",$C11=$B$4),1,0))","v":0},{"$f":"IF($C11=$B$5,F11,0)","v":0},{"$f":"(IF(AND($E11=\"\",$C11=$B$5),1,0))","v":0},{"$f":"IF($C11=$B$6,F11,0)","v":0},{"$f":"(IF(AND($E11=\"\",$C11=$B$6),1,0))","v":0},{"$f":"IF($C11=$B$7,F11,0)","v":0},{"$f":"(IF(AND($E11=\"\",$C11=$B$7),1,0))","v":0},{"$nulls":5},{"$f":"U11+V11+W11","v":{"v":0,"d":"0.0"}},{"$f":"IF(X11=D11,1,0)","v":0},{"$f":"IF(X11=0,0,1)","v":0},{"$f":"IF(Y11+Z11=2,\"Korrekt\",\"\")","v":""}]
[3,{"$f":"'Wettkampf 1'!B12","v":"Robbers Heinz"},{"$f":"'Wettkampf 1'!C12","v":"Sögel II"},315.4,null,315.4,315.4,1,0,0,0,0,0,0,0,0,0,0,{"$nulls":5},{"v":0,"d":"0.0"},0,0,""]
[4,{"$f":"'Wettkampf 1'!B13","v":"Robbers Bernd"},{"$f":"'Wettkampf 1'!C13","v":"Sögel II"},{"v":311,"d":"311.0"},null,{"v":311,"d":"311.0"},311,1,0,0,0,0,0,0,0,0,0,0,{"$nulls":5},{"v":0,"d":"0.0"},0,0,""]
[5,{"$f":"'Wettkampf 1'!B14","v":"Husmann Michael"},{"$f":"'Wettkampf 1'!C14","v":"Sögel II"},301.9,"x","0","0",0,0,0,0,0,0,0,0,0,0,0,{"$nulls":5},{"v":0,"d":"0.0"},0,0,""]
[6,{"$f":"'Wettkampf 1'!B15","v":"Schütze 6"},{"$f":"'Wettkampf 1'!C15","v":"Sögel II"},null,"x","0","0",0,0,0,0,0,0,0,0,0,0,0,{"$nulls":5},{"v":0,"d":"0.0"},1,0,""]
[7,{"$f":"'Wettkampf 1'!B16","v":"Bunten Manfred"},{"$f":"'Wettkampf 1'!C16","v":"Ostenwalde I"},305.7,null,305.7,0,0,305.7,1,0,0,0,0,0,0,0,0,{"$nulls":5},{"v":0,"d":"0.0"},0,0,""]
[8,{"$f":"'Wettkampf 1'!B17","v":"Benten Helmut"},{"$f":"'Wettkampf 1'!C17","v":"Ostenwalde I"},299.7,null,299.7,0,0,299.7,1,0,0,0,0,0,0,0,0,{"$nulls":5},{"v":0,"d":"0.0"},0,0,""]
[9,{"$f":"'Wettkampf 1'!B18","v":"Meiners Bernd"},{"$f":"'Wettkampf 1'!C18","v":"Ostenwalde I"},307.4,null,307.4,0,0,307.4,1,0,0,0,0,0,0,0,0,{"$nulls":5},{"v":0,"d":"0.0"},0,0,""]
[10,{"$f":"'Wettkampf 1'!B19","v":"Meiners Martin"},{"$f":"'Wettkampf 1'!C19","v":"Ostenwalde I"},309.9,null,309.9,0,0,309.9,1,0,0,0,0,0,0,0,0,{"$nulls":5},{"v":0,"d":"0.0"},0,0,""]
[11,{"$f":"'Wettkampf 1'!B20","v":"Schütze 11"},{"$f":"'Wettkampf 1'!C20","v":"Ostenwalde I"},null,"x","0",0,0,"0",0,0,0,0,0,0,0,0,0,{"$nulls":5},{"v":0,"d":"0.0"},1,0,""]
[12,{"$f":"'Wettkampf 1'!B21","v":"Schütze 12"},{"$f":"'Wettkampf 1'!C21","v":"Ostenwalde I"},null,"x","0",0,0,"0",0,0,0,0,0,0,0,0,0,{"$nulls":5},{"v":0,"d":"0.0"},1,0,""]
[13,{"$f":"'Wettkampf 1'!B22","v":"Witting Bernhard"},{"$f":"'Wettkampf 1'!C22","v":"Neuvrees II"},309.5,null,309.5,0,0,0,0,309.5,1,0,0,0,0,0,0,{"$nulls":5},{"v":0,"d":"0.0"},0,0,""]
[14,{"$f":"'Wettkampf 1'!B23","v":"Szczepanski Holger"},{"$f":"'Wettkampf 1'!C23","v":"Neuvrees II"},311.1,null,311.1,0,0,0,0,311.1,1,0,0,0,0,0,0,{"$nulls":5},{"v":0,"d":"0.0"},0,0,""]
[15,{"$f":"'Wettkampf 1'!B24","v":"Schrand Karl-Heinz"},{"$f":"'Wettkampf 1'!C24","v":"Neuvrees II"},311.7,null,311.7,0,0,0,0,311.7,1,0,0,0,0,0,0,{"$nulls":5},{"v":0,"d":"0.0"},0,0,""]
[16,{"$f":"'Wettkampf 1'!B25","v":"Preut Hans"},{"$f":"'Wettkampf 1'!C25","v":"Neuvrees II"},306.1,null,306.1,0,0,0,0,306.1,1,0,0,0,0,0,0,{"$nulls":5},{"v":0,"d":"0.0"},0,0,""]
[17,{"$f":"'Wettkampf 1'!B26","v":"Thunert  Dirk"},{"$f":"'Wettkampf 1'!C26","v":"Neuvrees II"},307.5,"x","0",0,0,0,0,"0",0,0,0,0,0,0,0,{"$nulls":5},{"v":0,"d":"0.0"},0,0,""]
[18,{"$f":"'Wettkampf 1'!B27","v":"Schütze 18"},{"$f":"'Wettkampf 1'!C27","v":"Neuvrees II"},null,"x","0",0,0,0,0,"0",0,0,0,0,0,0,0,{"$nulls":5},{"v":0,"d":"0.0"},1,0,""]
[19,{"$f":"'Wettkampf 1'!B28","v":"Hömmen Bernd"},{"$f":"'Wettkampf 1'!C28","v":"Breddenberg IV"},301.3,null,301.3,0,0,0,0,0,0,301.3,1,0,0,0,0,{"$nulls":5},{"v":0,"d":"0.0"},0,0,""]
[20,{"$f":"'Wettkampf 1'!B29","v":"Hanekamp Rudi"},{"$f":"'Wettkampf 1'!C29","v":"Breddenberg IV"},291.9,null,291.9,0,0,0,0,0,0,291.9,1,0,0,0,0,{"$nulls":5},{"v":0,"d":"0.0"},0,0,""]
[21,{"$f":"'Wettkampf 1'!B30","v":"Köß Wilhelm"},{"$f":"'Wettkampf 1'!C30","v":"Breddenberg IV"},308.8,null,308.8,0,0,0,0,0,0,308.8,1,0,0,0,0,{"$nulls":5},{"v":0,"d":"0.0"},0,0,""]
[22,{"$f":"'Wettkampf 1'!B31","v":"Jansen  Martin"},{"$f":"'Wettkampf 1'!C31","v":"Breddenberg IV"},304.7,null,304.7,0,0,0,0,0,0,304.7,1,0,0,0,0,{"$nulls":5},{"v":0,"d":"0.0"},0,0,""]
[23,{"$f":"'Wettkampf 1'!B32","v":"Schütze 23"},{"$f":"'Wettkampf 1'!C32","v":"Breddenberg IV"},null,"x","0",0,0,0,0,0,0,"0",0,0,0,0,0,{"$nulls":5},{"v":0,"d":"0.0"},1,0,""]
[24,{"$f":"'Wettkampf 1'!B33","v":"Schütze 24"},{"$f":"'Wettkampf 1'!C33","v":"Breddenberg IV"},null,"x","0",0,0,0,0,0,0,"0",0,0,0,0,0,{"$nulls":5},{"v":0,"d":"0.0"},1,0,""]
[25,{"$f":"'Wettkampf 1'!B34","v":"Rolfes Willi"},{"$f":"'Wettkampf 1'!C34","v":"Neuvrees I"},309.5,null,309.5,0,0,0,0,0,0,0,0,309.5,1,0,0,{"$nulls":5},{"v":0,"d":"0.0"},0,0,""]
[26,{"$f":"'Wettkampf 1'!B35","v":"Breyer Wilfried"},{"$f":"'Wettkampf 1'!C35","v":"Neuvrees I"},309.2,null,309.2,0,0,0,0,0,0,0,0,309.2,1,0,0,{"$nulls":5},{"v":0,"d":"0.0"},0,0,""]
[27,{"$f":"'Wettkampf 1'!B36","v":"Janßen Markus"},{"$f":"'Wettkampf 1'!C36","v":"Neuvrees I"},306.1,null,306.1,0,0,0,0,0,0,0,0,306.1,1,0,0,{"$nulls":5},{"v":0,"d":"0.0"},0,0,""]
[28,{"$f":"'Wettkampf 1'!B37","v":"Steenken Klaus"},{"$f":"'Wettkampf 1'!C37","v":"Neuvrees I"},null,"x","0",0,0,0,0,0,0,0,0,"0",0,0,0,{"$nulls":5},{"v":0,"d":"0.0"},1,0,""]
[29,{"$f":"'Wettkampf 1'!B38","v":"Thyen Werner"},{"$f":"'Wettkampf 1'!C38","v":"Neuvrees I"},303.3,null,303.3,0,0,0,0,0,0,0,0,303.3,1,0,0,{"$nulls":5},{"v":0,"d":"0.0"},0,0,""]
[30,{"$f":"'Wettkampf 1'!B39","v":"Schütze 30"},{"$f":"'Wettkampf 1'!C39","v":"Neuvrees I"},null,"x","0",0,0,0,0,0,0,0,0,"0",0,0,0,{"$nulls":5},{"v":0,"d":"0.0"},1,0,""]
[31,{"$f":"'Wettkampf 1'!B40","v":"Schuckenbrock Simon"},{"$f":"'Wettkampf 1'!C40","v":"Börger III"},311.9,null,311.9,0,0,0,0,0,0,0,0,0,0,311.9,1,{"$nulls":5},{"v":0,"d":"0.0"},0,0,""]
[32,{"$f":"'Wettkampf 1'!B41","v":"Henzen Jens"},{"$f":"'Wettkampf 1'!C41","v":"Börger III"},311.5,null,311.5,0,0,0,0,0,0,0,0,0,0,311.5,1,{"$nulls":5},{"v":0,"d":"0.0"},0,0,""]
[33,{"$f":"'Wettkampf 1'!B42","v":"Sebers Daniel"},{"$f":"'Wettkampf 1'!C42","v":"Börger III"},311.6,null,311.6,0,0,0,0,0,0,0,0,0,0,311.6,1,{"$nulls":5},{"v":0,"d":"0.0"},0,0,""]
[34,{"$f":"'Wettkampf 1'!B43","v":"Rode Bernd"},{"$f":"'Wettkampf 1'!C43","v":"Börger III"},306.9,null,306.9,0,0,0,0,0,0,0,0,0,0,306.9,1,{"$nulls":5},{"v":0,"d":"0.0"},0,0,""]
[35,{"$f":"'Wettkampf 1'!B44","v":"Schroer Jürgen"},{"$f":"'Wettkampf 1'!C44","v":"Börger III"},303.1,"x","0",0,0,0,0,0,0,0,0,0,0,"0",0,{"$nulls":5},{"v":0,"d":"0.0"},0,0,""]
[36,{"$f":"'Wettkampf 1'!B45","v":"Schütze 36"},{"$f":"'Wettkampf 1'!C45","v":"Börger III"},null,"x","0",0,0,0,0,0,0,0,0,0,0,"0",0,{"$nulls":5},{"v":0,"d":"0.0"},1,0,""]
[{"$nulls":6},{"$f":"LARGE(G10:G45,1)+LARGE(G10:G45,2)+LARGE(G10:G45,3)","v":939.4},{"$f":"SUM(H10:H45)","v":4},{"$f":"LARGE(I10:I45,1)+LARGE(I10:I45,2)+LARGE(I10:I45,3)","v":923},{"$f":"SUM(J10:J45)","v":4},{"$f":"LARGE(K10:K45,1)+LARGE(K10:K45,2)+LARGE(K10:K45,3)","v":932.3},{"$f":"SUM(L10:L45)","v":4},{"$f":"LARGE(M10:M45,1)+LARGE(M10:M45,2)+LARGE(M10:M45,3)","v":914.8},{"$f":"SUM(N10:N45)","v":4},{"$f":"LARGE(O10:O45,1)+LARGE(O10:O45,2)+LARGE(O10:O45,3)","v":924.8000000000001},{"$f":"SUM(P10:P45)","v":4},{"$f":"LARGE(Q10:Q45,1)+LARGE(Q10:Q45,2)+LARGE(Q10:Q45,3)","v":935},{"$f":"SUM(R10:S45)","v":4}]
[null,null,"per Email an: sk-huemmling@gmx.de"]

{"sheet":"6","index":6,"n_rows":47,"n_cols":27,"rows_kept":47,"merged":[[0,22,0,23],[1,22,1,23],[4,22,4,23],[5,22,5,23],[6,22,6,23],[8,20,8,23]]}
[null,"Verein / Gruppe",null,"Ergebnisse",{"$nulls":17},"Austragungsort:",{"$f":"Übersicht!I4","v":"Börger"}]
[1,{"$f":"'Wettkampf 1'!B2","v":"Sögel II"},null,{"$f":"G46","v":940.4},{"$f":"IF(H46>4,\"Es sind zu viele Schützen in Wertung!\",\" \")","v":" "},{"$nulls":16},"Wettkampftag:",{"$f":"Übersicht!I3","v":"04.12."}]
[2,{"$f":"'Wettkampf 1'!B3","v":"Ostenwalde I"},null,{"$f":"I46","v":922.2},{"$f":"IF(J46>4,\"Es sind zu viele Schützen in Wertung!\",\" \")","v":" "}]
[3,{"$f":"'Wettkampf 1'!B4","v":"Neuvrees II"},null,{"$f":"K46","v":921.5},{"$f":"IF(L46>4,\"Es sind zu viele Schützen in Wertung!\",\" \")","v":" "},{"$nulls":18},"Ansprechpartner für Rückfragen:"]
[4,{"$f":"'Wettkampf 1'!B5","v":"Breddenberg IV"},null,{"$f":"M46","v":921.5},{"$f":"IF(N46>4,\"Es sind zu viele Schützen in Wertung!\",\" \")","v":" "},{"$nulls":16},"Name:"]
[5,{"$f":"'Wettkampf 1'!B6","v":"Neuvrees I"},null,{"$f":"O46","v":{"v":929.0999999999999,"d":"929.1"}},{"$f":"IF(P46>4,\"Es sind zu viele Schützen in Wertung!\",\" \")","v":" "},{"$nulls":16},"Tel:"]
[6,{"$f":"'Wettkampf 1'!B7","v":"Börger III"},null,{"$f":"Q46","v":939.6},{"$f":"IF(R46>4,\"Es sind zu viele Schützen in Wertung!\",\" \")","v":" "},{"$nulls":16},"Standaufsicht:","eintragen"]
[]
[null,"Einzelergebnisse:","Verein / Gruppe","Ergebnisse (mindestens 0 eintragen)","AW? Dann x eintippen",null,"Verein 1",null,"Verein 2",null,"Verein 3",null,"Verein 4",null,"Verein 5",null,"Verein 6",{"$nulls":3},"Proberechnung bei Streifen:"]
[1,{"$f":"'Wettkampf 1'!B10","v":"Grünloh Michael"},{"$f":"'Wettkampf 1'!C10","v":"Sögel II"},311.5,null,{"$f":"IF(E10=\"x\",\"0\",D10)","v":311.5},{"$f":"IF(C10=$B$2,F10,0)","v":311.5},{"$f":"(IF(AND($E10=\"\",$C10=$B$2),1,0))","v":1},{"$f":"IF($C10=$B$3,F10,0)","v":0},{"$f":"(IF(AND($E10=\"\",$C10=$B$3),1,0))","v":0},{"$f":"IF($C10=$B$4,F10,0)","v":0},{"$f":"(IF(AND($E10=\"\",$C10=$B$4),1,0))","v":0},{"$f":"IF($C10=$B$5,F10,0)","v":0},{"$f":"(IF(AND($E10=\"\",$C10=$B$5),1,0))","v":0},{"$f":"IF($C10=$B$6,F10,0)","v":0},{"$f":"(IF(AND($E10=\"\",$C10=$B$6),1,0))","v":0},{"$f":"IF($C10=$B$7,F10,0)","v":0},{"$f":"(IF(AND($E10=\"\",$C10=$B$7),1,0))","v":0},{"$nulls":5},{"$f":"U10+V10+W10","v":{"v":0,"d":"0.0"}},{"$f":"IF(X10=D10,1,0)","v":0},{"$f":"IF(X10=0,0,1)","v":0},{"$f":"IF(Y10+Z10=2,\"Korrekt\",\"\")","v":""}]
[2,{"$f":"'Wettkampf 1'!B11","v":"Trempeck Marco"},{"$f":"'Wettkampf 1'!C11","v":"Sögel II"},309.2,null,{"$f":"IF(E11=\"x\",\"0\",D11)","v":309.2},{"$f":"IF(C11=$B$2,F11,0)","v":309.2},{"$f":"(IF(AND($E11=\"\",$C11=$B$2),1,0))","v":1},{"$f":"IF($C11=$B$3,F11,0)","v":0},{"$f":"(IF(AND($E11=\"\",$C11=$B$3),1,0))","v":0},{"$f":"IF($C11=$B$4,F11,0)","v":0},{"$f":"(IF(AND($E11=\"\",$C11=$B$4),1,0))","v":0},{"$f":"IF($C11=$B$5,F11,0)","v":0},{"$f":"(IF(AND($E11=\"\",$C11=$B$5),1,0))","v":0},{"$f":"IF($C11=$B$6,F11,0)","v":0},{"$f":"(IF(AND($E11=\"\",$C11=$B$6),1,0))","v":0},{"$f":"IF($C11=$B$7,F11,0)","v":0},{"$f":"(IF(AND($E11=\"\",$C11=$B$7),1,0))","v":0},{"$nulls":5},{"$f":"U11+V11+W11","v":{"v":0,"d":"0.0"}},{"$f":"IF(X11=D11,1,0)","v":0},{"$f":"IF(X11=0,0,1)","v":0},{"$f":"IF(Y11+Z11=2,\"Korrekt\",\"\")","v":""}]
[3,{"$f":"'Wettkampf 1'!B12","v":"Robbers Heinz"},{"$f":"'Wettkampf 1'!C12","v":"Sögel II"},314.5,null,314.5,314.5,1,0,0,0,0,0,0,0,0,0,0,{"$nulls":5},{"v":0,"d":"0.0"},0,0,""]
[4,{"$f":"'Wettkampf 1'!B13","v":"Robbers Bernd"},{"$f":"'Wettkampf 1'!C13","v":"Sögel II"},314.4,null,314.4,314.4,1,0,0,0,0,0,0,0,0,0,0,{"$nulls":5},{"v":0,"d":"0.0"},0,0,""]
[5,{"$f":"'Wettkampf 1'!B14","v":"Husmann Michael"},{"$f":"'Wettkampf 1'!C14","v":"Sögel II"},302.7,"x","0","0",0,0,0,0,0,0,0,0,0,0,0,{"$nulls":5},{"v":0,"d":"0.0"},0,0,""]
[6,{"$f":"'Wettkampf 1'!B15","v":"Schütze 6"},{"$f":"'Wettkampf 1'!C15","v":"Sögel II"},null,"x","0","0",0,0,0,0,0,0,0,0,0,0,0,{"$nulls":5},{"v":0,"d":"0.0"},1,0,""]
[7,{"$f":"'Wettkampf 1'!B16","v":"Bunten Manfred"},{"$f":"'Wettkampf 1'!C16","v":"Ostenwalde I"},304.6,"x","0",0,0,"0",0,0,0,0,0,0,0,0,0,{"$nulls":5},{"v":0,"d":"0.0"},0,0,""]
[8,{"$f":"'Wettkampf 1'!B17","v":"Benten Helmut"},{"$f":"'Wettkampf 1'!C17","v":"Ostenwalde I"},307.3,null,307.3,0,0,307.3,1,0,0,0,0,0,0,0,0,{"$nulls":5},{"v":0,"d":"0.0"},0,0,""]
[9,{"$f":"'Wettkampf 1'!B18","v":"Meiners Bernd"},{"$f":"'Wettkampf 1'!C18","v":"Ostenwalde I"},306.8,null,306.8,0,0,306.8,1,0,0,0,0,0,0,0,0,{"$nulls":5},{"v":0,"d":"0.0"},0,0,""]
[10,{"$f":"'Wettkampf 1'!B19","v":"Meiners Martin"},{"$f":"'Wettkampf 1'!C19","v":"Ostenwalde I"},308.1,null,308.1,0,0,308.1,1,0,0,0,0,0,0,0,0,{"$nulls":5},{"v":0,"d":"0.0"},0,0,""]
[11,{"$f":"'Wettkampf 1'!B20","v":"Schütze 11"},{"$f":"'Wettkampf 1'!C20","v":"Ostenwalde I"},null,"x","0",0,0,"0",0,0,0,0,0,0,0,0,0,{"$nulls":5},{"v":0,"d":"0.0"},1,0,""]
[12,{"$f":"'Wettkampf 1'!B21","v":"Schütze 12"},{"$f":"'Wettkampf 1'!C21","v":"Ostenwalde I"},null,"x","0",0,0,"0",0,0,0,0,0,0,0,0,0,{"$nulls":5},{"v":0,"d":"0.0"},1,0,""]
[13,{"$f":"'Wettkampf 1'!B22","v":"Witting Bernhard"},{"$f":"'Wettkampf 1'!C22","v":"Neuvrees II"},308.2,null,308.2,0,0,0,0,308.2,1,0,0,0,0,0,0,{"$nulls":5},{"v":0,"d":"0.0"},0,0,""]
[14,{"$f":"'Wettkampf 1'!B23","v":"Szczepanski Holger"},{"$f":"'Wettkampf 1'!C23","v":"Neuvrees II"},306.7,null,306.7,0,0,0,0,306.7,1,0,0,0,0,0,0,{"$nulls":5},{"v":0,"d":"0.0"},0,0,""]
[15,{"$f":"'Wettkampf 1'!B24","v":"Schrand Karl-Heinz"},{"$f":"'Wettkampf 1'!C24","v":"Neuvrees II"},305.3,null,305.3,0,0,0,0,305.3,1,0,0,0,0,0,0,{"$nulls":5},{"v":0,"d":"0.0"},0,0,""]
[16,{"$f":"'Wettkampf 1'!B25","v":"Preut Hans"},{"$f":"'Wettkampf 1'!C25","v":"Neuvrees II"},{"v":309,"d":"309.0"},"x","0",0,0,0,0,"0",0,0,0,0,0,0,0,{"$nulls":5},{"v":0,"d":"0.0"},0,0,""]
[17,{"$f":"'Wettkampf 1'!B26","v":"Thunert  Dirk"},{"$f":"'Wettkampf 1'!C26","v":"Neuvrees II"},306.6,null,306.6,0,0,0,0,306.6,1,0,0,0,0,0,0,{"$nulls":5},{"v":0,"d":"0.0"},0,0,""]
[18,{"$f":"'Wettkampf 1'!B27","v":"Schütze 18"},{"$f":"'Wettkampf 1'!C27","v":"Neuvrees II"},null,"x","0",0,0,0,0,"0",0,0,0,0,0,0,0,{"$nulls":5},{"v":0,"d":"0.0"},1,0,""]
[19,{"$f":"'Wettkampf 1'!B28","v":"Hömmen Bernd"},{"$f":"'Wettkampf 1'!C28","v":"Breddenberg IV"},305.9,null,305.9,0,0,0,0,0,0,305.9,1,0,0,0,0,{"$nulls":5},{"v":0,"d":"0.0"},0,0,""]
[20,{"$f":"'Wettkampf 1'!B29","v":"Hanekamp Rudi"},{"$f":"'Wettkampf 1'!C29","v":"Breddenberg IV"},305.5,null,305.5,0,0,0,0,0,0,305.5,1,0,0,0,0,{"$nulls":5},{"v":0,"d":"0.0"},0,0,""]
[21,{"$f":"'Wettkampf 1'!B30","v":"Köß Wilhelm"},{"$f":"'Wettkampf 1'!C30","v":"Breddenberg IV"},310.1,null,310.1,0,0,0,0,0,0,310.1,1,0,0,0,0,{"$nulls":5},{"v":0,"d":"0.0"},0,0,""]
[22,{"$f":"'Wettkampf 1'!B31","v":"Jansen  Martin"},{"$f":"'Wettkampf 1'!C31","v":"Breddenberg IV"},300.2,null,300.2,0,0,0,0,0,0,300.2,1,0,0,0,0,{"$nulls":5},{"v":0,"d":"0.0"},0,0,""]
[23,{"$f":"'Wettkampf 1'!B32","v":"Schütze 23"},{"$f":"'Wettkampf 1'!C32","v":"Breddenberg IV"},null,"x","0",0,0,0,0,0,0,"0",0,0,0,0,0,{"$nulls":5},{"v":0,"d":"0.0"},1,0,""]
[24,{"$f":"'Wettkampf 1'!B33","v":"Schütze 24"},{"$f":"'Wettkampf 1'!C33","v":"Breddenberg IV"},null,"x","0",0,0,0,0,0,0,"0",0,0,0,0,0,{"$nulls":5},{"v":0,"d":"0.0"},1,0,""]
[25,{"$f":"'Wettkampf 1'!B34","v":"Rolfes Willi"},{"$f":"'Wettkampf 1'!C34","v":"Neuvrees I"},311.3,null,311.3,0,0,0,0,0,0,0,0,311.3,1,0,0,{"$nulls":5},{"v":0,"d":"0.0"},0,0,""]
[26,{"$f":"'Wettkampf 1'!B35","v":"Breyer Wilfried"},{"$f":"'Wettkampf 1'!C35","v":"Neuvrees I"},308.8,null,308.8,0,0,0,0,0,0,0,0,308.8,1,0,0,{"$nulls":5},{"v":0,"d":"0.0"},0,0,""]
[27,{"$f":"'Wettkampf 1'!B36","v":"Janßen Markus"},{"$f":"'Wettkampf 1'!C36","v":"Neuvrees I"},{"v":309,"d":"309.0"},null,{"v":309,"d":"309.0"},0,0,0,0,0,0,0,0,309,1,0,0,{"$nulls":5},{"v":0,"d":"0.0"},0,0,""]
[28,{"$f":"'Wettkampf 1'!B37","v":"Steenken Klaus"},{"$f":"'Wettkampf 1'!C37","v":"Neuvrees I"},null,"x","0",0,0,0,0,0,0,0,0,"0",0,0,0,{"$nulls":5},{"v":0,"d":"0.0"},1,0,""]
[29,{"$f":"'Wettkampf 1'!B38","v":"Thyen Werner"},{"$f":"'Wettkampf 1'!C38","v":"Neuvrees I"},300.9,null,300.9,0,0,0,0,0,0,0,0,300.9,1,0,0,{"$nulls":5},{"v":0,"d":"0.0"},0,0,""]
[30,{"$f":"'Wettkampf 1'!B39","v":"Schütze 30"},{"$f":"'Wettkampf 1'!C39","v":"Neuvrees I"},null,"x","0",0,0,0,0,0,0,0,0,"0",0,0,0,{"$nulls":5},{"v":0,"d":"0.0"},1,0,""]
[31,{"$f":"'Wettkampf 1'!B40","v":"Schuckenbrock Simon"},{"$f":"'Wettkampf 1'!C40","v":"Börger III"},311.9,null,311.9,0,0,0,0,0,0,0,0,0,0,311.9,1,{"$nulls":5},{"v":0,"d":"0.0"},0,0,""]
[32,{"$f":"'Wettkampf 1'!B41","v":"Henzen Jens"},{"$f":"'Wettkampf 1'!C41","v":"Börger III"},307.9,null,307.9,0,0,0,0,0,0,0,0,0,0,307.9,1,{"$nulls":5},{"v":0,"d":"0.0"},0,0,""]
[33,{"$f":"'Wettkampf 1'!B42","v":"Sebers Daniel"},{"$f":"'Wettkampf 1'!C42","v":"Börger III"},314.6,null,314.6,0,0,0,0,0,0,0,0,0,0,314.6,1,{"$nulls":5},{"v":0,"d":"0.0"},0,0,""]
[34,{"$f":"'Wettkampf 1'!B43","v":"Rode Bernd"},{"$f":"'Wettkampf 1'!C43","v":"Börger III"},313.1,null,313.1,0,0,0,0,0,0,0,0,0,0,313.1,1,{"$nulls":5},{"v":0,"d":"0.0"},0,0,""]
[35,{"$f":"'Wettkampf 1'!B44","v":"Schroer Jürgen"},{"$f":"'Wettkampf 1'!C44","v":"Börger III"},307.1,"x","0",0,0,0,0,0,0,0,0,0,0,"0",0,{"$nulls":5},{"v":0,"d":"0.0"},0,0,""]
[36,{"$f":"'Wettkampf 1'!B45","v":"Schütze 36"},{"$f":"'Wettkampf 1'!C45","v":"Börger III"},null,"x","0",0,0,0,0,0,0,0,0,0,0,"0",0,{"$nulls":5},{"v":0,"d":"0.0"},1,0,""]
[{"$nulls":6},{"$f":"LARGE(G10:G45,1)+LARGE(G10:G45,2)+LARGE(G10:G45,3)","v":940.4},{"$f":"SUM(H10:H45)","v":4},{"$f":"LARGE(I10:I45,1)+LARGE(I10:I45,2)+LARGE(I10:I45,3)","v":922.2},{"$f":"SUM(J10:J45)","v":3},{"$f":"LARGE(K10:K45,1)+LARGE(K10:K45,2)+LARGE(K10:K45,3)","v":921.5},{"$f":"SUM(L10:L45)","v":4},{"$f":"LARGE(M10:M45,1)+LARGE(M10:M45,2)+LARGE(M10:M45,3)","v":921.5},{"$f":"SUM(N10:N45)","v":4},{"$f":"LARGE(O10:O45,1)+LARGE(O10:O45,2)+LARGE(O10:O45,3)","v":929.0999999999999},{"$f":"SUM(P10:P45)","v":4},{"$f":"LARGE(Q10:Q45,1)+LARGE(Q10:Q45,2)+LARGE(Q10:Q45,3)","v":939.6},{"$f":"SUM(R10:S45)","v":4}]
[null,null,"per Email an: sk-huemmling@gmx.de"]

{"sheet":"7","index":7,"n_rows":47,"n_cols":27,"rows_kept":47,"merged":[[0,22,0,23],[1,22,1,23],[4,22,4,23],[5,22,5,23],[6,22,6,23],[8,20,8,23]]}
[null,"Verein / Gruppe",null,"Ergebnisse",{"$nulls":17},"Austragungsort:",{"$f":"Übersicht!L4","v":"Sögel "}]
[1,{"$f":"'Wettkampf 1'!B2","v":"Sögel II"},null,{"$f":"G46","v":{"v":944.0999999999999,"d":"944.1"}},{"$f":"IF(H46>4,\"Es sind zu viele Schützen in Wertung!\",\" \")","v":" "},{"$nulls":16},"Wettkampftag:",{"$f":"Übersicht!L3","v":"22.01."}]
[2,{"$f":"'Wettkampf 1'!B3","v":"Ostenwalde I"},null,{"$f":"I46","v":925.1},{"$f":"IF(J46>4,\"Es sind zu viele Schützen in Wertung!\",\" \")","v":" "}]
[3,{"$f":"'Wettkampf 1'!B4","v":"Neuvrees II"},null,{"$f":"K46","v":{"v":922.8000000000001,"d":"922.8"}},{"$f":"IF(L46>4,\"Es sind zu viele Schützen in Wertung!\",\" \")","v":" "},{"$nulls":18},"Ansprechpartner für Rückfragen:"]
[4,{"$f":"'Wettkampf 1'!B5","v":"Breddenberg IV"},null,{"$f":"M46","v":929.8},{"$f":"IF(N46>4,\"Es sind zu viele Schützen in Wertung!\",\" \")","v":" "},{"$nulls":16},"Name:"]
[5,{"$f":"'Wettkampf 1'!B6","v":"Neuvrees I"},null,{"$f":"O46","v":919.5},{"$f":"IF(P46>4,\"Es sind zu viele Schützen in Wertung!\",\" \")","v":" "},{"$nulls":16},"Tel:"]
[6,{"$f":"'Wettkampf 1'!B7","v":"Börger III"},null,{"$f":"Q46","v":{"v":934.3999999999999,"d":"934.4"}},{"$f":"IF(R46>4,\"Es sind zu viele Schützen in Wertung!\",\" \")","v":" "},{"$nulls":16},"Standaufsicht:","eintragen"]
[]
[null,"Einzelergebnisse:","Verein / Gruppe","Ergebnisse (mindestens 0 eintragen)","AW? Dann x eintippen",null,"Verein 1",null,"Verein 2",null,"Verein 3",null,"Verein 4",null,"Verein 5",null,"Verein 6",{"$nulls":3},"Proberechnung bei Streifen:"]
[1,{"$f":"'Wettkampf 1'!B10","v":"Grünloh Michael"},{"$f":"'Wettkampf 1'!C10","v":"Sögel II"},313.9,null,{"$f":"IF(E10=\"x\",\"0\",D10)","v":313.9},{"$f":"IF(C10=$B$2,F10,0)","v":313.9},{"$f":"(IF(AND($E10=\"\",$C10=$B$2),1,0))","v":1},{"$f":"IF($C10=$B$3,F10,0)","v":0},{"$f":"(IF(AND($E10=\"\",$C10=$B$3),1,0))","v":0},{"$f":"IF($C10=$B$4,F10,0)","v":0},{"$f":"(IF(AND($E10=\"\",$C10=$B$4),1,0))","v":0},{"$f":"IF($C10=$B$5,F10,0)","v":0},{"$f":"(IF(AND($E10=\"\",$C10=$B$5),1,0))","v":0},{"$f":"IF($C10=$B$6,F10,0)","v":0},{"$f":"(IF(AND($E10=\"\",$C10=$B$6),1,0))","v":0},{"$f":"IF($C10=$B$7,F10,0)","v":0},{"$f":"(IF(AND($E10=\"\",$C10=$B$7),1,0))","v":0},{"$nulls":5},{"$f":"U10+V10+W10","v":{"v":0,"d":"0.0"}},{"$f":"IF(X10=D10,1,0)","v":0},{"$f":"IF(X10=0,0,1)","v":0},{"$f":"IF(Y10+Z10=2,\"Korrekt\",\"\")","v":""}]
[2,{"$f":"'Wettkampf 1'!B11","v":"Trempeck Marco"},{"$f":"'Wettkampf 1'!C11","v":"Sögel II"},307.9,null,{"$f":"IF(E11=\"x\",\"0\",D11)","v":307.9},{"$f":"IF(C11=$B$2,F11,0)","v":307.9},{"$f":"(IF(AND($E11=\"\",$C11=$B$2),1,0))","v":1},{"$f":"IF($C11=$B$3,F11,0)","v":0},{"$f":"(IF(AND($E11=\"\",$C11=$B$3),1,0))","v":0},{"$f":"IF($C11=$B$4,F11,0)","v":0},{"$f":"(IF(AND($E11=\"\",$C11=$B$4),1,0))","v":0},{"$f":"IF($C11=$B$5,F11,0)","v":0},{"$f":"(IF(AND($E11=\"\",$C11=$B$5),1,0))","v":0},{"$f":"IF($C11=$B$6,F11,0)","v":0},{"$f":"(IF(AND($E11=\"\",$C11=$B$6),1,0))","v":0},{"$f":"IF($C11=$B$7,F11,0)","v":0},{"$f":"(IF(AND($E11=\"\",$C11=$B$7),1,0))","v":0},{"$nulls":5},{"$f":"U11+V11+W11","v":{"v":0,"d":"0.0"}},{"$f":"IF(X11=D11,1,0)","v":0},{"$f":"IF(X11=0,0,1)","v":0},{"$f":"IF(Y11+Z11=2,\"Korrekt\",\"\")","v":""}]
[3,{"$f":"'Wettkampf 1'!B12","v":"Robbers Heinz"},{"$f":"'Wettkampf 1'!C12","v":"Sögel II"},312.2,null,312.2,312.2,1,0,0,0,0,0,0,0,0,0,0,{"$nulls":5},{"v":0,"d":"0.0"},0,0,""]
[4,{"$f":"'Wettkampf 1'!B13","v":"Robbers Bernd"},{"$f":"'Wettkampf 1'!C13","v":"Sögel II"},{"v":318,"d":"318.0"},null,{"v":318,"d":"318.0"},318,1,0,0,0,0,0,0,0,0,0,0,{"$nulls":5},{"v":0,"d":"0.0"},0,0,""]
[5,{"$f":"'Wettkampf 1'!B14","v":"Husmann Michael"},{"$f":"'Wettkampf 1'!C14","v":"Sögel II"},305.9,"x","0","0",0,0,0,0,0,0,0,0,0,0,0,{"$nulls":5},{"v":0,"d":"0.0"},0,0,""]
[6,{"$f":"'Wettkampf 1'!B15","v":"Schütze 6"},{"$f":"'Wettkampf 1'!C15","v":"Sögel II"},null,"x","0","0",0,0,0,0,0,0,0,0,0,0,0,{"$nulls":5},{"v":0,"d":"0.0"},1,0,""]
[7,{"$f":"'Wettkampf 1'!B16","v":"Bunten Manfred"},{"$f":"'Wettkampf 1'!C16","v":"Ostenwalde I"},{"v":308,"d":"308.0"},null,{"v":308,"d":"308.0"},0,0,308,1,0,0,0,0,0,0,0,0,{"$nulls":5},{"v":0,"d":"0.0"},0,0,""]
[8,{"$f":"'Wettkampf 1'!B17","v":"Benten Helmut"},{"$f":"'Wettkampf 1'!C17","v":"Ostenwalde I"},295.9,null,295.9,0,0,295.9,1,0,0,0,0,0,0,0,0,{"$nulls":5},{"v":0,"d":"0.0"},0,0,""]
[9,{"$f":"'Wettkampf 1'!B18","v":"Meiners Bernd"},{"$f":"'Wettkampf 1'!C18","v":"Ostenwalde I"},{"v":310,"d":"310.0"},null,{"v":310,"d":"310.0"},0,0,310,1,0,0,0,0,0,0,0,0,{"$nulls":5},{"v":0,"d":"0.0"},0,0,""]
[10,{"$f":"'Wettkampf 1'!B19","v":"Meiners Martin"},{"$f":"'Wettkampf 1'!C19","v":"Ostenwalde I"},307.1,null,307.1,0,0,307.1,1,0,0,0,0,0,0,0,0,{"$nulls":5},{"v":0,"d":"0.0"},0,0,""]
[11,{"$f":"'Wettkampf 1'!B20","v":"Schütze 11"},{"$f":"'Wettkampf 1'!C20","v":"Ostenwalde I"},null,"x","0",0,0,"0",0,0,0,0,0,0,0,0,0,{"$nulls":5},{"v":0,"d":"0.0"},1,0,""]
[12,{"$f":"'Wettkampf 1'!B21","v":"Schütze 12"},{"$f":"'Wettkampf 1'!C21","v":"Ostenwalde I"},null,"x","0",0,0,"0",0,0,0,0,0,0,0,0,0,{"$nulls":5},{"v":0,"d":"0.0"},1,0,""]
[13,{"$f":"'Wettkampf 1'!B22","v":"Witting Bernhard"},{"$f":"'Wettkampf 1'!C22","v":"Neuvrees II"},306.4,null,306.4,0,0,0,0,306.4,1,0,0,0,0,0,0,{"$nulls":5},{"v":0,"d":"0.0"},0,0,""]
[14,{"$f":"'Wettkampf 1'!B23","v":"Szczepanski Holger"},{"$f":"'Wettkampf 1'!C23","v":"Neuvrees II"},306.8,null,306.8,0,0,0,0,306.8,1,0,0,0,0,0,0,{"$nulls":5},{"v":0,"d":"0.0"},0,0,""]
[15,{"$f":"'Wettkampf 1'!B24","v":"Schrand Karl-Heinz"},{"$f":"'Wettkampf 1'!C24","v":"Neuvrees II"},309.6,null,309.6,0,0,0,0,309.6,1,0,0,0,0,0,0,{"$nulls":5},{"v":0,"d":"0.0"},0,0,""]
[16,{"$f":"'Wettkampf 1'!B25","v":"Preut Hans"},{"$f":"'Wettkampf 1'!C25","v":"Neuvrees II"},{"v":305,"d":"305.0"},null,{"v":305,"d":"305.0"},0,0,0,0,305,1,0,0,0,0,0,0,{"$nulls":5},{"v":0,"d":"0.0"},0,0,""]
[17,{"$f":"'Wettkampf 1'!B26","v":"Thunert  Dirk"},{"$f":"'Wettkampf 1'!C26","v":"Neuvrees II"},308.8,"x","0",0,0,0,0,"0",0,0,0,0,0,0,0,{"$nulls":5},{"v":0,"d":"0.0"},0,0,""]
[18,{"$f":"'Wettkampf 1'!B27","v":"Schütze 18"},{"$f":"'Wettkampf 1'!C27","v":"Neuvrees II"},null,"x","0",0,0,0,0,"0",0,0,0,0,0,0,0,{"$nulls":5},{"v":0,"d":"0.0"},1,0,""]
[19,{"$f":"'Wettkampf 1'!B28","v":"Hömmen Bernd"},{"$f":"'Wettkampf 1'!C28","v":"Breddenberg IV"},308.4,null,308.4,0,0,0,0,0,0,308.4,1,0,0,0,0,{"$nulls":5},{"v":0,"d":"0.0"},0,0,""]
[20,{"$f":"'Wettkampf 1'!B29","v":"Hanekamp Rudi"},{"$f":"'Wettkampf 1'!C29","v":"Breddenberg IV"},299.4,null,299.4,0,0,0,0,0,0,299.4,1,0,0,0,0,{"$nulls":5},{"v":0,"d":"0.0"},0,0,""]
[21,{"$f":"'Wettkampf 1'!B30","v":"Köß Wilhelm"},{"$f":"'Wettkampf 1'!C30","v":"Breddenberg IV"},313.6,null,313.6,0,0,0,0,0,0,313.6,1,0,0,0,0,{"$nulls":5},{"v":0,"d":"0.0"},0,0,""]
[22,{"$f":"'Wettkampf 1'!B31","v":"Jansen  Martin"},{"$f":"'Wettkampf 1'!C31","v":"Breddenberg IV"},307.8,null,307.8,0,0,0,0,0,0,307.8,1,0,0,0,0,{"$nulls":5},{"v":0,"d":"0.0"},0,0,""]
[23,{"$f":"'Wettkampf 1'!B32","v":"Schütze 23"},{"$f":"'Wettkampf 1'!C32","v":"Breddenberg IV"},null,"x","0",0,0,0,0,0,0,"0",0,0,0,0,0,{"$nulls":5},{"v":0,"d":"0.0"},1,0,""]
[24,{"$f":"'Wettkampf 1'!B33","v":"Schütze 24"},{"$f":"'Wettkampf 1'!C33","v":"Breddenberg IV"},null,"x","0",0,0,0,0,0,0,"0",0,0,0,0,0,{"$nulls":5},{"v":0,"d":"0.0"},1,0,""]
[25,{"$f":"'Wettkampf 1'!B34","v":"Rolfes Willi"},{"$f":"'Wettkampf 1'!C34","v":"Neuvrees I"},309.2,null,309.2,0,0,0,0,0,0,0,0,309.2,1,0,0,{"$nulls":5},{"v":0,"d":"0.0"},0,0,""]
[26,{"$f":"'Wettkampf 1'!B35","v":"Breyer Wilfried"},{"$f":"'Wettkampf 1'!C35","v":"Neuvrees I"},300.1,null,300.1,0,0,0,0,0,0,0,0,300.1,1,0,0,{"$nulls":5},{"v":0,"d":"0.0"},0,0,""]
[27,{"$f":"'Wettkampf 1'!B36","v":"Janßen Markus"},{"$f":"'Wettkampf 1'!C36","v":"Neuvrees I"},305.6,null,305.6,0,0,0,0,0,0,0,0,305.6,1,0,0,{"$nulls":5},{"v":0,"d":"0.0"},0,0,""]
[28,{"$f":"'Wettkampf 1'!B37","v":"Steenken Klaus"},{"$f":"'Wettkampf 1'!C37","v":"Neuvrees I"},null,"x","0",0,0,0,0,0,0,0,0,"0",0,0,0,{"$nulls":5},{"v":0,"d":"0.0"},1,0,""]
[29,{"$f":"'Wettkampf 1'!B38","v":"Thyen Werner"},{"$f":"'Wettkampf 1'!C38","v":"Neuvrees I"},304.7,null,304.7,0,0,0,0,0,0,0,0,304.7,1,0,0,{"$nulls":5},{"v":0,"d":"0.0"},0,0,""]
[30,{"$f":"'Wettkampf 1'!B39","v":"Schütze 30"},{"$f":"'Wettkampf 1'!C39","v":"Neuvrees I"},null,"x","0",0,0,0,0,0,0,0,0,"0",0,0,0,{"$nulls":5},{"v":0,"d":"0.0"},1,0,""]
[31,{"$f":"'Wettkampf 1'!B40","v":"Schuckenbrock Simon"},{"$f":"'Wettkampf 1'!C40","v":"Börger III"},311.4,null,311.4,0,0,0,0,0,0,0,0,0,0,311.4,1,{"$nulls":5},{"v":0,"d":"0.0"},0,0,""]
[32,{"$f":"'Wettkampf 1'!B41","v":"Henzen Jens"},{"$f":"'Wettkampf 1'!C41","v":"Börger III"},313.2,null,313.2,0,0,0,0,0,0,0,0,0,0,313.2,1,{"$nulls":5},{"v":0,"d":"0.0"},0,0,""]
[33,{"$f":"'Wettkampf 1'!B42","v":"Sebers Daniel"},{"$f":"'Wettkampf 1'!C42","v":"Börger III"},309.8,null,309.8,0,0,0,0,0,0,0,0,0,0,309.8,1,{"$nulls":5},{"v":0,"d":"0.0"},0,0,""]
[34,{"$f":"'Wettkampf 1'!B43","v":"Rode Bernd"},{"$f":"'Wettkampf 1'!C43","v":"Börger III"},305.8,null,305.8,0,0,0,0,0,0,0,0,0,0,305.8,1,{"$nulls":5},{"v":0,"d":"0.0"},0,0,""]
[35,{"$f":"'Wettkampf 1'!B44","v":"Schroer Jürgen"},{"$f":"'Wettkampf 1'!C44","v":"Börger III"},306.5,"x","0",0,0,0,0,0,0,0,0,0,0,"0",0,{"$nulls":5},{"v":0,"d":"0.0"},0,0,""]
[36,{"$f":"'Wettkampf 1'!B45","v":"Schütze 36"},{"$f":"'Wettkampf 1'!C45","v":"Börger III"},null,"x","0",0,0,0,0,0,0,0,0,0,0,"0",0,{"$nulls":5},{"v":0,"d":"0.0"},1,0,""]
[{"$nulls":6},{"$f":"LARGE(G10:G45,1)+LARGE(G10:G45,2)+LARGE(G10:G45,3)","v":944.0999999999999},{"$f":"SUM(H10:H45)","v":4},{"$f":"LARGE(I10:I45,1)+LARGE(I10:I45,2)+LARGE(I10:I45,3)","v":925.1},{"$f":"SUM(J10:J45)","v":4},{"$f":"LARGE(K10:K45,1)+LARGE(K10:K45,2)+LARGE(K10:K45,3)","v":922.8000000000001},{"$f":"SUM(L10:L45)","v":4},{"$f":"LARGE(M10:M45,1)+LARGE(M10:M45,2)+LARGE(M10:M45,3)","v":929.8},{"$f":"SUM(N10:N45)","v":4},{"$f":"LARGE(O10:O45,1)+LARGE(O10:O45,2)+LARGE(O10:O45,3)","v":919.5},{"$f":"SUM(P10:P45)","v":4},{"$f":"LARGE(Q10:Q45,1)+LARGE(Q10:Q45,2)+LARGE(Q10:Q45,3)","v":934.3999999999999},{"$f":"SUM(R10:S45)","v":4}]
[null,null,"per Email an: sk-huemmling@gmx.de"]

{"sheet":"8","index":8,"n_rows":47,"n_cols":27,"rows_kept":47,"merged":[[0,22,0,23],[1,22,1,23],[4,22,4,23],[5,22,5,23],[6,22,6,23],[8,20,8,23]]}
[null,"Verein / Gruppe",null,"Ergebnisse",{"$nulls":17},"Austragungsort:",{"$f":"Übersicht!M4","v":"Ostenwalde "}]
[1,{"$f":"'Wettkampf 1'!B2","v":"Sögel II"},null,{"$f":"G46","v":936.4},{"$f":"IF(H46>4,\"Es sind zu viele Schützen in Wertung!\",\" \")","v":" "},{"$nulls":16},"Wettkampftag:",{"$f":"Übersicht!M3","v":"05.02."}]
[2,{"$f":"'Wettkampf 1'!B3","v":"Ostenwalde I"},null,{"$f":"I46","v":{"v":921.1999999999999,"d":"921.2"}},{"$f":"IF(J46>4,\"Es sind zu viele Schützen in Wertung!\",\" \")","v":" "}]
[3,{"$f":"'Wettkampf 1'!B4","v":"Neuvrees II"},null,{"$f":"K46","v":928.9},{"$f":"IF(L46>4,\"Es sind zu viele Schützen in Wertung!\",\" \")","v":" "},{"$nulls":18},"Ansprechpartner für Rückfragen:"]
[4,{"$f":"'Wettkampf 1'!B5","v":"Breddenberg IV"},null,{"$f":"M46","v":922.2},{"$f":"IF(N46>4,\"Es sind zu viele Schützen in Wertung!\",\" \")","v":" "},{"$nulls":16},"Name:"]
[5,{"$f":"'Wettkampf 1'!B6","v":"Neuvrees I"},null,{"$f":"O46","v":{"v":939.5999999999999,"d":"939.6"}},{"$f":"IF(P46>4,\"Es sind zu viele Schützen in Wertung!\",\" \")","v":" "},{"$nulls":16},"Tel:"]
[6,{"$f":"'Wettkampf 1'!B7","v":"Börger III"},null,{"$f":"Q46","v":{"v":925.3000000000001,"d":"925.3"}},{"$f":"IF(R46>4,\"Es sind zu viele Schützen in Wertung!\",\" \")","v":" "},{"$nulls":16},"Standaufsicht:","eintragen"]
[]
[null,"Einzelergebnisse:","Verein / Gruppe","Ergebnisse (mindestens 0 eintragen)","AW? Dann x eintippen",null,"Verein 1",null,"Verein 2",null,"Verein 3",null,"Verein 4",null,"Verein 5",null,"Verein 6",{"$nulls":3},"Proberechnung bei Streifen:"]
[1,{"$f":"'Wettkampf 1'!B10","v":"Grünloh Michael"},{"$f":"'Wettkampf 1'!C10","v":"Sögel II"},311.2,null,{"$f":"IF(E10=\"x\",\"0\",D10)","v":311.2},{"$f":"IF(C10=$B$2,F10,0)","v":311.2},{"$f":"(IF(AND($E10=\"\",$C10=$B$2),1,0))","v":1},{"$f":"IF($C10=$B$3,F10,0)","v":0},{"$f":"(IF(AND($E10=\"\",$C10=$B$3),1,0))","v":0},{"$f":"IF($C10=$B$4,F10,0)","v":0},{"$f":"(IF(AND($E10=\"\",$C10=$B$4),1,0))","v":0},{"$f":"IF($C10=$B$5,F10,0)","v":0},{"$f":"(IF(AND($E10=\"\",$C10=$B$5),1,0))","v":0},{"$f":"IF($C10=$B$6,F10,0)","v":0},{"$f":"(IF(AND($E10=\"\",$C10=$B$6),1,0))","v":0},{"$f":"IF($C10=$B$7,F10,0)","v":0},{"$f":"(IF(AND($E10=\"\",$C10=$B$7),1,0))","v":0},{"$nulls":5},{"$f":"U10+V10+W10","v":{"v":0,"d":"0.0"}},{"$f":"IF(X10=D10,1,0)","v":0},{"$f":"IF(X10=0,0,1)","v":0},{"$f":"IF(Y10+Z10=2,\"Korrekt\",\"\")","v":""}]
[2,{"$f":"'Wettkampf 1'!B11","v":"Trempeck Marco"},{"$f":"'Wettkampf 1'!C11","v":"Sögel II"},311.4,null,{"$f":"IF(E11=\"x\",\"0\",D11)","v":311.4},{"$f":"IF(C11=$B$2,F11,0)","v":311.4},{"$f":"(IF(AND($E11=\"\",$C11=$B$2),1,0))","v":1},{"$f":"IF($C11=$B$3,F11,0)","v":0},{"$f":"(IF(AND($E11=\"\",$C11=$B$3),1,0))","v":0},{"$f":"IF($C11=$B$4,F11,0)","v":0},{"$f":"(IF(AND($E11=\"\",$C11=$B$4),1,0))","v":0},{"$f":"IF($C11=$B$5,F11,0)","v":0},{"$f":"(IF(AND($E11=\"\",$C11=$B$5),1,0))","v":0},{"$f":"IF($C11=$B$6,F11,0)","v":0},{"$f":"(IF(AND($E11=\"\",$C11=$B$6),1,0))","v":0},{"$f":"IF($C11=$B$7,F11,0)","v":0},{"$f":"(IF(AND($E11=\"\",$C11=$B$7),1,0))","v":0},{"$nulls":5},{"$f":"U11+V11+W11","v":{"v":0,"d":"0.0"}},{"$f":"IF(X11=D11,1,0)","v":0},{"$f":"IF(X11=0,0,1)","v":0},{"$f":"IF(Y11+Z11=2,\"Korrekt\",\"\")","v":""}]
[3,{"$f":"'Wettkampf 1'!B12","v":"Robbers Heinz"},{"$f":"'Wettkampf 1'!C12","v":"Sögel II"},312.9,null,312.9,312.9,1,0,0,0,0,0,0,0,0,0,0,{"$nulls":5},{"v":0,"d":"0.0"},0,0,""]
[4,{"$f":"'Wettkampf 1'!B13","v":"Robbers Bernd"},{"$f":"'Wettkampf 1'!C13","v":"Sögel II"},312.1,null,312.1,312.1,1,0,0,0,0,0,0,0,0,0,0,{"$nulls":5},{"v":0,"d":"0.0"},0,0,""]
[5,{"$f":"'Wettkampf 1'!B14","v":"Husmann Michael"},{"$f":"'Wettkampf 1'!C14","v":"Sögel II"},305.2,"x","0","0",0,0,0,0,0,0,0,0,0,0,0,{"$nulls":5},{"v":0,"d":"0.0"},0,0,""]
[6,{"$f":"'Wettkampf 1'!B15","v":"Schütze 6"},{"$f":"'Wettkampf 1'!C15","v":"Sögel II"},null,"x","0","0",0,0,0,0,0,0,0,0,0,0,0,{"$nulls":5},{"v":0,"d":"0.0"},1,0,""]
[7,{"$f":"'Wettkampf 1'!B16","v":"Bunten Manfred"},{"$f":"'Wettkampf 1'!C16","v":"Ostenwalde I"},307.3,null,307.3,0,0,307.3,1,0,0,0,0,0,0,0,0,{"$nulls":5},{"v":0,"d":"0.0"},0,0,""]
[8,{"$f":"'Wettkampf 1'!B17","v":"Benten Helmut"},{"$f":"'Wettkampf 1'!C17","v":"Ostenwalde I"},303.6,null,303.6,0,0,303.6,1,0,0,0,0,0,0,0,0,{"$nulls":5},{"v":0,"d":"0.0"},0,0,""]
[9,{"$f":"'Wettkampf 1'!B18","v":"Meiners Bernd"},{"$f":"'Wettkampf 1'!C18","v":"Ostenwalde I"},303.9,null,303.9,0,0,303.9,1,0,0,0,0,0,0,0,0,{"$nulls":5},{"v":0,"d":"0.0"},0,0,""]
[10,{"$f":"'Wettkampf 1'!B19","v":"Meiners Martin"},{"$f":"'Wettkampf 1'!C19","v":"Ostenwalde I"},{"v":310,"d":"310.0"},null,{"v":310,"d":"310.0"},0,0,310,1,0,0,0,0,0,0,0,0,{"$nulls":5},{"v":0,"d":"0.0"},0,0,""]
[11,{"$f":"'Wettkampf 1'!B20","v":"Schütze 11"},{"$f":"'Wettkampf 1'!C20","v":"Ostenwalde I"},null,"x","0",0,0,"0",0,0,0,0,0,0,0,0,0,{"$nulls":5},{"v":0,"d":"0.0"},1,0,""]
[12,{"$f":"'Wettkampf 1'!B21","v":"Schütze 12"},{"$f":"'Wettkampf 1'!C21","v":"Ostenwalde I"},null,"x","0",0,0,"0",0,0,0,0,0,0,0,0,0,{"$nulls":5},{"v":0,"d":"0.0"},1,0,""]
[13,{"$f":"'Wettkampf 1'!B22","v":"Witting Bernhard"},{"$f":"'Wettkampf 1'!C22","v":"Neuvrees II"},310.8,null,310.8,0,0,0,0,310.8,1,0,0,0,0,0,0,{"$nulls":5},{"v":0,"d":"0.0"},0,0,""]
[14,{"$f":"'Wettkampf 1'!B23","v":"Szczepanski Holger"},{"$f":"'Wettkampf 1'!C23","v":"Neuvrees II"},307.7,null,307.7,0,0,0,0,307.7,1,0,0,0,0,0,0,{"$nulls":5},{"v":0,"d":"0.0"},0,0,""]
[15,{"$f":"'Wettkampf 1'!B24","v":"Schrand Karl-Heinz"},{"$f":"'Wettkampf 1'!C24","v":"Neuvrees II"},308.9,null,308.9,0,0,0,0,308.9,1,0,0,0,0,0,0,{"$nulls":5},{"v":0,"d":"0.0"},0,0,""]
[16,{"$f":"'Wettkampf 1'!B25","v":"Preut Hans"},{"$f":"'Wettkampf 1'!C25","v":"Neuvrees II"},309.2,null,309.2,0,0,0,0,309.2,1,0,0,0,0,0,0,{"$nulls":5},{"v":0,"d":"0.0"},0,0,""]
[17,{"$f":"'Wettkampf 1'!B26","v":"Thunert  Dirk"},{"$f":"'Wettkampf 1'!C26","v":"Neuvrees II"},310.9,"x","0",0,0,0,0,"0",0,0,0,0,0,0,0,{"$nulls":5},{"v":0,"d":"0.0"},0,0,""]
[18,{"$f":"'Wettkampf 1'!B27","v":"Schütze 18"},{"$f":"'Wettkampf 1'!C27","v":"Neuvrees II"},null,"x","0",0,0,0,0,"0",0,0,0,0,0,0,0,{"$nulls":5},{"v":0,"d":"0.0"},1,0,""]
[19,{"$f":"'Wettkampf 1'!B28","v":"Hömmen Bernd"},{"$f":"'Wettkampf 1'!C28","v":"Breddenberg IV"},309.9,null,309.9,0,0,0,0,0,0,309.9,1,0,0,0,0,{"$nulls":5},{"v":0,"d":"0.0"},0,0,""]
[20,{"$f":"'Wettkampf 1'!B29","v":"Hanekamp Rudi"},{"$f":"'Wettkampf 1'!C29","v":"Breddenberg IV"},301.9,null,301.9,0,0,0,0,0,0,301.9,1,0,0,0,0,{"$nulls":5},{"v":0,"d":"0.0"},0,0,""]
[21,{"$f":"'Wettkampf 1'!B30","v":"Köß Wilhelm"},{"$f":"'Wettkampf 1'!C30","v":"Breddenberg IV"},309.6,null,309.6,0,0,0,0,0,0,309.6,1,0,0,0,0,{"$nulls":5},{"v":0,"d":"0.0"},0,0,""]
[22,{"$f":"'Wettkampf 1'!B31","v":"Jansen  Martin"},{"$f":"'Wettkampf 1'!C31","v":"Breddenberg IV"},302.7,null,302.7,0,0,0,0,0,0,302.7,1,0,0,0,0,{"$nulls":5},{"v":0,"d":"0.0"},0,0,""]
[23,{"$f":"'Wettkampf 1'!B32","v":"Schütze 23"},{"$f":"'Wettkampf 1'!C32","v":"Breddenberg IV"},null,"x","0",0,0,0,0,0,0,"0",0,0,0,0,0,{"$nulls":5},{"v":0,"d":"0.0"},1,0,""]
[24,{"$f":"'Wettkampf 1'!B33","v":"Schütze 24"},{"$f":"'Wettkampf 1'!C33","v":"Breddenberg IV"},null,"x","0",0,0,0,0,0,0,"0",0,0,0,0,0,{"$nulls":5},{"v":0,"d":"0.0"},1,0,""]
[25,{"$f":"'Wettkampf 1'!B34","v":"Rolfes Willi"},{"$f":"'Wettkampf 1'!C34","v":"Neuvrees I"},311.8,null,311.8,0,0,0,0,0,0,0,0,311.8,1,0,0,{"$nulls":5},{"v":0,"d":"0.0"},0,0,""]
[26,{"$f":"'Wettkampf 1'!B35","v":"Breyer Wilfried"},{"$f":"'Wettkampf 1'!C35","v":"Neuvrees I"},314.8,null,314.8,0,0,0,0,0,0,0,0,314.8,1,0,0,{"$nulls":5},{"v":0,"d":"0.0"},0,0,""]
[27,{"$f":"'Wettkampf 1'!B36","v":"Janßen Markus"},{"$f":"'Wettkampf 1'!C36","v":"Neuvrees I"},{"v":313,"d":"313.0"},null,{"v":313,"d":"313.0"},0,0,0,0,0,0,0,0,313,1,0,0,{"$nulls":5},{"v":0,"d":"0.0"},0,0,""]
[28,{"$f":"'Wettkampf 1'!B37","v":"Steenken Klaus"},{"$f":"'Wettkampf 1'!C37","v":"Neuvrees I"},{"v":0,"d":"0.0"},"x","0",0,0,0,0,0,0,0,0,"0",0,0,0,{"$nulls":5},{"v":0,"d":"0.0"},1,0,""]
[29,{"$f":"'Wettkampf 1'!B38","v":"Thyen Werner"},{"$f":"'Wettkampf 1'!C38","v":"Neuvrees I"},304.5,null,304.5,0,0,0,0,0,0,0,0,304.5,1,0,0,{"$nulls":5},{"v":0,"d":"0.0"},0,0,""]
[30,{"$f":"'Wettkampf 1'!B39","v":"Schütze 30"},{"$f":"'Wettkampf 1'!C39","v":"Neuvrees I"},null,"x","0",0,0,0,0,0,0,0,0,"0",0,0,0,{"$nulls":5},{"v":0,"d":"0.0"},1,0,""]
[31,{"$f":"'Wettkampf 1'!B40","v":"Schuckenbrock Simon"},{"$f":"'Wettkampf 1'!C40","v":"Börger III"},309.7,"x","0",0,0,0,0,0,0,0,0,0,0,"0",0,{"$nulls":5},{"v":0,"d":"0.0"},0,0,""]
[32,{"$f":"'Wettkampf 1'!B41","v":"Henzen Jens"},{"$f":"'Wettkampf 1'!C41","v":"Börger III"},309.6,null,309.6,0,0,0,0,0,0,0,0,0,0,309.6,1,{"$nulls":5},{"v":0,"d":"0.0"},0,0,""]
[33,{"$f":"'Wettkampf 1'!B42","v":"Sebers Daniel"},{"$f":"'Wettkampf 1'!C42","v":"Börger III"},305.5,null,305.5,0,0,0,0,0,0,0,0,0,0,305.5,1,{"$nulls":5},{"v":0,"d":"0.0"},0,0,""]
[34,{"$f":"'Wettkampf 1'!B43","v":"Rode Bernd"},{"$f":"'Wettkampf 1'!C43","v":"Börger III"},306.9,null,306.9,0,0,0,0,0,0,0,0,0,0,306.9,1,{"$nulls":5},{"v":0,"d":"0.0"},0,0,""]
[35,{"$f":"'Wettkampf 1'!B44","v":"Schroer Jürgen"},{"$f":"'Wettkampf 1'!C44","v":"Börger III"},308.8,null,308.8,0,0,0,0,0,0,0,0,0,0,308.8,1,{"$nulls":5},{"v":0,"d":"0.0"},0,0,""]
[36,{"$f":"'Wettkampf 1'!B45","v":"Schütze 36"},{"$f":"'Wettkampf 1'!C45","v":"Börger III"},null,"x","0",0,0,0,0,0,0,0,0,0,0,"0",0,{"$nulls":5},{"v":0,"d":"0.0"},1,0,""]
[{"$nulls":6},{"$f":"LARGE(G10:G45,1)+LARGE(G10:G45,2)+LARGE(G10:G45,3)","v":936.4},{"$f":"SUM(H10:H45)","v":4},{"$f":"LARGE(I10:I45,1)+LARGE(I10:I45,2)+LARGE(I10:I45,3)","v":921.1999999999999},{"$f":"SUM(J10:J45)","v":4},{"$f":"LARGE(K10:K45,1)+LARGE(K10:K45,2)+LARGE(K10:K45,3)","v":928.9},{"$f":"SUM(L10:L45)","v":4},{"$f":"LARGE(M10:M45,1)+LARGE(M10:M45,2)+LARGE(M10:M45,3)","v":922.2},{"$f":"SUM(N10:N45)","v":4},{"$f":"LARGE(O10:O45,1)+LARGE(O10:O45,2)+LARGE(O10:O45,3)","v":939.5999999999999},{"$f":"SUM(P10:P45)","v":4},{"$f":"LARGE(Q10:Q45,1)+LARGE(Q10:Q45,2)+LARGE(Q10:Q45,3)","v":925.3000000000001},{"$f":"SUM(R10:S45)","v":4}]
[null,null,"per Email an: sk-huemmling@gmx.de"]

{"sheet":"9","index":9,"n_rows":47,"n_cols":27,"rows_kept":47,"merged":[[0,22,0,23],[1,22,1,23],[4,22,4,23],[5,22,5,23],[6,22,6,23],[8,20,8,23]]}
[null,"Verein / Gruppe",null,"Ergebnisse",{"$nulls":17},"Austragungsort:",{"$f":"Übersicht!N4","v":"Neuvrees "}]
[1,{"$f":"'Wettkampf 1'!B2","v":"Sögel II"},null,{"$f":"G46","v":935.3},{"$f":"IF(H46>4,\"Es sind zu viele Schützen in Wertung!\",\" \")","v":" "},{"$nulls":16},"Wettkampftag:",{"$f":"Übersicht!N3","v":"19.02."}]
[2,{"$f":"'Wettkampf 1'!B3","v":"Ostenwalde I"},null,{"$f":"I46","v":{"v":912.9000000000001,"d":"912.9"}},{"$f":"IF(J46>4,\"Es sind zu viele Schützen in Wertung!\",\" \")","v":" "}]
[3,{"$f":"'Wettkampf 1'!B4","v":"Neuvrees II"},null,{"$f":"K46","v":936.9},{"$f":"IF(L46>4,\"Es sind zu viele Schützen in Wertung!\",\" \")","v":" "},{"$nulls":18},"Ansprechpartner für Rückfragen:"]
[4,{"$f":"'Wettkampf 1'!B5","v":"Breddenberg IV"},null,{"$f":"M46","v":909.2},{"$f":"IF(N46>4,\"Es sind zu viele Schützen in Wertung!\",\" \")","v":" "},{"$nulls":16},"Name:","Dirk Thunert"]
[5,{"$f":"'Wettkampf 1'!B6","v":"Neuvrees I"},null,{"$f":"O46","v":{"v":933,"d":"933.0"}},{"$f":"IF(P46>4,\"Es sind zu viele Schützen in Wertung!\",\" \")","v":" "},{"$nulls":16},"Tel:","04493-998686"]
[6,{"$f":"'Wettkampf 1'!B7","v":"Börger III"},null,{"$f":"Q46","v":933.1},{"$f":"IF(R46>4,\"Es sind zu viele Schützen in Wertung!\",\" \")","v":" "},{"$nulls":16},"Standaufsicht:","Dirk Thunert"]
[]
[null,"Einzelergebnisse:","Verein / Gruppe","Ergebnisse (mindestens 0 eintragen)","AW? Dann x eintippen",null,"Verein 1",null,"Verein 2",null,"Verein 3",null,"Verein 4",null,"Verein 5",null,"Verein 6",{"$nulls":3},"Proberechnung bei Streifen:"]
[1,{"$f":"'Wettkampf 1'!B10","v":"Grünloh Michael"},{"$f":"'Wettkampf 1'!C10","v":"Sögel II"},313.4,null,{"$f":"IF(E10=\"x\",\"0\",D10)","v":313.4},{"$f":"IF(C10=$B$2,F10,0)","v":313.4},{"$f":"(IF(AND($E10=\"\",$C10=$B$2),1,0))","v":1},{"$f":"IF($C10=$B$3,F10,0)","v":0},{"$f":"(IF(AND($E10=\"\",$C10=$B$3),1,0))","v":0},{"$f":"IF($C10=$B$4,F10,0)","v":0},{"$f":"(IF(AND($E10=\"\",$C10=$B$4),1,0))","v":0},{"$f":"IF($C10=$B$5,F10,0)","v":0},{"$f":"(IF(AND($E10=\"\",$C10=$B$5),1,0))","v":0},{"$f":"IF($C10=$B$6,F10,0)","v":0},{"$f":"(IF(AND($E10=\"\",$C10=$B$6),1,0))","v":0},{"$f":"IF($C10=$B$7,F10,0)","v":0},{"$f":"(IF(AND($E10=\"\",$C10=$B$7),1,0))","v":0},{"$nulls":5},{"$f":"U10+V10+W10","v":{"v":0,"d":"0.0"}},{"$f":"IF(X10=D10,1,0)","v":0},{"$f":"IF(X10=0,0,1)","v":0},{"$f":"IF(Y10+Z10=2,\"Korrekt\",\"\")","v":""}]
[2,{"$f":"'Wettkampf 1'!B11","v":"Trempeck Marco"},{"$f":"'Wettkampf 1'!C11","v":"Sögel II"},309.5,null,{"$f":"IF(E11=\"x\",\"0\",D11)","v":309.5},{"$f":"IF(C11=$B$2,F11,0)","v":309.5},{"$f":"(IF(AND($E11=\"\",$C11=$B$2),1,0))","v":1},{"$f":"IF($C11=$B$3,F11,0)","v":0},{"$f":"(IF(AND($E11=\"\",$C11=$B$3),1,0))","v":0},{"$f":"IF($C11=$B$4,F11,0)","v":0},{"$f":"(IF(AND($E11=\"\",$C11=$B$4),1,0))","v":0},{"$f":"IF($C11=$B$5,F11,0)","v":0},{"$f":"(IF(AND($E11=\"\",$C11=$B$5),1,0))","v":0},{"$f":"IF($C11=$B$6,F11,0)","v":0},{"$f":"(IF(AND($E11=\"\",$C11=$B$6),1,0))","v":0},{"$f":"IF($C11=$B$7,F11,0)","v":0},{"$f":"(IF(AND($E11=\"\",$C11=$B$7),1,0))","v":0},{"$nulls":5},{"$f":"U11+V11+W11","v":{"v":0,"d":"0.0"}},{"$f":"IF(X11=D11,1,0)","v":0},{"$f":"IF(X11=0,0,1)","v":0},{"$f":"IF(Y11+Z11=2,\"Korrekt\",\"\")","v":""}]
[3,{"$f":"'Wettkampf 1'!B12","v":"Robbers Heinz"},{"$f":"'Wettkampf 1'!C12","v":"Sögel II"},311.4,null,311.4,311.4,1,0,0,0,0,0,0,0,0,0,0,{"$nulls":5},{"v":0,"d":"0.0"},0,0,""]
[4,{"$f":"'Wettkampf 1'!B13","v":"Robbers Bernd"},{"$f":"'Wettkampf 1'!C13","v":"Sögel II"},310.5,null,310.5,310.5,1,0,0,0,0,0,0,0,0,0,0,{"$nulls":5},{"v":0,"d":"0.0"},0,0,""]
[5,{"$f":"'Wettkampf 1'!B14","v":"Husmann Michael"},{"$f":"'Wettkampf 1'!C14","v":"Sögel II"},307.9,"x","0","0",0,0,0,0,0,0,0,0,0,0,0,{"$nulls":5},{"v":0,"d":"0.0"},0,0,""]
[6,{"$f":"'Wettkampf 1'!B15","v":"Schütze 6"},{"$f":"'Wettkampf 1'!C15","v":"Sögel II"},{"v":0,"d":"0.0"},"x","0","0",0,0,0,0,0,0,0,0,0,0,0,{"$nulls":5},{"v":0,"d":"0.0"},1,0,""]
[7,{"$f":"'Wettkampf 1'!B16","v":"Bunten Manfred"},{"$f":"'Wettkampf 1'!C16","v":"Ostenwalde I"},302.6,null,302.6,0,0,302.6,1,0,0,0,0,0,0,0,0,{"$nulls":5},{"v":0,"d":"0.0"},0,0,""]
[8,{"$f":"'Wettkampf 1'!B17","v":"Benten Helmut"},{"$f":"'Wettkampf 1'!C17","v":"Ostenwalde I"},296.8,null,296.8,0,0,296.8,1,0,0,0,0,0,0,0,0,{"$nulls":5},{"v":0,"d":"0.0"},0,0,""]
[9,{"$f":"'Wettkampf 1'!B18","v":"Meiners Bernd"},{"$f":"'Wettkampf 1'!C18","v":"Ostenwalde I"},308.1,null,308.1,0,0,308.1,1,0,0,0,0,0,0,0,0,{"$nulls":5},{"v":0,"d":"0.0"},0,0,""]
[10,{"$f":"'Wettkampf 1'!B19","v":"Meiners Martin"},{"$f":"'Wettkampf 1'!C19","v":"Ostenwalde I"},302.2,null,302.2,0,0,302.2,1,0,0,0,0,0,0,0,0,{"$nulls":5},{"v":0,"d":"0.0"},0,0,""]
[11,{"$f":"'Wettkampf 1'!B20","v":"Schütze 11"},{"$f":"'Wettkampf 1'!C20","v":"Ostenwalde I"},{"v":0,"d":"0.0"},"x","0",0,0,"0",0,0,0,0,0,0,0,0,0,{"$nulls":5},{"v":0,"d":"0.0"},1,0,""]
[12,{"$f":"'Wettkampf 1'!B21","v":"Schütze 12"},{"$f":"'Wettkampf 1'!C21","v":"Ostenwalde I"},{"v":0,"d":"0.0"},"x","0",0,0,"0",0,0,0,0,0,0,0,0,0,{"$nulls":5},{"v":0,"d":"0.0"},1,0,""]
[13,{"$f":"'Wettkampf 1'!B22","v":"Witting Bernhard"},{"$f":"'Wettkampf 1'!C22","v":"Neuvrees II"},307.4,null,307.4,0,0,0,0,307.4,1,0,0,0,0,0,0,{"$nulls":5},{"v":0,"d":"0.0"},0,0,""]
[14,{"$f":"'Wettkampf 1'!B23","v":"Szczepanski Holger"},{"$f":"'Wettkampf 1'!C23","v":"Neuvrees II"},305.2,"x","0",0,0,0,0,"0",0,0,0,0,0,0,0,{"$nulls":5},{"v":0,"d":"0.0"},0,0,""]
[15,{"$f":"'Wettkampf 1'!B24","v":"Schrand Karl-Heinz"},{"$f":"'Wettkampf 1'!C24","v":"Neuvrees II"},313.7,null,313.7,0,0,0,0,313.7,1,0,0,0,0,0,0,{"$nulls":5},{"v":0,"d":"0.0"},0,0,""]
[16,{"$f":"'Wettkampf 1'!B25","v":"Preut Hans"},{"$f":"'Wettkampf 1'!C25","v":"Neuvrees II"},311.8,null,311.8,0,0,0,0,311.8,1,0,0,0,0,0,0,{"$nulls":5},{"v":0,"d":"0.0"},0,0,""]
[17,{"$f":"'Wettkampf 1'!B26","v":"Thunert  Dirk"},{"$f":"'Wettkampf 1'!C26","v":"Neuvrees II"},311.4,null,311.4,0,0,0,0,311.4,1,0,0,0,0,0,0,{"$nulls":5},{"v":0,"d":"0.0"},0,0,""]
[18,{"$f":"'Wettkampf 1'!B27","v":"Schütze 18"},{"$f":"'Wettkampf 1'!C27","v":"Neuvrees II"},{"v":0,"d":"0.0"},"x","0",0,0,0,0,"0",0,0,0,0,0,0,0,{"$nulls":5},{"v":0,"d":"0.0"},1,0,""]
[19,{"$f":"'Wettkampf 1'!B28","v":"Hömmen Bernd"},{"$f":"'Wettkampf 1'!C28","v":"Breddenberg IV"},299.3,null,299.3,0,0,0,0,0,0,299.3,1,0,0,0,0,{"$nulls":5},{"v":0,"d":"0.0"},0,0,""]
[20,{"$f":"'Wettkampf 1'!B29","v":"Hanekamp Rudi"},{"$f":"'Wettkampf 1'!C29","v":"Breddenberg IV"},299.6,null,299.6,0,0,0,0,0,0,299.6,1,0,0,0,0,{"$nulls":5},{"v":0,"d":"0.0"},0,0,""]
[21,{"$f":"'Wettkampf 1'!B30","v":"Köß Wilhelm"},{"$f":"'Wettkampf 1'!C30","v":"Breddenberg IV"},310.3,null,310.3,0,0,0,0,0,0,310.3,1,0,0,0,0,{"$nulls":5},{"v":0,"d":"0.0"},0,0,""]
[22,{"$f":"'Wettkampf 1'!B31","v":"Jansen  Martin"},{"$f":"'Wettkampf 1'!C31","v":"Breddenberg IV"},299.2,null,299.2,0,0,0,0,0,0,299.2,1,0,0,0,0,{"$nulls":5},{"v":0,"d":"0.0"},0,0,""]
[23,{"$f":"'Wettkampf 1'!B32","v":"Schütze 23"},{"$f":"'Wettkampf 1'!C32","v":"Breddenberg IV"},{"v":0,"d":"0.0"},"x","0",0,0,0,0,0,0,"0",0,0,0,0,0,{"$nulls":5},{"v":0,"d":"0.0"},1,0,""]
[24,{"$f":"'Wettkampf 1'!B33","v":"Schütze 24"},{"$f":"'Wettkampf 1'!C33","v":"Breddenberg IV"},{"v":0,"d":"0.0"},"x","0",0,0,0,0,0,0,"0",0,0,0,0,0,{"$nulls":5},{"v":0,"d":"0.0"},1,0,""]
[25,{"$f":"'Wettkampf 1'!B34","v":"Rolfes Willi"},{"$f":"'Wettkampf 1'!C34","v":"Neuvrees I"},312.1,null,312.1,0,0,0,0,0,0,0,0,312.1,1,0,0,{"$nulls":5},{"v":0,"d":"0.0"},0,0,""]
[26,{"$f":"'Wettkampf 1'!B35","v":"Breyer Wilfried"},{"$f":"'Wettkampf 1'!C35","v":"Neuvrees I"},310.6,null,310.6,0,0,0,0,0,0,0,0,310.6,1,0,0,{"$nulls":5},{"v":0,"d":"0.0"},0,0,""]
[27,{"$f":"'Wettkampf 1'!B36","v":"Janßen Markus"},{"$f":"'Wettkampf 1'!C36","v":"Neuvrees I"},310.3,null,310.3,0,0,0,0,0,0,0,0,310.3,1,0,0,{"$nulls":5},{"v":0,"d":"0.0"},0,0,""]
[28,{"$f":"'Wettkampf 1'!B37","v":"Steenken Klaus"},{"$f":"'Wettkampf 1'!C37","v":"Neuvrees I"},{"v":0,"d":"0.0"},"x","0",0,0,0,0,0,0,0,0,"0",0,0,0,{"$nulls":5},{"v":0,"d":"0.0"},1,0,""]
[29,{"$f":"'Wettkampf 1'!B38","v":"Thyen Werner"},{"$f":"'Wettkampf 1'!C38","v":"Neuvrees I"},304.9,null,304.9,0,0,0,0,0,0,0,0,304.9,1,0,0,{"$nulls":5},{"v":0,"d":"0.0"},0,0,""]
[30,{"$f":"'Wettkampf 1'!B39","v":"Schütze 30"},{"$f":"'Wettkampf 1'!C39","v":"Neuvrees I"},{"v":0,"d":"0.0"},"x","0",0,0,0,0,0,0,0,0,"0",0,0,0,{"$nulls":5},{"v":0,"d":"0.0"},1,0,""]
[31,{"$f":"'Wettkampf 1'!B40","v":"Schuckenbrock Simon"},{"$f":"'Wettkampf 1'!C40","v":"Börger III"},312.4,null,312.4,0,0,0,0,0,0,0,0,0,0,312.4,1,{"$nulls":5},{"v":0,"d":"0.0"},0,0,""]
[32,{"$f":"'Wettkampf 1'!B41","v":"Henzen Jens"},{"$f":"'Wettkampf 1'!C41","v":"Börger III"},313.6,null,313.6,0,0,0,0,0,0,0,0,0,0,313.6,1,{"$nulls":5},{"v":0,"d":"0.0"},0,0,""]
[33,{"$f":"'Wettkampf 1'!B42","v":"Sebers Daniel"},{"$f":"'Wettkampf 1'!C42","v":"Börger III"},310.2,"x","0",0,0,0,0,0,0,0,0,0,0,"0",0,{"$nulls":5},{"v":0,"d":"0.0"},0,0,""]
[34,{"$f":"'Wettkampf 1'!B43","v":"Rode Bernd"},{"$f":"'Wettkampf 1'!C43","v":"Börger III"},307.1,null,307.1,0,0,0,0,0,0,0,0,0,0,307.1,1,{"$nulls":5},{"v":0,"d":"0.0"},0,0,""]
[35,{"$f":"'Wettkampf 1'!B44","v":"Schroer Jürgen"},{"$f":"'Wettkampf 1'!C44","v":"Börger III"},305.5,null,305.5,0,0,0,0,0,0,0,0,0,0,305.5,1,{"$nulls":5},{"v":0,"d":"0.0"},0,0,""]
[36,{"$f":"'Wettkampf 1'!B45","v":"Schütze 36"},{"$f":"'Wettkampf 1'!C45","v":"Börger III"},{"v":0,"d":"0.0"},"x","0",0,0,0,0,0,0,0,0,0,0,"0",0,{"$nulls":5},{"v":0,"d":"0.0"},1,0,""]
[{"$nulls":6},{"$f":"LARGE(G10:G45,1)+LARGE(G10:G45,2)+LARGE(G10:G45,3)","v":935.3},{"$f":"SUM(H10:H45)","v":4},{"$f":"LARGE(I10:I45,1)+LARGE(I10:I45,2)+LARGE(I10:I45,3)","v":912.9000000000001},{"$f":"SUM(J10:J45)","v":4},{"$f":"LARGE(K10:K45,1)+LARGE(K10:K45,2)+LARGE(K10:K45,3)","v":936.9},{"$f":"SUM(L10:L45)","v":4},{"$f":"LARGE(M10:M45,1)+LARGE(M10:M45,2)+LARGE(M10:M45,3)","v":909.2},{"$f":"SUM(N10:N45)","v":4},{"$f":"LARGE(O10:O45,1)+LARGE(O10:O45,2)+LARGE(O10:O45,3)","v":933},{"$f":"SUM(P10:P45)","v":4},{"$f":"LARGE(Q10:Q45,1)+LARGE(Q10:Q45,2)+LARGE(Q10:Q45,3)","v":933.1},{"$f":"SUM(R10:S45)","v":4}]
[null,null,"per Email an: sk-huemmling@gmx.de"]

{"sheet":"10","index":10,"n_rows":47,"n_cols":27,"rows_kept":47,"merged":[[0,22,0,23],[1,22,1,23],[4,22,4,23],[5,22,5,23],[6,22,6,23],[8,20,8,23]]}
[null,"Verein / Gruppe",null,"Ergebnisse",{"$nulls":17},"Austragungsort:",{"$f":"Übersicht!O4","v":"Breddenberg"}]
[1,{"$f":"'Wettkampf 1'!B2","v":"Sögel II"},null,{"$f":"G46","v":932.5},{"$f":"IF(H46>4,\"Es sind zu viele Schützen in Wertung!\",\" \")","v":" "},{"$nulls":16},"Wettkampftag:",{"$f":"Übersicht!O3","v":"05.03."}]
[2,{"$f":"'Wettkampf 1'!B3","v":"Ostenwalde I"},null,{"$f":"I46","v":{"v":919.9000000000001,"d":"919.9"}},{"$f":"IF(J46>4,\"Es sind zu viele Schützen in Wertung!\",\" \")","v":" "}]
[3,{"$f":"'Wettkampf 1'!B4","v":"Neuvrees II"},null,{"$f":"K46","v":934.4},{"$f":"IF(L46>4,\"Es sind zu viele Schützen in Wertung!\",\" \")","v":" "},{"$nulls":18},"Ansprechpartner für Rückfragen:"]
[4,{"$f":"'Wettkampf 1'!B5","v":"Breddenberg IV"},null,{"$f":"M46","v":{"v":927.8000000000001,"d":"927.8"}},{"$f":"IF(N46>4,\"Es sind zu viele Schützen in Wertung!\",\" \")","v":" "},{"$nulls":16},"Name:"]
[5,{"$f":"'Wettkampf 1'!B6","v":"Neuvrees I"},null,{"$f":"O46","v":929.6},{"$f":"IF(P46>4,\"Es sind zu viele Schützen in Wertung!\",\" \")","v":" "},{"$nulls":16},"Tel:"]
[6,{"$f":"'Wettkampf 1'!B7","v":"Börger III"},null,{"$f":"Q46","v":934.5},{"$f":"IF(R46>4,\"Es sind zu viele Schützen in Wertung!\",\" \")","v":" "},{"$nulls":16},"Standaufsicht:","Bernd Hömmen"]
[]
[null,"Einzelergebnisse:","Verein / Gruppe","Ergebnisse (mindestens 0 eintragen)","AW? Dann x eintippen",null,"Verein 1",null,"Verein 2",null,"Verein 3",null,"Verein 4",null,"Verein 5",null,"Verein 6",{"$nulls":3},"Proberechnung bei Streifen:"]
[1,{"$f":"'Wettkampf 1'!B10","v":"Grünloh Michael"},{"$f":"'Wettkampf 1'!C10","v":"Sögel II"},309.8,null,{"$f":"IF(E10=\"x\",\"0\",D10)","v":309.8},{"$f":"IF(C10=$B$2,F10,0)","v":309.8},{"$f":"(IF(AND($E10=\"\",$C10=$B$2),1,0))","v":1},{"$f":"IF($C10=$B$3,F10,0)","v":0},{"$f":"(IF(AND($E10=\"\",$C10=$B$3),1,0))","v":0},{"$f":"IF($C10=$B$4,F10,0)","v":0},{"$f":"(IF(AND($E10=\"\",$C10=$B$4),1,0))","v":0},{"$f":"IF($C10=$B$5,F10,0)","v":0},{"$f":"(IF(AND($E10=\"\",$C10=$B$5),1,0))","v":0},{"$f":"IF($C10=$B$6,F10,0)","v":0},{"$f":"(IF(AND($E10=\"\",$C10=$B$6),1,0))","v":0},{"$f":"IF($C10=$B$7,F10,0)","v":0},{"$f":"(IF(AND($E10=\"\",$C10=$B$7),1,0))","v":0},{"$nulls":5},{"$f":"U10+V10+W10","v":{"v":0,"d":"0.0"}},{"$f":"IF(X10=D10,1,0)","v":0},{"$f":"IF(X10=0,0,1)","v":0},{"$f":"IF(Y10+Z10=2,\"Korrekt\",\"\")","v":""}]
[2,{"$f":"'Wettkampf 1'!B11","v":"Trempeck Marco"},{"$f":"'Wettkampf 1'!C11","v":"Sögel II"},311.1,null,{"$f":"IF(E11=\"x\",\"0\",D11)","v":311.1},{"$f":"IF(C11=$B$2,F11,0)","v":311.1},{"$f":"(IF(AND($E11=\"\",$C11=$B$2),1,0))","v":1},{"$f":"IF($C11=$B$3,F11,0)","v":0},{"$f":"(IF(AND($E11=\"\",$C11=$B$3),1,0))","v":0},{"$f":"IF($C11=$B$4,F11,0)","v":0},{"$f":"(IF(AND($E11=\"\",$C11=$B$4),1,0))","v":0},{"$f":"IF($C11=$B$5,F11,0)","v":0},{"$f":"(IF(AND($E11=\"\",$C11=$B$5),1,0))","v":0},{"$f":"IF($C11=$B$6,F11,0)","v":0},{"$f":"(IF(AND($E11=\"\",$C11=$B$6),1,0))","v":0},{"$f":"IF($C11=$B$7,F11,0)","v":0},{"$f":"(IF(AND($E11=\"\",$C11=$B$7),1,0))","v":0},{"$nulls":5},{"$f":"U11+V11+W11","v":{"v":0,"d":"0.0"}},{"$f":"IF(X11=D11,1,0)","v":0},{"$f":"IF(X11=0,0,1)","v":0},{"$f":"IF(Y11+Z11=2,\"Korrekt\",\"\")","v":""}]
[3,{"$f":"'Wettkampf 1'!B12","v":"Robbers Heinz"},{"$f":"'Wettkampf 1'!C12","v":"Sögel II"},311.6,null,311.6,311.6,1,0,0,0,0,0,0,0,0,0,0,{"$nulls":5},{"v":0,"d":"0.0"},0,0,""]
[4,{"$f":"'Wettkampf 1'!B13","v":"Robbers Bernd"},{"$f":"'Wettkampf 1'!C13","v":"Sögel II"},308.9,null,308.9,308.9,1,0,0,0,0,0,0,0,0,0,0,{"$nulls":5},{"v":0,"d":"0.0"},0,0,""]
[5,{"$f":"'Wettkampf 1'!B14","v":"Husmann Michael"},{"$f":"'Wettkampf 1'!C14","v":"Sögel II"},307.3,"x","0","0",0,0,0,0,0,0,0,0,0,0,0,{"$nulls":5},{"v":0,"d":"0.0"},0,0,""]
[6,{"$f":"'Wettkampf 1'!B15","v":"Schütze 6"},{"$f":"'Wettkampf 1'!C15","v":"Sögel II"},null,"x","0","0",0,0,0,0,0,0,0,0,0,0,0,{"$nulls":5},{"v":0,"d":"0.0"},1,0,""]
[7,{"$f":"'Wettkampf 1'!B16","v":"Bunten Manfred"},{"$f":"'Wettkampf 1'!C16","v":"Ostenwalde I"},304.3,null,304.3,0,0,304.3,1,0,0,0,0,0,0,0,0,{"$nulls":5},{"v":0,"d":"0.0"},0,0,""]
[8,{"$f":"'Wettkampf 1'!B17","v":"Benten Helmut"},{"$f":"'Wettkampf 1'!C17","v":"Ostenwalde I"},301.3,null,301.3,0,0,301.3,1,0,0,0,0,0,0,0,0,{"$nulls":5},{"v":0,"d":"0.0"},0,0,""]
[9,{"$f":"'Wettkampf 1'!B18","v":"Meiners Bernd"},{"$f":"'Wettkampf 1'!C18","v":"Ostenwalde I"},309.6,null,309.6,0,0,309.6,1,0,0,0,0,0,0,0,0,{"$nulls":5},{"v":0,"d":"0.0"},0,0,""]
[10,{"$f":"'Wettkampf 1'!B19","v":"Meiners Martin"},{"$f":"'Wettkampf 1'!C19","v":"Ostenwalde I"},{"v":306,"d":"306.0"},null,{"v":306,"d":"306.0"},0,0,306,1,0,0,0,0,0,0,0,0,{"$nulls":5},{"v":0,"d":"0.0"},0,0,""]
[11,{"$f":"'Wettkampf 1'!B20","v":"Schütze 11"},{"$f":"'Wettkampf 1'!C20","v":"Ostenwalde I"},null,"x","0",0,0,"0",0,0,0,0,0,0,0,0,0,{"$nulls":5},{"v":0,"d":"0.0"},1,0,""]
[12,{"$f":"'Wettkampf 1'!B21","v":"Schütze 12"},{"$f":"'Wettkampf 1'!C21","v":"Ostenwalde I"},null,"x","0",0,0,"0",0,0,0,0,0,0,0,0,0,{"$nulls":5},{"v":0,"d":"0.0"},1,0,""]
[13,{"$f":"'Wettkampf 1'!B22","v":"Witting Bernhard"},{"$f":"'Wettkampf 1'!C22","v":"Neuvrees II"},311.3,null,311.3,0,0,0,0,311.3,1,0,0,0,0,0,0,{"$nulls":5},{"v":0,"d":"0.0"},0,0,""]
[14,{"$f":"'Wettkampf 1'!B23","v":"Szczepanski Holger"},{"$f":"'Wettkampf 1'!C23","v":"Neuvrees II"},309.7,null,309.7,0,0,0,0,309.7,1,0,0,0,0,0,0,{"$nulls":5},{"v":0,"d":"0.0"},0,0,""]
[15,{"$f":"'Wettkampf 1'!B24","v":"Schrand Karl-Heinz"},{"$f":"'Wettkampf 1'!C24","v":"Neuvrees II"},{"v":312,"d":"312.0"},null,{"v":312,"d":"312.0"},0,0,0,0,312,1,0,0,0,0,0,0,{"$nulls":5},{"v":0,"d":"0.0"},0,0,""]
[16,{"$f":"'Wettkampf 1'!B25","v":"Preut Hans"},{"$f":"'Wettkampf 1'!C25","v":"Neuvrees II"},311.1,null,311.1,0,0,0,0,311.1,1,0,0,0,0,0,0,{"$nulls":5},{"v":0,"d":"0.0"},0,0,""]
[17,{"$f":"'Wettkampf 1'!B26","v":"Thunert  Dirk"},{"$f":"'Wettkampf 1'!C26","v":"Neuvrees II"},309.6,"x","0",0,0,0,0,"0",0,0,0,0,0,0,0,{"$nulls":5},{"v":0,"d":"0.0"},0,0,""]
[18,{"$f":"'Wettkampf 1'!B27","v":"Schütze 18"},{"$f":"'Wettkampf 1'!C27","v":"Neuvrees II"},null,"x","0",0,0,0,0,"0",0,0,0,0,0,0,0,{"$nulls":5},{"v":0,"d":"0.0"},1,0,""]
[19,{"$f":"'Wettkampf 1'!B28","v":"Hömmen Bernd"},{"$f":"'Wettkampf 1'!C28","v":"Breddenberg IV"},{"v":306,"d":"306.0"},null,{"v":306,"d":"306.0"},0,0,0,0,0,0,306,1,0,0,0,0,{"$nulls":5},{"v":0,"d":"0.0"},0,0,""]
[20,{"$f":"'Wettkampf 1'!B29","v":"Hanekamp Rudi"},{"$f":"'Wettkampf 1'!C29","v":"Breddenberg IV"},309.6,null,309.6,0,0,0,0,0,0,309.6,1,0,0,0,0,{"$nulls":5},{"v":0,"d":"0.0"},0,0,""]
[21,{"$f":"'Wettkampf 1'!B30","v":"Köß Wilhelm"},{"$f":"'Wettkampf 1'!C30","v":"Breddenberg IV"},311.1,null,311.1,0,0,0,0,0,0,311.1,1,0,0,0,0,{"$nulls":5},{"v":0,"d":"0.0"},0,0,""]
[22,{"$f":"'Wettkampf 1'!B31","v":"Jansen  Martin"},{"$f":"'Wettkampf 1'!C31","v":"Breddenberg IV"},307.1,null,307.1,0,0,0,0,0,0,307.1,1,0,0,0,0,{"$nulls":5},{"v":0,"d":"0.0"},0,0,""]
[23,{"$f":"'Wettkampf 1'!B32","v":"Schütze 23"},{"$f":"'Wettkampf 1'!C32","v":"Breddenberg IV"},null,"x","0",0,0,0,0,0,0,"0",0,0,0,0,0,{"$nulls":5},{"v":0,"d":"0.0"},1,0,""]
[24,{"$f":"'Wettkampf 1'!B33","v":"Schütze 24"},{"$f":"'Wettkampf 1'!C33","v":"Breddenberg IV"},null,"x","0",0,0,0,0,0,0,"0",0,0,0,0,0,{"$nulls":5},{"v":0,"d":"0.0"},1,0,""]
[25,{"$f":"'Wettkampf 1'!B34","v":"Rolfes Willi"},{"$f":"'Wettkampf 1'!C34","v":"Neuvrees I"},309.3,null,309.3,0,0,0,0,0,0,0,0,309.3,1,0,0,{"$nulls":5},{"v":0,"d":"0.0"},0,0,""]
[26,{"$f":"'Wettkampf 1'!B35","v":"Breyer Wilfried"},{"$f":"'Wettkampf 1'!C35","v":"Neuvrees I"},308.6,null,308.6,0,0,0,0,0,0,0,0,308.6,1,0,0,{"$nulls":5},{"v":0,"d":"0.0"},0,0,""]
[27,{"$f":"'Wettkampf 1'!B36","v":"Janßen Markus"},{"$f":"'Wettkampf 1'!C36","v":"Neuvrees I"},311.7,null,311.7,0,0,0,0,0,0,0,0,311.7,1,0,0,{"$nulls":5},{"v":0,"d":"0.0"},0,0,""]
[28,{"$f":"'Wettkampf 1'!B37","v":"Steenken Klaus"},{"$f":"'Wettkampf 1'!C37","v":"Neuvrees I"},{"v":0,"d":"0.0"},"x","0",0,0,0,0,0,0,0,0,"0",0,0,0,{"$nulls":5},{"v":0,"d":"0.0"},1,0,""]
[29,{"$f":"'Wettkampf 1'!B38","v":"Thyen Werner"},{"$f":"'Wettkampf 1'!C38","v":"Neuvrees I"},307.2,null,307.2,0,0,0,0,0,0,0,0,307.2,1,0,0,{"$nulls":5},{"v":0,"d":"0.0"},0,0,""]
[30,{"$f":"'Wettkampf 1'!B39","v":"Schütze 30"},{"$f":"'Wettkampf 1'!C39","v":"Neuvrees I"},null,"x","0",0,0,0,0,0,0,0,0,"0",0,0,0,{"$nulls":5},{"v":0,"d":"0.0"},1,0,""]
[31,{"$f":"'Wettkampf 1'!B40","v":"Schuckenbrock Simon"},{"$f":"'Wettkampf 1'!C40","v":"Börger III"},{"v":314,"d":"314.0"},null,{"v":314,"d":"314.0"},0,0,0,0,0,0,0,0,0,0,314,1,{"$nulls":5},{"v":0,"d":"0.0"},0,0,""]
[32,{"$f":"'Wettkampf 1'!B41","v":"Henzen Jens"},{"$f":"'Wettkampf 1'!C41","v":"Börger III"},313.1,null,313.1,0,0,0,0,0,0,0,0,0,0,313.1,1,{"$nulls":5},{"v":0,"d":"0.0"},0,0,""]
[33,{"$f":"'Wettkampf 1'!B42","v":"Sebers Daniel"},{"$f":"'Wettkampf 1'!C42","v":"Börger III"},307.4,null,307.4,0,0,0,0,0,0,0,0,0,0,307.4,1,{"$nulls":5},{"v":0,"d":"0.0"},0,0,""]
[34,{"$f":"'Wettkampf 1'!B43","v":"Rode Bernd"},{"$f":"'Wettkampf 1'!C43","v":"Börger III"},306.1,null,306.1,0,0,0,0,0,0,0,0,0,0,306.1,1,{"$nulls":5},{"v":0,"d":"0.0"},0,0,""]
[35,{"$f":"'Wettkampf 1'!B44","v":"Schroer Jürgen"},{"$f":"'Wettkampf 1'!C44","v":"Börger III"},303.6,"x","0",0,0,0,0,0,0,0,0,0,0,"0",0,{"$nulls":5},{"v":0,"d":"0.0"},0,0,""]
[36,{"$f":"'Wettkampf 1'!B45","v":"Schütze 36"},{"$f":"'Wettkampf 1'!C45","v":"Börger III"},null,"x","0",0,0,0,0,0,0,0,0,0,0,"0",0,{"$nulls":5},{"v":0,"d":"0.0"},1,0,""]
[{"$nulls":6},{"$f":"LARGE(G10:G45,1)+LARGE(G10:G45,2)+LARGE(G10:G45,3)","v":932.5},{"$f":"SUM(H10:H45)","v":4},{"$f":"LARGE(I10:I45,1)+LARGE(I10:I45,2)+LARGE(I10:I45,3)","v":919.9000000000001},{"$f":"SUM(J10:J45)","v":4},{"$f":"LARGE(K10:K45,1)+LARGE(K10:K45,2)+LARGE(K10:K45,3)","v":934.4},{"$f":"SUM(L10:L45)","v":4},{"$f":"LARGE(M10:M45,1)+LARGE(M10:M45,2)+LARGE(M10:M45,3)","v":927.8000000000001},{"$f":"SUM(N10:N45)","v":4},{"$f":"LARGE(O10:O45,1)+LARGE(O10:O45,2)+LARGE(O10:O45,3)","v":929.6},{"$f":"SUM(P10:P45)","v":4},{"$f":"LARGE(Q10:Q45,1)+LARGE(Q10:Q45,2)+LARGE(Q10:Q45,3)","v":934.5},{"$f":"SUM(R10:S45)","v":4}]
[null,null,"per Email an: sk-huemmling@gmx.de"]

{"sheet":"11","index":11,"n_rows":47,"n_cols":27,"rows_kept":47,"merged":[[0,22,0,23],[1,22,1,23],[4,22,4,23],[5,22,5,23],[6,22,6,23],[8,20,8,23]]}
[null,"Verein / Gruppe",null,"Ergebnisse",{"$nulls":17},"Austragungsort:",{"$f":"Übersicht!P4","v":"Neuvrees"}]
[1,{"$f":"'Wettkampf 1'!B2","v":"Sögel II"},null,{"$f":"G46","v":{"v":941.5999999999999,"d":"941.6"}},{"$f":"IF(H46>4,\"Es sind zu viele Schützen in Wertung!\",\" \")","v":" "},{"$nulls":16},"Wettkampftag:",{"$f":"Übersicht!P3","v":"19.03."}]
[2,{"$f":"'Wettkampf 1'!B3","v":"Ostenwalde I"},null,{"$f":"I46","v":{"v":925,"d":"925.0"}},{"$f":"IF(J46>4,\"Es sind zu viele Schützen in Wertung!\",\" \")","v":" "}]
[3,{"$f":"'Wettkampf 1'!B4","v":"Neuvrees II"},null,{"$f":"K46","v":929.4},{"$f":"IF(L46>4,\"Es sind zu viele Schützen in Wertung!\",\" \")","v":" "},{"$nulls":18},"Ansprechpartner für Rückfragen:"]
[4,{"$f":"'Wettkampf 1'!B5","v":"Breddenberg IV"},null,{"$f":"M46","v":916.5},{"$f":"IF(N46>4,\"Es sind zu viele Schützen in Wertung!\",\" \")","v":" "},{"$nulls":16},"Name:"]
[5,{"$f":"'Wettkampf 1'!B6","v":"Neuvrees I"},null,{"$f":"O46","v":929.4},{"$f":"IF(P46>4,\"Es sind zu viele Schützen in Wertung!\",\" \")","v":" "},{"$nulls":16},"Tel:"]
[6,{"$f":"'Wettkampf 1'!B7","v":"Börger III"},null,{"$f":"Q46","v":938.2},{"$f":"IF(R46>4,\"Es sind zu viele Schützen in Wertung!\",\" \")","v":" "},{"$nulls":16},"Standaufsicht:","Markus Janßen"]
[]
[null,"Einzelergebnisse:","Verein / Gruppe","Ergebnisse (mindestens 0 eintragen)","AW? Dann x eintippen",null,"Verein 1",null,"Verein 2",null,"Verein 3",null,"Verein 4",null,"Verein 5",null,"Verein 6",{"$nulls":3},"Proberechnung bei Streifen:"]
[1,{"$f":"'Wettkampf 1'!B10","v":"Grünloh Michael"},{"$f":"'Wettkampf 1'!C10","v":"Sögel II"},{"v":313.29999999999995,"d":"313.3"},null,{"$f":"IF(E10=\"x\",\"0\",D10)","v":{"v":313.29999999999995,"d":"313.3"}},{"$f":"IF(C10=$B$2,F10,0)","v":313.29999999999995},{"$f":"(IF(AND($E10=\"\",$C10=$B$2),1,0))","v":1},{"$f":"IF($C10=$B$3,F10,0)","v":0},{"$f":"(IF(AND($E10=\"\",$C10=$B$3),1,0))","v":0},{"$f":"IF($C10=$B$4,F10,0)","v":0},{"$f":"(IF(AND($E10=\"\",$C10=$B$4),1,0))","v":0},{"$f":"IF($C10=$B$5,F10,0)","v":0},{"$f":"(IF(AND($E10=\"\",$C10=$B$5),1,0))","v":0},{"$f":"IF($C10=$B$6,F10,0)","v":0},{"$f":"(IF(AND($E10=\"\",$C10=$B$6),1,0))","v":0},{"$f":"IF($C10=$B$7,F10,0)","v":0},{"$f":"(IF(AND($E10=\"\",$C10=$B$7),1,0))","v":0},null,null,105.1,104.6,103.6,{"$f":"U10+V10+W10","v":{"v":313.29999999999995,"d":"313.3"}},{"$f":"IF(X10=D10,1,0)","v":1},{"$f":"IF(X10=0,0,1)","v":1},{"$f":"IF(Y10+Z10=2,\"Korrekt\",\"\")","v":"Korrekt"}]
[2,{"$f":"'Wettkampf 1'!B11","v":"Trempeck Marco"},{"$f":"'Wettkampf 1'!C11","v":"Sögel II"},312.7,null,{"$f":"IF(E11=\"x\",\"0\",D11)","v":312.7},{"$f":"IF(C11=$B$2,F11,0)","v":312.7},{"$f":"(IF(AND($E11=\"\",$C11=$B$2),1,0))","v":1},{"$f":"IF($C11=$B$3,F11,0)","v":0},{"$f":"(IF(AND($E11=\"\",$C11=$B$3),1,0))","v":0},{"$f":"IF($C11=$B$4,F11,0)","v":0},{"$f":"(IF(AND($E11=\"\",$C11=$B$4),1,0))","v":0},{"$f":"IF($C11=$B$5,F11,0)","v":0},{"$f":"(IF(AND($E11=\"\",$C11=$B$5),1,0))","v":0},{"$f":"IF($C11=$B$6,F11,0)","v":0},{"$f":"(IF(AND($E11=\"\",$C11=$B$6),1,0))","v":0},{"$f":"IF($C11=$B$7,F11,0)","v":0},{"$f":"(IF(AND($E11=\"\",$C11=$B$7),1,0))","v":0},null,null,104.8,104.9,{"v":103,"d":"103.0"},{"$f":"U11+V11+W11","v":312.7},{"$f":"IF(X11=D11,1,0)","v":1},{"$f":"IF(X11=0,0,1)","v":1},{"$f":"IF(Y11+Z11=2,\"Korrekt\",\"\")","v":"Korrekt"}]
[3,{"$f":"'Wettkampf 1'!B12","v":"Robbers Heinz"},{"$f":"'Wettkampf 1'!C12","v":"Sögel II"},315.6,null,315.6,315.6,1,0,0,0,0,0,0,0,0,0,0,null,null,104.7,105.4,105.5,315.6,1,1,"Korrekt"]
[4,{"$f":"'Wettkampf 1'!B13","v":"Robbers Bernd"},{"$f":"'Wettkampf 1'!C13","v":"Sögel II"},{"v":310.90000000000003,"d":"310.9"},null,{"v":310.90000000000003,"d":"310.9"},310.90000000000003,1,0,0,0,0,0,0,0,0,0,0,null,null,104.4,103.2,103.3,{"v":310.90000000000003,"d":"310.9"},1,1,"Korrekt"]
[5,{"$f":"'Wettkampf 1'!B14","v":"Husmann Michael"},{"$f":"'Wettkampf 1'!C14","v":"Sögel II"},{"v":303.79999999999995,"d":"303.8"},"x","0","0",0,0,0,0,0,0,0,0,0,0,0,null,null,100.1,102.8,100.9,{"v":303.79999999999995,"d":"303.8"},1,1,"Korrekt"]
[6,{"$f":"'Wettkampf 1'!B15","v":"Schütze 6"},{"$f":"'Wettkampf 1'!C15","v":"Sögel II"},{"v":0,"d":"0.0"},"x","0","0",0,0,0,0,0,0,0,0,0,0,0,{"$nulls":5},{"v":0,"d":"0.0"},1,0,""]
[7,{"$f":"'Wettkampf 1'!B16","v":"Bunten Manfred"},{"$f":"'Wettkampf 1'!C16","v":"Ostenwalde I"},304.3,null,304.3,0,0,304.3,1,0,0,0,0,0,0,0,0,null,null,103.3,101.2,99.8,304.3,1,1,"Korrekt"]
[8,{"$f":"'Wettkampf 1'!B17","v":"Benten Helmut"},{"$f":"'Wettkampf 1'!C17","v":"Ostenwalde I"},{"v":300,"d":"300.0"},null,{"v":300,"d":"300.0"},0,0,300,1,0,0,0,0,0,0,0,0,null,null,{"v":97,"d":"97.0"},102.6,100.4,{"v":300,"d":"300.0"},1,1,"Korrekt"]
[9,{"$f":"'Wettkampf 1'!B18","v":"Meiners Bernd"},{"$f":"'Wettkampf 1'!C18","v":"Ostenwalde I"},312.7,null,312.7,0,0,312.7,1,0,0,0,0,0,0,0,0,null,null,103.8,106.1,102.8,312.7,1,1,"Korrekt"]
[10,{"$f":"'Wettkampf 1'!B19","v":"Meiners Martin"},{"$f":"'Wettkampf 1'!C19","v":"Ostenwalde I"},{"v":308,"d":"308.0"},null,{"v":308,"d":"308.0"},0,0,308,1,0,0,0,0,0,0,0,0,null,null,103.1,101.5,103.4,{"v":308,"d":"308.0"},1,1,"Korrekt"]
[11,{"$f":"'Wettkampf 1'!B20","v":"Schütze 11"},{"$f":"'Wettkampf 1'!C20","v":"Ostenwalde I"},{"v":0,"d":"0.0"},"x","0",0,0,"0",0,0,0,0,0,0,0,0,0,{"$nulls":5},{"v":0,"d":"0.0"},1,0,""]
[12,{"$f":"'Wettkampf 1'!B21","v":"Schütze 12"},{"$f":"'Wettkampf 1'!C21","v":"Ostenwalde I"},{"v":0,"d":"0.0"},"x","0",0,0,"0",0,0,0,0,0,0,0,0,0,{"$nulls":5},{"v":0,"d":"0.0"},1,0,""]
[13,{"$f":"'Wettkampf 1'!B22","v":"Witting Bernhard"},{"$f":"'Wettkampf 1'!C22","v":"Neuvrees II"},{"v":312,"d":"312.0"},null,{"v":312,"d":"312.0"},0,0,0,0,312,1,0,0,0,0,0,0,null,null,103.9,104.2,103.9,{"v":312,"d":"312.0"},1,1,"Korrekt"]
[14,{"$f":"'Wettkampf 1'!B23","v":"Szczepanski Holger"},{"$f":"'Wettkampf 1'!C23","v":"Neuvrees II"},304.3,null,304.3,0,0,0,0,304.3,1,0,0,0,0,0,0,null,null,101.4,102.1,100.8,304.3,1,1,"Korrekt"]
[15,{"$f":"'Wettkampf 1'!B24","v":"Schrand Karl-Heinz"},{"$f":"'Wettkampf 1'!C24","v":"Neuvrees II"},308.9,null,308.9,0,0,0,0,308.9,1,0,0,0,0,0,0,null,null,{"v":103,"d":"103.0"},102.7,103.2,308.9,1,1,"Korrekt"]
[16,{"$f":"'Wettkampf 1'!B25","v":"Preut Hans"},{"$f":"'Wettkampf 1'!C25","v":"Neuvrees II"},308.5,null,308.5,0,0,0,0,308.5,1,0,0,0,0,0,0,null,null,102.6,103.2,102.7,308.5,1,1,"Korrekt"]
[17,{"$f":"'Wettkampf 1'!B26","v":"Thunert  Dirk"},{"$f":"'Wettkampf 1'!C26","v":"Neuvrees II"},{"v":305.70000000000005,"d":"305.7"},"x","0",0,0,0,0,"0",0,0,0,0,0,0,0,null,null,102.1,101.2,102.4,{"v":305.70000000000005,"d":"305.7"},1,1,"Korrekt"]
[18,{"$f":"'Wettkampf 1'!B27","v":"Schütze 18"},{"$f":"'Wettkampf 1'!C27","v":"Neuvrees II"},{"v":0,"d":"0.0"},"x","0",0,0,0,0,"0",0,0,0,0,0,0,0,{"$nulls":5},{"v":0,"d":"0.0"},1,0,""]
[19,{"$f":"'Wettkampf 1'!B28","v":"Hömmen Bernd"},{"$f":"'Wettkampf 1'!C28","v":"Breddenberg IV"},300.8,null,300.8,0,0,0,0,0,0,300.8,1,0,0,0,0,null,null,100.6,101.2,{"v":99,"d":"99.0"},300.8,1,1,"Korrekt"]
[20,{"$f":"'Wettkampf 1'!B29","v":"Hanekamp Rudi"},{"$f":"'Wettkampf 1'!C29","v":"Breddenberg IV"},306.1,null,306.1,0,0,0,0,0,0,306.1,1,0,0,0,0,null,null,{"v":101,"d":"101.0"},101.5,103.6,306.1,1,1,"Korrekt"]
[21,{"$f":"'Wettkampf 1'!B30","v":"Köß Wilhelm"},{"$f":"'Wettkampf 1'!C30","v":"Breddenberg IV"},309.6,null,309.6,0,0,0,0,0,0,309.6,1,0,0,0,0,null,null,101.5,{"v":103,"d":"103.0"},105.1,309.6,1,1,"Korrekt"]
[22,{"$f":"'Wettkampf 1'!B31","v":"Jansen  Martin"},{"$f":"'Wettkampf 1'!C31","v":"Breddenberg IV"},294.6,null,294.6,0,0,0,0,0,0,294.6,1,0,0,0,0,null,null,97.8,97.7,99.1,294.6,1,1,"Korrekt"]
[23,{"$f":"'Wettkampf 1'!B32","v":"Schütze 23"},{"$f":"'Wettkampf 1'!C32","v":"Breddenberg IV"},{"v":0,"d":"0.0"},"x","0",0,0,0,0,0,0,"0",0,0,0,0,0,{"$nulls":5},{"v":0,"d":"0.0"},1,0,""]
[24,{"$f":"'Wettkampf 1'!B33","v":"Schütze 24"},{"$f":"'Wettkampf 1'!C33","v":"Breddenberg IV"},{"v":0,"d":"0.0"},"x","0",0,0,0,0,0,0,"0",0,0,0,0,0,{"$nulls":5},{"v":0,"d":"0.0"},1,0,""]
[25,{"$f":"'Wettkampf 1'!B34","v":"Rolfes Willi"},{"$f":"'Wettkampf 1'!C34","v":"Neuvrees I"},309.5,null,309.5,0,0,0,0,0,0,0,0,309.5,1,0,0,null,null,102.7,103.9,102.9,309.5,1,1,"Korrekt"]
[26,{"$f":"'Wettkampf 1'!B35","v":"Breyer Wilfried"},{"$f":"'Wettkampf 1'!C35","v":"Neuvrees I"},{"v":310,"d":"310.0"},null,{"v":310,"d":"310.0"},0,0,0,0,0,0,0,0,310,1,0,0,null,null,{"v":103,"d":"103.0"},102.8,104.2,{"v":310,"d":"310.0"},1,1,"Korrekt"]
[27,{"$f":"'Wettkampf 1'!B36","v":"Janßen Markus"},{"$f":"'Wettkampf 1'!C36","v":"Neuvrees I"},309.9,null,309.9,0,0,0,0,0,0,0,0,309.9,1,0,0,null,null,102.3,103.7,103.9,309.9,1,1,"Korrekt"]
[28,{"$f":"'Wettkampf 1'!B37","v":"Steenken Klaus"},{"$f":"'Wettkampf 1'!C37","v":"Neuvrees I"},{"v":0,"d":"0.0"},"x","0",0,0,0,0,0,0,0,0,"0",0,0,0,{"$nulls":5},{"v":0,"d":"0.0"},1,0,""]
[29,{"$f":"'Wettkampf 1'!B38","v":"Thyen Werner"},{"$f":"'Wettkampf 1'!C38","v":"Neuvrees I"},{"v":305,"d":"305.0"},null,{"v":305,"d":"305.0"},0,0,0,0,0,0,0,0,305,1,0,0,null,null,100.9,102.7,101.4,{"v":305,"d":"305.0"},1,1,"Korrekt"]
[30,{"$f":"'Wettkampf 1'!B39","v":"Schütze 30"},{"$f":"'Wettkampf 1'!C39","v":"Neuvrees I"},{"v":0,"d":"0.0"},"x","0",0,0,0,0,0,0,0,0,"0",0,0,0,{"$nulls":5},{"v":0,"d":"0.0"},1,0,""]
[31,{"$f":"'Wettkampf 1'!B40","v":"Schuckenbrock Simon"},{"$f":"'Wettkampf 1'!C40","v":"Börger III"},313.2,null,313.2,0,0,0,0,0,0,0,0,0,0,313.2,1,null,null,104.8,103.7,104.7,313.2,1,1,"Korrekt"]
[32,{"$f":"'Wettkampf 1'!B41","v":"Henzen Jens"},{"$f":"'Wettkampf 1'!C41","v":"Börger III"},314.5,null,314.5,0,0,0,0,0,0,0,0,0,0,314.5,1,null,null,104.2,104.4,105.9,314.5,1,1,"Korrekt"]
[33,{"$f":"'Wettkampf 1'!B42","v":"Sebers Daniel"},{"$f":"'Wettkampf 1'!C42","v":"Börger III"},310.5,null,310.5,0,0,0,0,0,0,0,0,0,0,310.5,1,null,null,103.4,102.5,104.6,310.5,1,1,"Korrekt"]
[34,{"$f":"'Wettkampf 1'!B43","v":"Rode Bernd"},{"$f":"'Wettkampf 1'!C43","v":"Börger III"},308.6,null,308.6,0,0,0,0,0,0,0,0,0,0,308.6,1,null,null,103.4,101.7,103.5,308.6,1,1,"Korrekt"]
[35,{"$f":"'Wettkampf 1'!B44","v":"Schroer Jürgen"},{"$f":"'Wettkampf 1'!C44","v":"Börger III"},{"v":304.20000000000005,"d":"304.2"},"x","0",0,0,0,0,0,0,0,0,0,0,"0",0,null,null,102.9,102.2,99.1,{"v":304.20000000000005,"d":"304.2"},1,1,"Korrekt"]
[36,{"$f":"'Wettkampf 1'!B45","v":"Schütze 36"},{"$f":"'Wettkampf 1'!C45","v":"Börger III"},{"v":0,"d":"0.0"},"x","0",0,0,0,0,0,0,0,0,0,0,"0",0,{"$nulls":5},{"v":0,"d":"0.0"},1,0,""]
[{"$nulls":6},{"$f":"LARGE(G10:G45,1)+LARGE(G10:G45,2)+LARGE(G10:G45,3)","v":941.5999999999999},{"$f":"SUM(H10:H45)","v":4},{"$f":"LARGE(I10:I45,1)+LARGE(I10:I45,2)+LARGE(I10:I45,3)","v":925},{"$f":"SUM(J10:J45)","v":4},{"$f":"LARGE(K10:K45,1)+LARGE(K10:K45,2)+LARGE(K10:K45,3)","v":929.4},{"$f":"SUM(L10:L45)","v":4},{"$f":"LARGE(M10:M45,1)+LARGE(M10:M45,2)+LARGE(M10:M45,3)","v":916.5},{"$f":"SUM(N10:N45)","v":4},{"$f":"LARGE(O10:O45,1)+LARGE(O10:O45,2)+LARGE(O10:O45,3)","v":929.4},{"$f":"SUM(P10:P45)","v":4},{"$f":"LARGE(Q10:Q45,1)+LARGE(Q10:Q45,2)+LARGE(Q10:Q45,3)","v":938.2},{"$f":"SUM(R10:S45)","v":4}]
[null,null,"per Email an: sk-huemmling@gmx.de"]

{"sheet":"12","index":12,"n_rows":47,"n_cols":27,"rows_kept":47,"merged":[[0,22,0,23],[1,22,1,23],[4,22,4,23],[5,22,5,23],[6,22,6,23],[8,20,8,23]]}
[null,"Verein / Gruppe",null,"Ergebnisse",{"$nulls":17},"Austragungsort:",{"$f":"Übersicht!Q4","v":"Börger"}]
[1,{"$f":"'Wettkampf 1'!B2","v":"Sögel II"},null,{"$f":"G46","v":{"v":0,"d":"0.0"}},{"$f":"IF(H46>4,\"Es sind zu viele Schützen in Wertung!\",\" \")","v":" "},{"$nulls":16},"Wettkampftag:",{"$f":"Übersicht!Q3","v":"16.04."}]
[2,{"$f":"'Wettkampf 1'!B3","v":"Ostenwalde I"},null,{"$f":"I46","v":{"v":0,"d":"0.0"}},{"$f":"IF(J46>4,\"Es sind zu viele Schützen in Wertung!\",\" \")","v":" "}]
[3,{"$f":"'Wettkampf 1'!B4","v":"Neuvrees II"},null,{"$f":"K46","v":{"v":0,"d":"0.0"}},{"$f":"IF(L46>4,\"Es sind zu viele Schützen in Wertung!\",\" \")","v":" "},{"$nulls":18},"Ansprechpartner für Rückfragen:"]
[4,{"$f":"'Wettkampf 1'!B5","v":"Breddenberg IV"},null,{"$f":"M46","v":{"v":0,"d":"0.0"}},{"$f":"IF(N46>4,\"Es sind zu viele Schützen in Wertung!\",\" \")","v":" "},{"$nulls":16},"Name:"]
[5,{"$f":"'Wettkampf 1'!B6","v":"Neuvrees I"},null,{"$f":"O46","v":{"v":0,"d":"0.0"}},{"$f":"IF(P46>4,\"Es sind zu viele Schützen in Wertung!\",\" \")","v":" "},{"$nulls":16},"Tel:"]
[6,{"$f":"'Wettkampf 1'!B7","v":"Börger III"},null,{"$f":"Q46","v":{"v":0,"d":"0.0"}},{"$f":"IF(R46>4,\"Es sind zu viele Schützen in Wertung!\",\" \")","v":" "},{"$nulls":16},"Standaufsicht:","eintragen"]
[]
[null,"Einzelergebnisse:","Verein / Gruppe","Ergebnisse (mindestens 0 eintragen)","AW? Dann x eintippen",null,"Verein 1",null,"Verein 2",null,"Verein 3",null,"Verein 4",null,"Verein 5",null,"Verein 6",{"$nulls":3},"Proberechnung bei Streifen:"]
[1,{"$f":"'Wettkampf 1'!B10","v":"Grünloh Michael"},{"$f":"'Wettkampf 1'!C10","v":"Sögel II"},null,null,{"$f":"IF(E10=\"x\",\"0\",D10)","v":{"v":0,"d":"0.0"}},{"$f":"IF(C10=$B$2,F10,0)","v":0},{"$f":"(IF(AND($E10=\"\",$C10=$B$2),1,0))","v":1},{"$f":"IF($C10=$B$3,F10,0)","v":0},{"$f":"(IF(AND($E10=\"\",$C10=$B$3),1,0))","v":0},{"$f":"IF($C10=$B$4,F10,0)","v":0},{"$f":"(IF(AND($E10=\"\",$C10=$B$4),1,0))","v":0},{"$f":"IF($C10=$B$5,F10,0)","v":0},{"$f":"(IF(AND($E10=\"\",$C10=$B$5),1,0))","v":0},{"$f":"IF($C10=$B$6,F10,0)","v":0},{"$f":"(IF(AND($E10=\"\",$C10=$B$6),1,0))","v":0},{"$f":"IF($C10=$B$7,F10,0)","v":0},{"$f":"(IF(AND($E10=\"\",$C10=$B$7),1,0))","v":0},{"$nulls":5},{"$f":"U10+V10+W10","v":{"v":0,"d":"0.0"}},{"$f":"IF(X10=D10,1,0)","v":1},{"$f":"IF(X10=0,0,1)","v":0},{"$f":"IF(Y10+Z10=2,\"Korrekt\",\"\")","v":""}]
[2,{"$f":"'Wettkampf 1'!B11","v":"Trempeck Marco"},{"$f":"'Wettkampf 1'!C11","v":"Sögel II"},null,null,{"$f":"IF(E11=\"x\",\"0\",D11)","v":{"v":0,"d":"0.0"}},{"$f":"IF(C11=$B$2,F11,0)","v":0},{"$f":"(IF(AND($E11=\"\",$C11=$B$2),1,0))","v":1},{"$f":"IF($C11=$B$3,F11,0)","v":0},{"$f":"(IF(AND($E11=\"\",$C11=$B$3),1,0))","v":0},{"$f":"IF($C11=$B$4,F11,0)","v":0},{"$f":"(IF(AND($E11=\"\",$C11=$B$4),1,0))","v":0},{"$f":"IF($C11=$B$5,F11,0)","v":0},{"$f":"(IF(AND($E11=\"\",$C11=$B$5),1,0))","v":0},{"$f":"IF($C11=$B$6,F11,0)","v":0},{"$f":"(IF(AND($E11=\"\",$C11=$B$6),1,0))","v":0},{"$f":"IF($C11=$B$7,F11,0)","v":0},{"$f":"(IF(AND($E11=\"\",$C11=$B$7),1,0))","v":0},{"$nulls":5},{"$f":"U11+V11+W11","v":{"v":0,"d":"0.0"}},{"$f":"IF(X11=D11,1,0)","v":1},{"$f":"IF(X11=0,0,1)","v":0},{"$f":"IF(Y11+Z11=2,\"Korrekt\",\"\")","v":""}]
[3,{"$f":"'Wettkampf 1'!B12","v":"Robbers Heinz"},{"$f":"'Wettkampf 1'!C12","v":"Sögel II"},null,null,{"v":0,"d":"0.0"},0,1,0,0,0,0,0,0,0,0,0,0,{"$nulls":5},{"v":0,"d":"0.0"},1,0,""]
[4,{"$f":"'Wettkampf 1'!B13","v":"Robbers Bernd"},{"$f":"'Wettkampf 1'!C13","v":"Sögel II"},null,null,{"v":0,"d":"0.0"},0,1,0,0,0,0,0,0,0,0,0,0,{"$nulls":5},{"v":0,"d":"0.0"},1,0,""]
[5,{"$f":"'Wettkampf 1'!B14","v":"Husmann Michael"},{"$f":"'Wettkampf 1'!C14","v":"Sögel II"},null,"x","0","0",0,0,0,0,0,0,0,0,0,0,0,{"$nulls":5},{"v":0,"d":"0.0"},1,0,""]
[6,{"$f":"'Wettkampf 1'!B15","v":"Schütze 6"},{"$f":"'Wettkampf 1'!C15","v":"Sögel II"},null,"x","0","0",0,0,0,0,0,0,0,0,0,0,0,{"$nulls":5},{"v":0,"d":"0.0"},1,0,""]
[7,{"$f":"'Wettkampf 1'!B16","v":"Bunten Manfred"},{"$f":"'Wettkampf 1'!C16","v":"Ostenwalde I"},null,null,{"v":0,"d":"0.0"},0,0,0,1,0,0,0,0,0,0,0,0,{"$nulls":5},{"v":0,"d":"0.0"},1,0,""]
[8,{"$f":"'Wettkampf 1'!B17","v":"Benten Helmut"},{"$f":"'Wettkampf 1'!C17","v":"Ostenwalde I"},null,null,{"v":0,"d":"0.0"},0,0,0,1,0,0,0,0,0,0,0,0,{"$nulls":5},{"v":0,"d":"0.0"},1,0,""]
[9,{"$f":"'Wettkampf 1'!B18","v":"Meiners Bernd"},{"$f":"'Wettkampf 1'!C18","v":"Ostenwalde I"},null,null,{"v":0,"d":"0.0"},0,0,0,1,0,0,0,0,0,0,0,0,{"$nulls":5},{"v":0,"d":"0.0"},1,0,""]
[10,{"$f":"'Wettkampf 1'!B19","v":"Meiners Martin"},{"$f":"'Wettkampf 1'!C19","v":"Ostenwalde I"},null,null,{"v":0,"d":"0.0"},0,0,0,1,0,0,0,0,0,0,0,0,{"$nulls":5},{"v":0,"d":"0.0"},1,0,""]
[11,{"$f":"'Wettkampf 1'!B20","v":"Schütze 11"},{"$f":"'Wettkampf 1'!C20","v":"Ostenwalde I"},null,"x","0",0,0,"0",0,0,0,0,0,0,0,0,0,{"$nulls":5},{"v":0,"d":"0.0"},1,0,""]
[12,{"$f":"'Wettkampf 1'!B21","v":"Schütze 12"},{"$f":"'Wettkampf 1'!C21","v":"Ostenwalde I"},null,"x","0",0,0,"0",0,0,0,0,0,0,0,0,0,{"$nulls":5},{"v":0,"d":"0.0"},1,0,""]
[13,{"$f":"'Wettkampf 1'!B22","v":"Witting Bernhard"},{"$f":"'Wettkampf 1'!C22","v":"Neuvrees II"},null,null,{"v":0,"d":"0.0"},0,0,0,0,0,1,0,0,0,0,0,0,{"$nulls":5},{"v":0,"d":"0.0"},1,0,""]
[14,{"$f":"'Wettkampf 1'!B23","v":"Szczepanski Holger"},{"$f":"'Wettkampf 1'!C23","v":"Neuvrees II"},null,null,{"v":0,"d":"0.0"},0,0,0,0,0,1,0,0,0,0,0,0,{"$nulls":5},{"v":0,"d":"0.0"},1,0,""]
[15,{"$f":"'Wettkampf 1'!B24","v":"Schrand Karl-Heinz"},{"$f":"'Wettkampf 1'!C24","v":"Neuvrees II"},null,null,{"v":0,"d":"0.0"},0,0,0,0,0,1,0,0,0,0,0,0,{"$nulls":5},{"v":0,"d":"0.0"},1,0,""]
[16,{"$f":"'Wettkampf 1'!B25","v":"Preut Hans"},{"$f":"'Wettkampf 1'!C25","v":"Neuvrees II"},null,null,{"v":0,"d":"0.0"},0,0,0,0,0,1,0,0,0,0,0,0,{"$nulls":5},{"v":0,"d":"0.0"},1,0,""]
[17,{"$f":"'Wettkampf 1'!B26","v":"Thunert  Dirk"},{"$f":"'Wettkampf 1'!C26","v":"Neuvrees II"},null,"x","0",0,0,0,0,"0",0,0,0,0,0,0,0,{"$nulls":5},{"v":0,"d":"0.0"},1,0,""]
[18,{"$f":"'Wettkampf 1'!B27","v":"Schütze 18"},{"$f":"'Wettkampf 1'!C27","v":"Neuvrees II"},null,"x","0",0,0,0,0,"0",0,0,0,0,0,0,0,{"$nulls":5},{"v":0,"d":"0.0"},1,0,""]
[19,{"$f":"'Wettkampf 1'!B28","v":"Hömmen Bernd"},{"$f":"'Wettkampf 1'!C28","v":"Breddenberg IV"},null,null,{"v":0,"d":"0.0"},0,0,0,0,0,0,0,1,0,0,0,0,{"$nulls":5},{"v":0,"d":"0.0"},1,0,""]
[20,{"$f":"'Wettkampf 1'!B29","v":"Hanekamp Rudi"},{"$f":"'Wettkampf 1'!C29","v":"Breddenberg IV"},null,null,{"v":0,"d":"0.0"},0,0,0,0,0,0,0,1,0,0,0,0,{"$nulls":5},{"v":0,"d":"0.0"},1,0,""]
[21,{"$f":"'Wettkampf 1'!B30","v":"Köß Wilhelm"},{"$f":"'Wettkampf 1'!C30","v":"Breddenberg IV"},null,null,{"v":0,"d":"0.0"},0,0,0,0,0,0,0,1,0,0,0,0,{"$nulls":5},{"v":0,"d":"0.0"},1,0,""]
[22,{"$f":"'Wettkampf 1'!B31","v":"Jansen  Martin"},{"$f":"'Wettkampf 1'!C31","v":"Breddenberg IV"},null,null,{"v":0,"d":"0.0"},0,0,0,0,0,0,0,1,0,0,0,0,{"$nulls":5},{"v":0,"d":"0.0"},1,0,""]
[23,{"$f":"'Wettkampf 1'!B32","v":"Schütze 23"},{"$f":"'Wettkampf 1'!C32","v":"Breddenberg IV"},null,"x","0",0,0,0,0,0,0,"0",0,0,0,0,0,{"$nulls":5},{"v":0,"d":"0.0"},1,0,""]
[24,{"$f":"'Wettkampf 1'!B33","v":"Schütze 24"},{"$f":"'Wettkampf 1'!C33","v":"Breddenberg IV"},null,"x","0",0,0,0,0,0,0,"0",0,0,0,0,0,{"$nulls":5},{"v":0,"d":"0.0"},1,0,""]
[25,{"$f":"'Wettkampf 1'!B34","v":"Rolfes Willi"},{"$f":"'Wettkampf 1'!C34","v":"Neuvrees I"},null,null,{"v":0,"d":"0.0"},0,0,0,0,0,0,0,0,0,1,0,0,{"$nulls":5},{"v":0,"d":"0.0"},1,0,""]
[26,{"$f":"'Wettkampf 1'!B35","v":"Breyer Wilfried"},{"$f":"'Wettkampf 1'!C35","v":"Neuvrees I"},null,null,{"v":0,"d":"0.0"},0,0,0,0,0,0,0,0,0,1,0,0,{"$nulls":5},{"v":0,"d":"0.0"},1,0,""]
[27,{"$f":"'Wettkampf 1'!B36","v":"Janßen Markus"},{"$f":"'Wettkampf 1'!C36","v":"Neuvrees I"},null,null,{"v":0,"d":"0.0"},0,0,0,0,0,0,0,0,0,1,0,0,{"$nulls":5},{"v":0,"d":"0.0"},1,0,""]
[28,{"$f":"'Wettkampf 1'!B37","v":"Steenken Klaus"},{"$f":"'Wettkampf 1'!C37","v":"Neuvrees I"},null,null,{"v":0,"d":"0.0"},0,0,0,0,0,0,0,0,0,1,0,0,{"$nulls":5},{"v":0,"d":"0.0"},1,0,""]
[29,{"$f":"'Wettkampf 1'!B38","v":"Thyen Werner"},{"$f":"'Wettkampf 1'!C38","v":"Neuvrees I"},null,"x","0",0,0,0,0,0,0,0,0,"0",0,0,0,{"$nulls":5},{"v":0,"d":"0.0"},1,0,""]
[30,{"$f":"'Wettkampf 1'!B39","v":"Schütze 30"},{"$f":"'Wettkampf 1'!C39","v":"Neuvrees I"},null,"x","0",0,0,0,0,0,0,0,0,"0",0,0,0,{"$nulls":5},{"v":0,"d":"0.0"},1,0,""]
[31,{"$f":"'Wettkampf 1'!B40","v":"Schuckenbrock Simon"},{"$f":"'Wettkampf 1'!C40","v":"Börger III"},null,null,{"v":0,"d":"0.0"},0,0,0,0,0,0,0,0,0,0,0,1,{"$nulls":5},{"v":0,"d":"0.0"},1,0,""]
[32,{"$f":"'Wettkampf 1'!B41","v":"Henzen Jens"},{"$f":"'Wettkampf 1'!C41","v":"Börger III"},null,null,{"v":0,"d":"0.0"},0,0,0,0,0,0,0,0,0,0,0,1,{"$nulls":5},{"v":0,"d":"0.0"},1,0,""]
[33,{"$f":"'Wettkampf 1'!B42","v":"Sebers Daniel"},{"$f":"'Wettkampf 1'!C42","v":"Börger III"},null,null,{"v":0,"d":"0.0"},0,0,0,0,0,0,0,0,0,0,0,1,{"$nulls":5},{"v":0,"d":"0.0"},1,0,""]
[34,{"$f":"'Wettkampf 1'!B43","v":"Rode Bernd"},{"$f":"'Wettkampf 1'!C43","v":"Börger III"},null,null,{"v":0,"d":"0.0"},0,0,0,0,0,0,0,0,0,0,0,1,{"$nulls":5},{"v":0,"d":"0.0"},1,0,""]
[35,{"$f":"'Wettkampf 1'!B44","v":"Schroer Jürgen"},{"$f":"'Wettkampf 1'!C44","v":"Börger III"},null,"x","0",0,0,0,0,0,0,0,0,0,0,"0",0,{"$nulls":5},{"v":0,"d":"0.0"},1,0,""]
[36,{"$f":"'Wettkampf 1'!B45","v":"Schütze 36"},{"$f":"'Wettkampf 1'!C45","v":"Börger III"},null,"x","0",0,0,0,0,0,0,0,0,0,0,"0",0,{"$nulls":5},{"v":0,"d":"0.0"},1,0,""]
[{"$nulls":6},{"$f":"LARGE(G10:G45,1)+LARGE(G10:G45,2)+LARGE(G10:G45,3)","v":0},{"$f":"SUM(H10:H45)","v":4},{"$f":"LARGE(I10:I45,1)+LARGE(I10:I45,2)+LARGE(I10:I45,3)","v":0},{"$f":"SUM(J10:J45)","v":4},{"$f":"LARGE(K10:K45,1)+LARGE(K10:K45,2)+LARGE(K10:K45,3)","v":0},{"$f":"SUM(L10:L45)","v":4},{"$f":"LARGE(M10:M45,1)+LARGE(M10:M45,2)+LARGE(M10:M45,3)","v":0},{"$f":"SUM(N10:N45)","v":4},{"$f":"LARGE(O10:O45,1)+LARGE(O10:O45,2)+LARGE(O10:O45,3)","v":0},{"$f":"SUM(P10:P45)","v":4},{"$f":"LARGE(Q10:Q45,1)+LARGE(Q10:Q45,2)+LARGE(Q10:Q45,3)","v":0},{"$f":"SUM(R10:S45)","v":4}]
[null,null,"per Email an: sk-huemmling@gmx.de"]

{"sheet":"Ausdruck","index":13,"n_rows":48,"n_cols":29,"rows_kept":48,"merged":[[0,3,0,19],[0,24,0,25],[1,3,1,19],[1,24,1,25],[2,3,2,19],[3,3,3,19],[4,24,4,25],[5,24,5,25],[6,24,6,25],[8,22,8,25]]}
[null,"Verein / Gruppe","Ergebnisse",{"$f":"Übersicht!K1","v":"2022/2023"},{"$nulls":19},"Austragungsort:"]
[1,{"$f":"'Wettkampf 1'!B2","v":"Sögel II"},null,"Klasse:",{"$nulls":19},"Wettkampftag:"]
[2,{"$f":"'Wettkampf 1'!B3","v":"Ostenwalde I"},null,{"$f":"Übersicht!M1","v":"2. Kreisklasse"}]
[3,{"$f":"'Wettkampf 1'!B4","v":"Neuvrees II"},null,{"$f":"Übersicht!P1","v":"Schützen"},{"$nulls":21},"Ansprechpartner für Rückfragen:"]
[4,{"$f":"'Wettkampf 1'!B5","v":"Breddenberg IV"},{"$nulls":21},"Name:"]
[5,{"$f":"'Wettkampf 1'!B6","v":"Neuvrees I"},{"$nulls":21},"Tel:"]
[6,{"$f":"'Wettkampf 1'!B7","v":"Börger III"},{"$nulls":21},"Standaufsicht:"]
[]
[null,"Name Schütze","Verein/Gruppe","Ergebnis","AW? ",null,"Verein 1",null,"Verein 2",null,"Verein 3",null,"Verein 4",null,"Verein 5",null,"Verein 6",{"$nulls":3},"Geburts-datum",null,"Proberechnung bei Streifen:"]
[1,{"$f":"'Wettkampf 1'!B10","v":"Grünloh Michael"},{"$f":"'Wettkampf 1'!C10","v":"Sögel II"},null,null,{"$f":"IF(E10=\"x\",\"0\",D10)","v":0},{"$f":"IF(C10=$B$2,F10,0)","v":0},{"$f":"(IF(AND($E10=\"\",$C10=$B$2),1,0))","v":1},{"$f":"IF($C10=$B$3,F10,0)","v":0},{"$f":"(IF(AND($E10=\"\",$C10=$B$3),1,0))","v":0},{"$f":"IF($C10=$B$4,F10,0)","v":0},{"$f":"(IF(AND($E10=\"\",$C10=$B$4),1,0))","v":0},{"$f":"IF($C10=$B$5,F10,0)","v":0},{"$f":"(IF(AND($E10=\"\",$C10=$B$5),1,0))","v":0},{"$f":"IF($C10=$B$6,F10,0)","v":0},{"$f":"(IF(AND($E10=\"\",$C10=$B$6),1,0))","v":0},{"$f":"IF($C10=$B$7,F10,0)","v":0},{"$f":"(IF(AND($E10=\"\",$C10=$B$7),1,0))","v":0},{"$nulls":8},{"$f":"IF(Z10=D10,1,0)","v":1},{"$f":"IF(Z10=0,0,1)","v":0},{"$f":"IF(AA10+AB10=2,\"Korrekt\",\"\")","v":""}]
[2,{"$f":"'Wettkampf 1'!B11","v":"Trempeck Marco"},{"$f":"'Wettkampf 1'!C11","v":"Sögel II"},null,null,{"$f":"IF(E11=\"x\",\"0\",D11)","v":0},{"$f":"IF(C11=$B$2,F11,0)","v":0},{"$f":"(IF(AND($E11=\"\",$C11=$B$2),1,0))","v":1},{"$f":"IF($C11=$B$3,F11,0)","v":0},{"$f":"(IF(AND($E11=\"\",$C11=$B$3),1,0))","v":0},{"$f":"IF($C11=$B$4,F11,0)","v":0},{"$f":"(IF(AND($E11=\"\",$C11=$B$4),1,0))","v":0},{"$f":"IF($C11=$B$5,F11,0)","v":0},{"$f":"(IF(AND($E11=\"\",$C11=$B$5),1,0))","v":0},{"$f":"IF($C11=$B$6,F11,0)","v":0},{"$f":"(IF(AND($E11=\"\",$C11=$B$6),1,0))","v":0},{"$f":"IF($C11=$B$7,F11,0)","v":0},{"$f":"(IF(AND($E11=\"\",$C11=$B$7),1,0))","v":0},{"$nulls":8},{"$f":"IF(Z11=D11,1,0)","v":1},{"$f":"IF(Z11=0,0,1)","v":0},{"$f":"IF(AA11+AB11=2,\"Korrekt\",\"\")","v":""}]
[3,{"$f":"'Wettkampf 1'!B12","v":"Robbers Heinz"},{"$f":"'Wettkampf 1'!C12","v":"Sögel II"},null,null,0,0,1,0,0,0,0,0,0,0,0,0,0,{"$nulls":8},1,0,""]
[4,{"$f":"'Wettkampf 1'!B13","v":"Robbers Bernd"},{"$f":"'Wettkampf 1'!C13","v":"Sögel II"},null,null,0,0,1,0,0,0,0,0,0,0,0,0,0,{"$nulls":8},1,0,""]
[5,{"$f":"'Wettkampf 1'!B14","v":"Husmann Michael"},{"$f":"'Wettkampf 1'!C14","v":"Sögel II"},null,null,0,0,1,0,0,0,0,0,0,0,0,0,0,{"$nulls":8},1,0,""]
[6,{"$f":"'Wettkampf 1'!B15","v":"Schütze 6"},{"$f":"'Wettkampf 1'!C15","v":"Sögel II"},null,null,0,0,1,0,0,0,0,0,0,0,0,0,0,{"$nulls":8},1,0,""]
[7,{"$f":"'Wettkampf 1'!B16","v":"Bunten Manfred"},{"$f":"'Wettkampf 1'!C16","v":"Ostenwalde I"},null,null,0,0,0,0,1,0,0,0,0,0,0,0,0,{"$nulls":8},1,0,""]
[8,{"$f":"'Wettkampf 1'!B17","v":"Benten Helmut"},{"$f":"'Wettkampf 1'!C17","v":"Ostenwalde I"},null,null,0,0,0,0,1,0,0,0,0,0,0,0,0,{"$nulls":8},1,0,""]
[9,{"$f":"'Wettkampf 1'!B18","v":"Meiners Bernd"},{"$f":"'Wettkampf 1'!C18","v":"Ostenwalde I"},null,null,0,0,0,0,1,0,0,0,0,0,0,0,0,{"$nulls":8},1,0,""]
[10,{"$f":"'Wettkampf 1'!B19","v":"Meiners Martin"},{"$f":"'Wettkampf 1'!C19","v":"Ostenwalde I"},null,null,0,0,0,0,1,0,0,0,0,0,0,0,0,{"$nulls":8},1,0,""]
[11,{"$f":"'Wettkampf 1'!B20","v":"Schütze 11"},{"$f":"'Wettkampf 1'!C20","v":"Ostenwalde I"},null,null,0,0,0,0,1,0,0,0,0,0,0,0,0,{"$nulls":8},1,0,""]
[12,{"$f":"'Wettkampf 1'!B21","v":"Schütze 12"},{"$f":"'Wettkampf 1'!C21","v":"Ostenwalde I"},null,null,0,0,0,0,1,0,0,0,0,0,0,0,0,{"$nulls":8},1,0,""]
[13,{"$f":"'Wettkampf 1'!B22","v":"Witting Bernhard"},{"$f":"'Wettkampf 1'!C22","v":"Neuvrees II"},null,null,0,0,0,0,0,0,1,0,0,0,0,0,0,{"$nulls":8},1,0,""]
[14,{"$f":"'Wettkampf 1'!B23","v":"Szczepanski Holger"},{"$f":"'Wettkampf 1'!C23","v":"Neuvrees II"},null,null,0,0,0,0,0,0,1,0,0,0,0,0,0,{"$nulls":8},1,0,""]
[15,{"$f":"'Wettkampf 1'!B24","v":"Schrand Karl-Heinz"},{"$f":"'Wettkampf 1'!C24","v":"Neuvrees II"},null,null,0,0,0,0,0,0,1,0,0,0,0,0,0,{"$nulls":8},1,0,""]
[16,{"$f":"'Wettkampf 1'!B25","v":"Preut Hans"},{"$f":"'Wettkampf 1'!C25","v":"Neuvrees II"},null,null,0,0,0,0,0,0,1,0,0,0,0,0,0,{"$nulls":8},1,0,""]
[17,{"$f":"'Wettkampf 1'!B26","v":"Thunert  Dirk"},{"$f":"'Wettkampf 1'!C26","v":"Neuvrees II"},null,null,0,0,0,0,0,0,1,0,0,0,0,0,0,{"$nulls":8},1,0,""]
[18,{"$f":"'Wettkampf 1'!B27","v":"Schütze 18"},{"$f":"'Wettkampf 1'!C27","v":"Neuvrees II"},null,null,0,0,0,0,0,0,1,0,0,0,0,0,0,{"$nulls":8},1,0,""]
[19,{"$f":"'Wettkampf 1'!B28","v":"Hömmen Bernd"},{"$f":"'Wettkampf 1'!C28","v":"Breddenberg IV"},null,null,0,0,0,0,0,0,0,0,1,0,0,0,0,{"$nulls":8},1,0,""]
[20,{"$f":"'Wettkampf 1'!B29","v":"Hanekamp Rudi"},{"$f":"'Wettkampf 1'!C29","v":"Breddenberg IV"},null,null,0,0,0,0,0,0,0,0,1,0,0,0,0,{"$nulls":8},1,0,""]
[21,{"$f":"'Wettkampf 1'!B30","v":"Köß Wilhelm"},{"$f":"'Wettkampf 1'!C30","v":"Breddenberg IV"},null,null,0,0,0,0,0,0,0,0,1,0,0,0,0,{"$nulls":8},1,0,""]
[22,{"$f":"'Wettkampf 1'!B31","v":"Jansen  Martin"},{"$f":"'Wettkampf 1'!C31","v":"Breddenberg IV"},null,null,0,0,0,0,0,0,0,0,1,0,0,0,0,{"$nulls":8},1,0,""]
[23,{"$f":"'Wettkampf 1'!B32","v":"Schütze 23"},{"$f":"'Wettkampf 1'!C32","v":"Breddenberg IV"},null,null,0,0,0,0,0,0,0,0,1,0,0,0,0,{"$nulls":8},1,0,""]
[24,{"$f":"'Wettkampf 1'!B33","v":"Schütze 24"},{"$f":"'Wettkampf 1'!C33","v":"Breddenberg IV"},null,null,0,0,0,0,0,0,0,0,1,0,0,0,0,{"$nulls":8},1,0,""]
[25,{"$f":"'Wettkampf 1'!B34","v":"Rolfes Willi"},{"$f":"'Wettkampf 1'!C34","v":"Neuvrees I"},null,null,0,0,0,0,0,0,0,0,0,0,1,0,0,{"$nulls":8},1,0,""]
[26,{"$f":"'Wettkampf 1'!B35","v":"Breyer Wilfried"},{"$f":"'Wettkampf 1'!C35","v":"Neuvrees I"},null,null,0,0,0,0,0,0,0,0,0,0,1,0,0,{"$nulls":8},1,0,""]
[27,{"$f":"'Wettkampf 1'!B36","v":"Janßen Markus"},{"$f":"'Wettkampf 1'!C36","v":"Neuvrees I"},null,null,0,0,0,0,0,0,0,0,0,0,1,0,0,{"$nulls":8},1,0,""]
[28,{"$f":"'Wettkampf 1'!B37","v":"Steenken Klaus"},{"$f":"'Wettkampf 1'!C37","v":"Neuvrees I"},null,null,0,0,0,0,0,0,0,0,0,0,1,0,0,{"$nulls":8},1,0,""]
[29,{"$f":"'Wettkampf 1'!B38","v":"Thyen Werner"},{"$f":"'Wettkampf 1'!C38","v":"Neuvrees I"},null,null,0,0,0,0,0,0,0,0,0,0,1,0,0,{"$nulls":8},1,0,""]
[30,{"$f":"'Wettkampf 1'!B39","v":"Schütze 30"},{"$f":"'Wettkampf 1'!C39","v":"Neuvrees I"},null,null,0,0,0,0,0,0,0,0,0,0,1,0,0,{"$nulls":8},1,0,""]
[31,{"$f":"'Wettkampf 1'!B40","v":"Schuckenbrock Simon"},{"$f":"'Wettkampf 1'!C40","v":"Börger III"},null,null,0,0,0,0,0,0,0,0,0,0,0,0,1,{"$nulls":8},1,0,""]
[32,{"$f":"'Wettkampf 1'!B41","v":"Henzen Jens"},{"$f":"'Wettkampf 1'!C41","v":"Börger III"},null,null,0,0,0,0,0,0,0,0,0,0,0,0,1,{"$nulls":8},1,0,""]
[33,{"$f":"'Wettkampf 1'!B42","v":"Sebers Daniel"},{"$f":"'Wettkampf 1'!C42","v":"Börger III"},null,null,0,0,0,0,0,0,0,0,0,0,0,0,1,{"$nulls":8},1,0,""]
[34,{"$f":"'Wettkampf 1'!B43","v":"Rode Bernd"},{"$f":"'Wettkampf 1'!C43","v":"Börger III"},null,null,0,0,0,0,0,0,0,0,0,0,0,0,1,{"$nulls":8},1,0,""]
[35,{"$f":"'Wettkampf 1'!B44","v":"Schroer Jürgen"},{"$f":"'Wettkampf 1'!C44","v":"Börger III"},null,null,0,0,0,0,0,0,0,0,0,0,0,0,1,{"$nulls":8},1,0,""]
[36,{"$f":"'Wettkampf 1'!B45","v":"Schütze 36"},{"$f":"'Wettkampf 1'!C45","v":"Börger III"},null,null,0,0,0,0,0,0,0,0,0,0,0,0,1,{"$nulls":8},1,0,""]
[{"$nulls":6},{"$f":"LARGE(G10:G45,1)+LARGE(G10:G45,2)+LARGE(G10:G45,3)","v":0},{"$f":"SUM(H10:H45)","v":6},{"$f":"LARGE(I10:I45,1)+LARGE(I10:I45,2)+LARGE(I10:I45,3)","v":0},{"$f":"SUM(J10:J45)","v":6},{"$f":"LARGE(K10:K45,1)+LARGE(K10:K45,2)+LARGE(K10:K45,3)","v":0},{"$f":"SUM(L10:L45)","v":6},{"$f":"LARGE(M10:M45,1)+LARGE(M10:M45,2)+LARGE(M10:M45,3)","v":0},{"$f":"SUM(N10:N45)","v":6},{"$f":"LARGE(O10:O45,1)+LARGE(O10:O45,2)+LARGE(O10:O45,3)","v":0},{"$f":"SUM(P10:P45)","v":6},{"$f":"LARGE(Q10:Q45,1)+LARGE(Q10:Q45,2)+LARGE(Q10:Q45,3)","v":0},{"$f":"SUM(R10:S45)","v":6}]
[]
[null,"Bitte beachtet, dass die Standaufsicht benannt werden muss"]

{"sheet":"Ausdruck blank","index":14,"n_rows":48,"n_cols":29,"rows_kept":48,"merged":[[0,3,0,19],[0,24,0,25],[1,3,1,19],[1,24,1,25],[2,3,2,19],[3,3,3,19],[4,24,4,25],[5,24,5,25],[6,24,6,25],[8,22,8,25]]}
[null,"Verein / Gruppe","Ergebnisse",{"$f":"Übersicht!K1","v":"2022/2023"},{"$nulls":19},"Austragungsort:"]
[1,null,null,"Klasse:",{"$nulls":19},"Wettkampftag:"]
[2]
[3,{"$nulls":24},"Ansprechpartner für Rückfragen:"]
[4,{"$nulls":22},"Name:"]
[5,{"$nulls":22},"Tel:"]
[6,{"$nulls":22},"Standaufsicht:"]
[]
[null,"Name Schütze","Verein/Gruppe","Ergebnis","AW? ",null,"Verein 1",null,"Verein 2",null,"Verein 3",null,"Verein 4",null,"Verein 5",null,"Verein 6",{"$nulls":3},"Geburts-datum",null,"Proberechnung bei Streifen:"]
[1,{"$nulls":4},{"$f":"IF(E10=\"x\",\"0\",D10)","v":0},{"$f":"IF(C10=$B$2,F10,0)","v":0},{"$f":"(IF(AND($E10=\"\",$C10=$B$2),1,0))","v":1},{"$f":"IF($C10=$B$3,F10,0)","v":0},{"$f":"(IF(AND($E10=\"\",$C10=$B$3),1,0))","v":1},{"$f":"IF($C10=$B$4,F10,0)","v":0},{"$f":"(IF(AND($E10=\"\",$C10=$B$4),1,0))","v":1},{"$f":"IF($C10=$B$5,F10,0)","v":0},{"$f":"(IF(AND($E10=\"\",$C10=$B$5),1,0))","v":1},{"$f":"IF($C10=$B$6,F10,0)","v":0},{"$f":"(IF(AND($E10=\"\",$C10=$B$6),1,0))","v":1},{"$f":"IF($C10=$B$7,F10,0)","v":0},{"$f":"(IF(AND($E10=\"\",$C10=$B$7),1,0))","v":1},{"$nulls":8},{"$f":"IF(Z10=D10,1,0)","v":1},{"$f":"IF(Z10=0,0,1)","v":0},{"$f":"IF(AA10+AB10=2,\"Korrekt\",\"\")","v":""}]
[2,{"$nulls":4},{"$f":"IF(E11=\"x\",\"0\",D11)","v":0},{"$f":"IF(C11=$B$2,F11,0)","v":0},{"$f":"(IF(AND($E11=\"\",$C11=$B$2),1,0))","v":1},{"$f":"IF($C11=$B$3,F11,0)","v":0},{"$f":"(IF(AND($E11=\"\",$C11=$B$3),1,0))","v":1},{"$f":"IF($C11=$B$4,F11,0)","v":0},{"$f":"(IF(AND($E11=\"\",$C11=$B$4),1,0))","v":1},{"$f":"IF($C11=$B$5,F11,0)","v":0},{"$f":"(IF(AND($E11=\"\",$C11=$B$5),1,0))","v":1},{"$f":"IF($C11=$B$6,F11,0)","v":0},{"$f":"(IF(AND($E11=\"\",$C11=$B$6),1,0))","v":1},{"$f":"IF($C11=$B$7,F11,0)","v":0},{"$f":"(IF(AND($E11=\"\",$C11=$B$7),1,0))","v":1},{"$nulls":8},{"$f":"IF(Z11=D11,1,0)","v":1},{"$f":"IF(Z11=0,0,1)","v":0},{"$f":"IF(AA11+AB11=2,\"Korrekt\",\"\")","v":""}]
[3,{"$nulls":4},0,0,1,0,1,0,1,0,1,0,1,0,1,{"$nulls":8},1,0,""]
[4,{"$nulls":4},0,0,1,0,1,0,1,0,1,0,1,0,1,{"$nulls":8},1,0,""]
[5,{"$nulls":4},0,0,1,0,1,0,1,0,1,0,1,0,1,{"$nulls":8},1,0,""]
[6,{"$nulls":4},0,0,1,0,1,0,1,0,1,0,1,0,1,{"$nulls":8},1,0,""]
[7,{"$nulls":4},0,0,1,0,1,0,1,0,1,0,1,0,1,{"$nulls":8},1,0,""]
[8,{"$nulls":4},0,0,1,0,1,0,1,0,1,0,1,0,1,{"$nulls":8},1,0,""]
[9,{"$nulls":4},0,0,1,0,1,0,1,0,1,0,1,0,1,{"$nulls":8},1,0,""]
[10,{"$nulls":4},0,0,1,0,1,0,1,0,1,0,1,0,1,{"$nulls":8},1,0,""]
[11,{"$nulls":4},0,0,1,0,1,0,1,0,1,0,1,0,1,{"$nulls":8},1,0,""]
[12,{"$nulls":4},0,0,1,0,1,0,1,0,1,0,1,0,1,{"$nulls":8},1,0,""]
[13,{"$nulls":4},0,0,1,0,1,0,1,0,1,0,1,0,1,{"$nulls":8},1,0,""]
[14,{"$nulls":4},0,0,1,0,1,0,1,0,1,0,1,0,1,{"$nulls":8},1,0,""]
[15,{"$nulls":4},0,0,1,0,1,0,1,0,1,0,1,0,1,{"$nulls":8},1,0,""]
[16,{"$nulls":4},0,0,1,0,1,0,1,0,1,0,1,0,1,{"$nulls":8},1,0,""]
[17,{"$nulls":4},0,0,1,0,1,0,1,0,1,0,1,0,1,{"$nulls":8},1,0,""]
[18,{"$nulls":4},0,0,1,0,1,0,1,0,1,0,1,0,1,{"$nulls":8},1,0,""]
[19,{"$nulls":4},0,0,1,0,1,0,1,0,1,0,1,0,1,{"$nulls":8},1,0,""]
[20,{"$nulls":4},0,0,1,0,1,0,1,0,1,0,1,0,1,{"$nulls":8},1,0,""]
[21,{"$nulls":4},0,0,1,0,1,0,1,0,1,0,1,0,1,{"$nulls":8},1,0,""]
[22,{"$nulls":4},0,0,1,0,1,0,1,0,1,0,1,0,1,{"$nulls":8},1,0,""]
[23,{"$nulls":4},0,0,1,0,1,0,1,0,1,0,1,0,1,{"$nulls":8},1,0,""]
[24,{"$nulls":4},0,0,1,0,1,0,1,0,1,0,1,0,1,{"$nulls":8},1,0,""]
[25,{"$nulls":4},0,0,1,0,1,0,1,0,1,0,1,0,1,{"$nulls":8},1,0,""]
[26,{"$nulls":4},0,0,1,0,1,0,1,0,1,0,1,0,1,{"$nulls":8},1,0,""]
[27,{"$nulls":4},0,0,1,0,1,0,1,0,1,0,1,0,1,{"$nulls":8},1,0,""]
[28,{"$nulls":4},0,0,1,0,1,0,1,0,1,0,1,0,1,{"$nulls":8},1,0,""]
[29,{"$nulls":4},0,0,1,0,1,0,1,0,1,0,1,0,1,{"$nulls":8},1,0,""]
[30,{"$nulls":4},0,0,1,0,1,0,1,0,1,0,1,0,1,{"$nulls":8},1,0,""]
[31,{"$nulls":4},0,0,1,0,1,0,1,0,1,0,1,0,1,{"$nulls":8},1,0,""]
[32,{"$nulls":4},0,0,1,0,1,0,1,0,1,0,1,0,1,{"$nulls":8},1,0,""]
[33,{"$nulls":4},0,0,1,0,1,0,1,0,1,0,1,0,1,{"$nulls":8},1,0,""]
[34,{"$nulls":4},0,0,1,0,1,0,1,0,1,0,1,0,1,{"$nulls":8},1,0,""]
[35,{"$nulls":4},0,0,1,0,1,0,1,0,1,0,1,0,1,{"$nulls":8},1,0,""]
[36,{"$nulls":4},0,0,1,0,1,0,1,0,1,0,1,0,1,{"$nulls":8},1,0,""]
[{"$nulls":6},{"$f":"LARGE(G10:G45,1)+LARGE(G10:G45,2)+LARGE(G10:G45,3)","v":0},{"$f":"SUM(H10:H45)","v":36},{"$f":"LARGE(I10:I45,1)+LARGE(I10:I45,2)+LARGE(I10:I45,3)","v":0},{"$f":"SUM(J10:J45)","v":36},{"$f":"LARGE(K10:K45,1)+LARGE(K10:K45,2)+LARGE(K10:K45,3)","v":0},{"$f":"SUM(L10:L45)","v":36},{"$f":"LARGE(M10:M45,1)+LARGE(M10:M45,2)+LARGE(M10:M45,3)","v":0},{"$f":"SUM(N10:N45)","v":36},{"$f":"LARGE(O10:O45,1)+LARGE(O10:O45,2)+LARGE(O10:O45,3)","v":0},{"$f":"SUM(P10:P45)","v":36},{"$f":"LARGE(Q10:Q45,1)+LARGE(Q10:Q45,2)+LARGE(Q10:Q45,3)","v":0},{"$f":"SUM(R10:S45)","v":36}]
[]
[null,"Bitte beachtet, dass die Standaufsicht benannt werden muss"]

{"sheet":"Übersicht Schützen","index":15,"n_rows":37,"n_cols":23,"rows_kept":37,"hidden":true}
[null,null,{"v":1,"d":"1.0"},{"v":2,"d":"2.0"},{"v":3,"d":"3.0"},{"v":4,"d":"4.0"},{"v":5,"d":"5.0"},{"v":6,"d":"6.0"},{"$nulls":3},{"v":7,"d":"7.0"},{"v":8,"d":"8.0"},{"v":9,"d":"9.0"},{"v":10,"d":"10.0"},{"v":11,"d":"11.0"},{"v":12,"d":"12.0"}]
["Robbers Heinz",{"$f":"VLOOKUP(A2,'Wettkampf 1'!$B$10:$C$45,2,FALSE)","v":"Sögel II"},{"$f":"VLOOKUP(A2,'Wettkampf 1'!$B$10:$D$45,3,FALSE)","v":308.3},{"$f":"VLOOKUP($A2,'2'!$B$10:$D$45,3,FALSE)","v":312.1},{"$f":"VLOOKUP($A2,'3'!$B$10:$D$45,3,FALSE)","v":312.7},{"$f":"VLOOKUP($A2,'4'!$B$10:$D$45,3,FALSE)","v":315.5},{"$f":"VLOOKUP($A2,'5'!$B$10:$D$45,3,FALSE)","v":315.4},{"$f":"VLOOKUP($A2,'6'!$B$10:$D$45,3,FALSE)","v":314.5},{"$f":"K2/J2","v":{"v":313.0833333333333,"d":"313.1"}},{"$f":"VLOOKUP(A2,Formelhilfe!$A$9:$H$44,8,FALSE)","v":{"v":6,"d":"6.0"}},{"$f":"SUM(C2:H2)","v":{"v":1878.5,"d":"1,878.5"}},{"$f":"VLOOKUP($A2,'7'!$B$10:$D$45,3,FALSE)","v":312.2},{"$f":"VLOOKUP($A2,'8'!$B$10:$D$45,3,FALSE)","v":312.9},{"$f":"VLOOKUP($A2,'9'!$B$10:$D$45,3,FALSE)","v":311.4},{"$f":"VLOOKUP($A2,'10'!$B$10:$D$45,3,FALSE)","v":311.6},{"$f":"VLOOKUP($A2,'11'!$B$10:$D$45,3,FALSE)","v":315.6},{"$f":"VLOOKUP($A2,'12'!$B$10:$D$45,3,FALSE)","v":{"v":0,"d":"0.0"}},{"$f":"T2/S2","v":{"v":312.73999999999995,"d":"312.7"}},{"$f":"VLOOKUP(A2,Formelhilfe!$A$9:$O$44,15,FALSE)","v":{"v":5,"d":"5.0"}},{"$f":"SUM(L2:Q2)","v":{"v":1563.6999999999998,"d":"1,563.7"}},{"$f":"W2/V2","v":{"v":312.92727272727274,"d":"312.9"}},{"$f":"VLOOKUP(A2,Formelhilfe!$A$9:$P$44,16,FALSE)","v":{"v":11,"d":"11.0"}},{"$f":"SUM(C2:H2,L2:Q2)","v":{"v":3442.2,"d":"3,442.2"}}]
["Grünloh Michael",{"$f":"VLOOKUP(A3,'Wettkampf 1'!$B$10:$C$45,2,FALSE)","v":"Sögel II"},{"$f":"VLOOKUP(A3,'Wettkampf 1'!$B$10:$D$45,3,FALSE)","v":313.1},{"$f":"VLOOKUP($A3,'2'!$B$10:$D$45,3,FALSE)","v":309.3},{"$f":"VLOOKUP($A3,'3'!$B$10:$D$45,3,FALSE)","v":315.4},{"$f":"VLOOKUP($A3,'4'!$B$10:$D$45,3,FALSE)","v":313.5},{"$f":"VLOOKUP($A3,'5'!$B$10:$D$45,3,FALSE)","v":310.8},{"$f":"VLOOKUP($A3,'6'!$B$10:$D$45,3,FALSE)","v":311.5},{"$f":"K3/J3","v":{"v":312.2666666666667,"d":"312.3"}},{"$f":"VLOOKUP(A3,Formelhilfe!$A$9:$H$44,8,FALSE)","v":{"v":6,"d":"6.0"}},{"$f":"SUM(C3:H3)","v":{"v":1873.6000000000001,"d":"1,873.6"}},{"$f":"VLOOKUP($A3,'7'!$B$10:$D$45,3,FALSE)","v":313.9},{"$f":"VLOOKUP($A3,'8'!$B$10:$D$45,3,FALSE)","v":311.2},{"$f":"VLOOKUP($A3,'9'!$B$10:$D$45,3,FALSE)","v":313.4},{"$f":"VLOOKUP($A3,'10'!$B$10:$D$45,3,FALSE)","v":309.8},{"$f":"VLOOKUP($A3,'11'!$B$10:$D$45,3,FALSE)","v":{"v":313.29999999999995,"d":"313.3"}},{"$f":"VLOOKUP($A3,'12'!$B$10:$D$45,3,FALSE)","v":{"v":0,"d":"0.0"}},{"$f":"T3/S3","v":{"v":312.32,"d":"312.3"}},{"$f":"VLOOKUP(A3,Formelhilfe!$A$9:$O$44,15,FALSE)","v":{"v":5,"d":"5.0"}},{"$f":"SUM(L3:Q3)","v":{"v":1561.6,"d":"1,561.6"}},{"$f":"W3/V3","v":{"v":312.29090909090905,"d":"312.3"}},{"$f":"VLOOKUP(A3,Formelhilfe!$A$9:$P$44,16,FALSE)","v":{"v":11,"d":"11.0"}},{"$f":"SUM(C3:H3,L3:Q3)","v":{"v":3435.2,"d":"3,435.2"}}]
["Robbers Bernd",{"$f":"VLOOKUP(A4,'Wettkampf 1'!$B$10:$C$45,2,FALSE)","v":"Sögel II"},{"$f":"VLOOKUP(A4,'Wettkampf 1'!$B$10:$D$45,3,FALSE)","v":311.4},{"$f":"VLOOKUP($A4,'2'!$B$10:$D$45,3,FALSE)","v":311.9},{"$f":"VLOOKUP($A4,'3'!$B$10:$D$45,3,FALSE)","v":313.2},{"$f":"VLOOKUP($A4,'4'!$B$10:$D$45,3,FALSE)","v":308.7},{"$f":"VLOOKUP($A4,'5'!$B$10:$D$45,3,FALSE)","v":{"v":311,"d":"311.0"}},{"$f":"VLOOKUP($A4,'6'!$B$10:$D$45,3,FALSE)","v":314.4},{"$f":"K4/J4","v":{"v":311.76666666666665,"d":"311.8"}},{"$f":"VLOOKUP(A4,Formelhilfe!$A$9:$H$44,8,FALSE)","v":{"v":6,"d":"6.0"}},{"$f":"SUM(C4:H4)","v":{"v":1870.6,"d":"1,870.6"}},{"$f":"VLOOKUP($A4,'7'!$B$10:$D$45,3,FALSE)","v":{"v":318,"d":"318.0"}},{"$f":"VLOOKUP($A4,'8'!$B$10:$D$45,3,FALSE)","v":312.1},{"$f":"VLOOKUP($A4,'9'!$B$10:$D$45,3,FALSE)","v":310.5},{"$f":"VLOOKUP($A4,'10'!$B$10:$D$45,3,FALSE)","v":308.9},{"$f":"VLOOKUP($A4,'11'!$B$10:$D$45,3,FALSE)","v":{"v":310.90000000000003,"d":"310.9"}},{"$f":"VLOOKUP($A4,'12'!$B$10:$D$45,3,FALSE)","v":{"v":0,"d":"0.0"}},{"$f":"T4/S4","v":{"v":312.08000000000004,"d":"312.1"}},{"$f":"VLOOKUP(A4,Formelhilfe!$A$9:$O$44,15,FALSE)","v":{"v":5,"d":"5.0"}},{"$f":"SUM(L4:Q4)","v":{"v":1560.4,"d":"1,560.4"}},{"$f":"W4/V4","v":{"v":311.90909090909093,"d":"311.9"}},{"$f":"VLOOKUP(A4,Formelhilfe!$A$9:$P$44,16,FALSE)","v":{"v":11,"d":"11.0"}},{"$f":"SUM(C4:H4,L4:Q4)","v":{"v":3431,"d":"3,431.0"}}]
["Henzen Jens",{"$f":"VLOOKUP(A5,'Wettkampf 1'!$B$10:$C$45,2,FALSE)","v":"Börger III"},{"$f":"VLOOKUP(A5,'Wettkampf 1'!$B$10:$D$45,3,FALSE)","v":307.6},{"$f":"VLOOKUP($A5,'2'!$B$10:$D$45,3,FALSE)","v":314.2},{"$f":"VLOOKUP($A5,'3'!$B$10:$D$45,3,FALSE)","v":307.8},{"$f":"VLOOKUP($A5,'4'!$B$10:$D$45,3,FALSE)","v":308.9},{"$f":"VLOOKUP($A5,'5'!$B$10:$D$45,3,FALSE)","v":311.5},{"$f":"VLOOKUP($A5,'6'!$B$10:$D$45,3,FALSE)","v":307.9},{"$f":"K5/J5","v":{"v":309.65000000000003,"d":"309.7"}},{"$f":"VLOOKUP(A5,Formelhilfe!$A$9:$H$44,8,FALSE)","v":{"v":6,"d":"6.0"}},{"$f":"SUM(C5:H5)","v":{"v":1857.9,"d":"1,857.9"}},{"$f":"VLOOKUP($A5,'7'!$B$10:$D$45,3,FALSE)","v":313.2},{"$f":"VLOOKUP($A5,'8'!$B$10:$D$45,3,FALSE)","v":309.6},{"$f":"VLOOKUP($A5,'9'!$B$10:$D$45,3,FALSE)","v":313.6},{"$f":"VLOOKUP($A5,'10'!$B$10:$D$45,3,FALSE)","v":313.1},{"$f":"VLOOKUP($A5,'11'!$B$10:$D$45,3,FALSE)","v":314.5},{"$f":"VLOOKUP($A5,'12'!$B$10:$D$45,3,FALSE)","v":{"v":0,"d":"0.0"}},{"$f":"T5/S5","v":312.8},{"$f":"VLOOKUP(A5,Formelhilfe!$A$9:$O$44,15,FALSE)","v":{"v":5,"d":"5.0"}},{"$f":"SUM(L5:Q5)","v":{"v":1564,"d":"1,564.0"}},{"$f":"W5/V5","v":{"v":311.08181818181816,"d":"311.1"}},{"$f":"VLOOKUP(A5,Formelhilfe!$A$9:$P$44,16,FALSE)","v":{"v":11,"d":"11.0"}},{"$f":"SUM(C5:H5,L5:Q5)","v":{"v":3421.8999999999996,"d":"3,421.9"}}]
["Köß Wilhelm",{"$f":"VLOOKUP(A6,'Wettkampf 1'!$B$10:$C$45,2,FALSE)","v":"Breddenberg IV"},{"$f":"VLOOKUP(A6,'Wettkampf 1'!$B$10:$D$45,3,FALSE)","v":309.4},{"$f":"VLOOKUP($A6,'2'!$B$10:$D$45,3,FALSE)","v":311.7},{"$f":"VLOOKUP($A6,'3'!$B$10:$D$45,3,FALSE)","v":310.2},{"$f":"VLOOKUP($A6,'4'!$B$10:$D$45,3,FALSE)","v":311.3},{"$f":"VLOOKUP($A6,'5'!$B$10:$D$45,3,FALSE)","v":308.8},{"$f":"VLOOKUP($A6,'6'!$B$10:$D$45,3,FALSE)","v":310.1},{"$f":"K6/J6","v":{"v":310.25,"d":"310.3"}},{"$f":"VLOOKUP(A6,Formelhilfe!$A$9:$H$44,8,FALSE)","v":{"v":6,"d":"6.0"}},{"$f":"SUM(C6:H6)","v":{"v":1861.5,"d":"1,861.5"}},{"$f":"VLOOKUP($A6,'7'!$B$10:$D$45,3,FALSE)","v":313.6},{"$f":"VLOOKUP($A6,'8'!$B$10:$D$45,3,FALSE)","v":309.6},{"$f":"VLOOKUP($A6,'9'!$B$10:$D$45,3,FALSE)","v":310.3},{"$f":"VLOOKUP($A6,'10'!$B$10:$D$45,3,FALSE)","v":311.1},{"$f":"VLOOKUP($A6,'11'!$B$10:$D$45,3,FALSE)","v":309.6},{"$f":"VLOOKUP($A6,'12'!$B$10:$D$45,3,FALSE)","v":{"v":0,"d":"0.0"}},{"$f":"T6/S6","v":{"v":310.84,"d":"310.8"}},{"$f":"VLOOKUP(A6,Formelhilfe!$A$9:$O$44,15,FALSE)","v":{"v":5,"d":"5.0"}},{"$f":"SUM(L6:Q6)","v":{"v":1554.1999999999998,"d":"1,554.2"}},{"$f":"W6/V6","v":{"v":310.5181818181818,"d":"310.5"}},{"$f":"VLOOKUP(A6,Formelhilfe!$A$9:$P$44,16,FALSE)","v":{"v":11,"d":"11.0"}},{"$f":"SUM(C6:H6,L6:Q6)","v":{"v":3415.7,"d":"3,415.7"}}]
["Schuckenbrock Simon",{"$f":"VLOOKUP(A7,'Wettkampf 1'!$B$10:$C$45,2,FALSE)","v":"Börger III"},{"$f":"VLOOKUP(A7,'Wettkampf 1'!$B$10:$D$45,3,FALSE)","v":307.3},{"$f":"VLOOKUP($A7,'2'!$B$10:$D$45,3,FALSE)","v":306.9},{"$f":"VLOOKUP($A7,'3'!$B$10:$D$45,3,FALSE)","v":310.7},{"$f":"VLOOKUP($A7,'4'!$B$10:$D$45,3,FALSE)","v":306.3},{"$f":"VLOOKUP($A7,'5'!$B$10:$D$45,3,FALSE)","v":311.9},{"$f":"VLOOKUP($A7,'6'!$B$10:$D$45,3,FALSE)","v":311.9},{"$f":"K7/J7","v":{"v":309.1666666666667,"d":"309.2"}},{"$f":"VLOOKUP(A7,Formelhilfe!$A$9:$H$44,8,FALSE)","v":{"v":6,"d":"6.0"}},{"$f":"SUM(C7:H7)","v":{"v":1855,"d":"1,855.0"}},{"$f":"VLOOKUP($A7,'7'!$B$10:$D$45,3,FALSE)","v":311.4},{"$f":"VLOOKUP($A7,'8'!$B$10:$D$45,3,FALSE)","v":309.7},{"$f":"VLOOKUP($A7,'9'!$B$10:$D$45,3,FALSE)","v":312.4},{"$f":"VLOOKUP($A7,'10'!$B$10:$D$45,3,FALSE)","v":{"v":314,"d":"314.0"}},{"$f":"VLOOKUP($A7,'11'!$B$10:$D$45,3,FALSE)","v":313.2},{"$f":"VLOOKUP($A7,'12'!$B$10:$D$45,3,FALSE)","v":{"v":0,"d":"0.0"}},{"$f":"T7/S7","v":{"v":312.14,"d":"312.1"}},{"$f":"VLOOKUP(A7,Formelhilfe!$A$9:$O$44,15,FALSE)","v":{"v":5,"d":"5.0"}},{"$f":"SUM(L7:Q7)","v":{"v":1560.7,"d":"1,560.7"}},{"$f":"W7/V7","v":{"v":310.5181818181818,"d":"310.5"}},{"$f":"VLOOKUP(A7,Formelhilfe!$A$9:$P$44,16,FALSE)","v":{"v":11,"d":"11.0"}},{"$f":"SUM(C7:H7,L7:Q7)","v":{"v":3415.7,"d":"3,415.7"}}]
["Witting Bernhard",{"$f":"VLOOKUP(A8,'Wettkampf 1'!$B$10:$C$45,2,FALSE)","v":"Neuvrees II"},{"$f":"VLOOKUP(A8,'Wettkampf 1'!$B$10:$D$45,3,FALSE)","v":313.2},{"$f":"VLOOKUP($A8,'2'!$B$10:$D$45,3,FALSE)","v":314.3},{"$f":"VLOOKUP($A8,'3'!$B$10:$D$45,3,FALSE)","v":312.5},{"$f":"VLOOKUP($A8,'4'!$B$10:$D$45,3,FALSE)","v":309.8},{"$f":"VLOOKUP($A8,'5'!$B$10:$D$45,3,FALSE)","v":309.5},{"$f":"VLOOKUP($A8,'6'!$B$10:$D$45,3,FALSE)","v":308.2},{"$f":"K8/J8","v":{"v":311.25,"d":"311.3"}},{"$f":"VLOOKUP(A8,Formelhilfe!$A$9:$H$44,8,FALSE)","v":{"v":6,"d":"6.0"}},{"$f":"SUM(C8:H8)","v":{"v":1867.5,"d":"1,867.5"}},{"$f":"VLOOKUP($A8,'7'!$B$10:$D$45,3,FALSE)","v":306.4},{"$f":"VLOOKUP($A8,'8'!$B$10:$D$45,3,FALSE)","v":310.8},{"$f":"VLOOKUP($A8,'9'!$B$10:$D$45,3,FALSE)","v":307.4},{"$f":"VLOOKUP($A8,'10'!$B$10:$D$45,3,FALSE)","v":311.3},{"$f":"VLOOKUP($A8,'11'!$B$10:$D$45,3,FALSE)","v":{"v":312,"d":"312.0"}},{"$f":"VLOOKUP($A8,'12'!$B$10:$D$45,3,FALSE)","v":{"v":0,"d":"0.0"}},{"$f":"T8/S8","v":{"v":309.58000000000004,"d":"309.6"}},{"$f":"VLOOKUP(A8,Formelhilfe!$A$9:$O$44,15,FALSE)","v":{"v":5,"d":"5.0"}},{"$f":"SUM(L8:Q8)","v":{"v":1547.9,"d":"1,547.9"}},{"$f":"W8/V8","v":{"v":310.49090909090916,"d":"310.5"}},{"$f":"VLOOKUP(A8,Formelhilfe!$A$9:$P$44,16,FALSE)","v":{"v":11,"d":"11.0"}},{"$f":"SUM(C8:H8,L8:Q8)","v":{"v":3415.4000000000005,"d":"3,415.4"}}]
["Trempeck Marco",{"$f":"VLOOKUP(A9,'Wettkampf 1'!$B$10:$C$45,2,FALSE)","v":"Sögel II"},{"$f":"VLOOKUP(A9,'Wettkampf 1'!$B$10:$D$45,3,FALSE)","v":308.1},{"$f":"VLOOKUP($A9,'2'!$B$10:$D$45,3,FALSE)","v":305.8},{"$f":"VLOOKUP($A9,'3'!$B$10:$D$45,3,FALSE)","v":311.4},{"$f":"VLOOKUP($A9,'4'!$B$10:$D$45,3,FALSE)","v":314.4},{"$f":"VLOOKUP($A9,'5'!$B$10:$D$45,3,FALSE)","v":{"v":313,"d":"313.0"}},{"$f":"VLOOKUP($A9,'6'!$B$10:$D$45,3,FALSE)","v":309.2},{"$f":"K9/J9","v":{"v":310.31666666666666,"d":"310.3"}},{"$f":"VLOOKUP(A9,Formelhilfe!$A$9:$H$44,8,FALSE)","v":{"v":6,"d":"6.0"}},{"$f":"SUM(C9:H9)","v":{"v":1861.9,"d":"1,861.9"}},{"$f":"VLOOKUP($A9,'7'!$B$10:$D$45,3,FALSE)","v":307.9},{"$f":"VLOOKUP($A9,'8'!$B$10:$D$45,3,FALSE)","v":311.4},{"$f":"VLOOKUP($A9,'9'!$B$10:$D$45,3,FALSE)","v":309.5},{"$f":"VLOOKUP($A9,'10'!$B$10:$D$45,3,FALSE)","v":311.1},{"$f":"VLOOKUP($A9,'11'!$B$10:$D$45,3,FALSE)","v":312.7},{"$f":"VLOOKUP($A9,'12'!$B$10:$D$45,3,FALSE)","v":{"v":0,"d":"0.0"}},{"$f":"T9/S9","v":{"v":310.52000000000004,"d":"310.5"}},{"$f":"VLOOKUP(A9,Formelhilfe!$A$9:$O$44,15,FALSE)","v":{"v":5,"d":"5.0"}},{"$f":"SUM(L9:Q9)","v":{"v":1552.6000000000001,"d":"1,552.6"}},{"$f":"W9/V9","v":{"v":310.40909090909093,"d":"310.4"}},{"$f":"VLOOKUP(A9,Formelhilfe!$A$9:$P$44,16,FALSE)","v":{"v":11,"d":"11.0"}},{"$f":"SUM(C9:H9,L9:Q9)","v":{"v":3414.5,"d":"3,414.5"}}]
["Schrand Karl-Heinz",{"$f":"VLOOKUP(A10,'Wettkampf 1'!$B$10:$C$45,2,FALSE)","v":"Neuvrees II"},{"$f":"VLOOKUP(A10,'Wettkampf 1'!$B$10:$D$45,3,FALSE)","v":308.4},{"$f":"VLOOKUP($A10,'2'!$B$10:$D$45,3,FALSE)","v":313.1},{"$f":"VLOOKUP($A10,'3'!$B$10:$D$45,3,FALSE)","v":307.1},{"$f":"VLOOKUP($A10,'4'!$B$10:$D$45,3,FALSE)","v":313.7},{"$f":"VLOOKUP($A10,'5'!$B$10:$D$45,3,FALSE)","v":311.7},{"$f":"VLOOKUP($A10,'6'!$B$10:$D$45,3,FALSE)","v":305.3},{"$f":"K10/J10","v":{"v":309.8833333333333,"d":"309.9"}},{"$f":"VLOOKUP(A10,Formelhilfe!$A$9:$H$44,8,FALSE)","v":{"v":6,"d":"6.0"}},{"$f":"SUM(C10:H10)","v":{"v":1859.3,"d":"1,859.3"}},{"$f":"VLOOKUP($A10,'7'!$B$10:$D$45,3,FALSE)","v":309.6},{"$f":"VLOOKUP($A10,'8'!$B$10:$D$45,3,FALSE)","v":308.9},{"$f":"VLOOKUP($A10,'9'!$B$10:$D$45,3,FALSE)","v":313.7},{"$f":"VLOOKUP($A10,'10'!$B$10:$D$45,3,FALSE)","v":{"v":312,"d":"312.0"}},{"$f":"VLOOKUP($A10,'11'!$B$10:$D$45,3,FALSE)","v":308.9},{"$f":"VLOOKUP($A10,'12'!$B$10:$D$45,3,FALSE)","v":{"v":0,"d":"0.0"}},{"$f":"T10/S10","v":{"v":310.62,"d":"310.6"}},{"$f":"VLOOKUP(A10,Formelhilfe!$A$9:$O$44,15,FALSE)","v":{"v":5,"d":"5.0"}},{"$f":"SUM(L10:Q10)","v":{"v":1553.1,"d":"1,553.1"}},{"$f":"W10/V10","v":{"v":310.21818181818185,"d":"310.2"}},{"$f":"VLOOKUP(A10,Formelhilfe!$A$9:$P$44,16,FALSE)","v":{"v":11,"d":"11.0"}},{"$f":"SUM(C10:H10,L10:Q10)","v":{"v":3412.4,"d":"3,412.4"}}]
["Rolfes Willi",{"$f":"VLOOKUP(A11,'Wettkampf 1'!$B$10:$C$45,2,FALSE)","v":"Neuvrees I"},{"$f":"VLOOKUP(A11,'Wettkampf 1'!$B$10:$D$45,3,FALSE)","v":310.6},{"$f":"VLOOKUP($A11,'2'!$B$10:$D$45,3,FALSE)","v":308.8},{"$f":"VLOOKUP($A11,'3'!$B$10:$D$45,3,FALSE)","v":308.1},{"$f":"VLOOKUP($A11,'4'!$B$10:$D$45,3,FALSE)","v":{"v":312,"d":"312.0"}},{"$f":"VLOOKUP($A11,'5'!$B$10:$D$45,3,FALSE)","v":309.5},{"$f":"VLOOKUP($A11,'6'!$B$10:$D$45,3,FALSE)","v":311.3},{"$f":"K11/J11","v":{"v":310.05,"d":"310.1"}},{"$f":"VLOOKUP(A11,Formelhilfe!$A$9:$H$44,8,FALSE)","v":{"v":6,"d":"6.0"}},{"$f":"SUM(C11:H11)","v":{"v":1860.3,"d":"1,860.3"}},{"$f":"VLOOKUP($A11,'7'!$B$10:$D$45,3,FALSE)","v":309.2},{"$f":"VLOOKUP($A11,'8'!$B$10:$D$45,3,FALSE)","v":311.8},{"$f":"VLOOKUP($A11,'9'!$B$10:$D$45,3,FALSE)","v":312.1},{"$f":"VLOOKUP($A11,'10'!$B$10:$D$45,3,FALSE)","v":309.3},{"$f":"VLOOKUP($A11,'11'!$B$10:$D$45,3,FALSE)","v":309.5},{"$f":"VLOOKUP($A11,'12'!$B$10:$D$45,3,FALSE)","v":{"v":0,"d":"0.0"}},{"$f":"T11/S11","v":{"v":310.38,"d":"310.4"}},{"$f":"VLOOKUP(A11,Formelhilfe!$A$9:$O$44,15,FALSE)","v":{"v":5,"d":"5.0"}},{"$f":"SUM(L11:Q11)","v":{"v":1551.9,"d":"1,551.9"}},{"$f":"W11/V11","v":{"v":310.20000000000005,"d":"310.2"}},{"$f":"VLOOKUP(A11,Formelhilfe!$A$9:$P$44,16,FALSE)","v":{"v":11,"d":"11.0"}},{"$f":"SUM(C11:H11,L11:Q11)","v":{"v":3412.2000000000003,"d":"3,412.2"}}]
["Breyer Wilfried",{"$f":"VLOOKUP(A12,'Wettkampf 1'!$B$10:$C$45,2,FALSE)","v":"Neuvrees I"},{"$f":"VLOOKUP(A12,'Wettkampf 1'!$B$10:$D$45,3,FALSE)","v":308.9},{"$f":"VLOOKUP($A12,'2'!$B$10:$D$45,3,FALSE)","v":312.4},{"$f":"VLOOKUP($A12,'3'!$B$10:$D$45,3,FALSE)","v":310.9},{"$f":"VLOOKUP($A12,'4'!$B$10:$D$45,3,FALSE)","v":312.2},{"$f":"VLOOKUP($A12,'5'!$B$10:$D$45,3,FALSE)","v":309.2},{"$f":"VLOOKUP($A12,'6'!$B$10:$D$45,3,FALSE)","v":308.8},{"$f":"K12/J12","v":310.4},{"$f":"VLOOKUP(A12,Formelhilfe!$A$9:$H$44,8,FALSE)","v":{"v":6,"d":"6.0"}},{"$f":"SUM(C12:H12)","v":{"v":1862.3999999999999,"d":"1,862.4"}},{"$f":"VLOOKUP($A12,'7'!$B$10:$D$45,3,FALSE)","v":300.1},{"$f":"VLOOKUP($A12,'8'!$B$10:$D$45,3,FALSE)","v":314.8},{"$f":"VLOOKUP($A12,'9'!$B$10:$D$45,3,FALSE)","v":310.6},{"$f":"VLOOKUP($A12,'10'!$B$10:$D$45,3,FALSE)","v":308.6},{"$f":"VLOOKUP($A12,'11'!$B$10:$D$45,3,FALSE)","v":{"v":310,"d":"310.0"}},{"$f":"VLOOKUP($A12,'12'!$B$10:$D$45,3,FALSE)","v":{"v":0,"d":"0.0"}},{"$f":"T12/S12","v":{"v":308.82000000000005,"d":"308.8"}},{"$f":"VLOOKUP(A12,Formelhilfe!$A$9:$O$44,15,FALSE)","v":{"v":5,"d":"5.0"}},{"$f":"SUM(L12:Q12)","v":{"v":1544.1000000000001,"d":"1,544.1"}},{"$f":"W12/V12","v":{"v":309.6818181818182,"d":"309.7"}},{"$f":"VLOOKUP(A12,Formelhilfe!$A$9:$P$44,16,FALSE)","v":{"v":11,"d":"11.0"}},{"$f":"SUM(C12:H12,L12:Q12)","v":{"v":3406.5,"d":"3,406.5"}}]
["Sebers Daniel",{"$f":"VLOOKUP(A13,'Wettkampf 1'!$B$10:$C$45,2,FALSE)","v":"Börger III"},{"$f":"VLOOKUP(A13,'Wettkampf 1'!$B$10:$D$45,3,FALSE)","v":{"v":307,"d":"307.0"}},{"$f":"VLOOKUP($A13,'2'!$B$10:$D$45,3,FALSE)","v":306.6},{"$f":"VLOOKUP($A13,'3'!$B$10:$D$45,3,FALSE)","v":310.3},{"$f":"VLOOKUP($A13,'4'!$B$10:$D$45,3,FALSE)","v":311.2},{"$f":"VLOOKUP($A13,'5'!$B$10:$D$45,3,FALSE)","v":311.6},{"$f":"VLOOKUP($A13,'6'!$B$10:$D$45,3,FALSE)","v":314.6},{"$f":"K13/J13","v":{"v":310.2166666666667,"d":"310.2"}},{"$f":"VLOOKUP(A13,Formelhilfe!$A$9:$H$44,8,FALSE)","v":{"v":6,"d":"6.0"}},{"$f":"SUM(C13:H13)","v":{"v":1861.3000000000002,"d":"1,861.3"}},{"$f":"VLOOKUP($A13,'7'!$B$10:$D$45,3,FALSE)","v":309.8},{"$f":"VLOOKUP($A13,'8'!$B$10:$D$45,3,FALSE)","v":305.5},{"$f":"VLOOKUP($A13,'9'!$B$10:$D$45,3,FALSE)","v":310.2},{"$f":"VLOOKUP($A13,'10'!$B$10:$D$45,3,FALSE)","v":307.4},{"$f":"VLOOKUP($A13,'11'!$B$10:$D$45,3,FALSE)","v":310.5},{"$f":"VLOOKUP($A13,'12'!$B$10:$D$45,3,FALSE)","v":{"v":0,"d":"0.0"}},{"$f":"T13/S13","v":{"v":308.68,"d":"308.7"}},{"$f":"VLOOKUP(A13,Formelhilfe!$A$9:$O$44,15,FALSE)","v":{"v":5,"d":"5.0"}},{"$f":"SUM(L13:Q13)","v":{"v":1543.4,"d":"1,543.4"}},{"$f":"W13/V13","v":{"v":309.51818181818186,"d":"309.5"}},{"$f":"VLOOKUP(A13,Formelhilfe!$A$9:$P$44,16,FALSE)","v":{"v":11,"d":"11.0"}},{"$f":"SUM(C13:H13,L13:Q13)","v":{"v":3404.7000000000003,"d":"3,404.7"}}]
["Thunert  Dirk",{"$f":"VLOOKUP(A14,'Wettkampf 1'!$B$10:$C$45,2,FALSE)","v":"Neuvrees II"},{"$f":"VLOOKUP(A14,'Wettkampf 1'!$B$10:$D$45,3,FALSE)","v":308.4},{"$f":"VLOOKUP($A14,'2'!$B$10:$D$45,3,FALSE)","v":309.6},{"$f":"VLOOKUP($A14,'3'!$B$10:$D$45,3,FALSE)","v":309.8},{"$f":"VLOOKUP($A14,'4'!$B$10:$D$45,3,FALSE)","v":307.4},{"$f":"VLOOKUP($A14,'5'!$B$10:$D$45,3,FALSE)","v":307.5},{"$f":"VLOOKUP($A14,'6'!$B$10:$D$45,3,FALSE)","v":306.6},{"$f":"K14/J14","v":{"v":308.21666666666664,"d":"308.2"}},{"$f":"VLOOKUP(A14,Formelhilfe!$A$9:$H$44,8,FALSE)","v":{"v":6,"d":"6.0"}},{"$f":"SUM(C14:H14)","v":{"v":1849.2999999999997,"d":"1,849.3"}},{"$f":"VLOOKUP($A14,'7'!$B$10:$D$45,3,FALSE)","v":308.8},{"$f":"VLOOKUP($A14,'8'!$B$10:$D$45,3,FALSE)","v":310.9},{"$f":"VLOOKUP($A14,'9'!$B$10:$D$45,3,FALSE)","v":311.4},{"$f":"VLOOKUP($A14,'10'!$B$10:$D$45,3,FALSE)","v":309.6},{"$f":"VLOOKUP($A14,'11'!$B$10:$D$45,3,FALSE)","v":{"v":305.70000000000005,"d":"305.7"}},{"$f":"VLOOKUP($A14,'12'!$B$10:$D$45,3,FALSE)","v":{"v":0,"d":"0.0"}},{"$f":"T14/S14","v":{"v":309.28000000000003,"d":"309.3"}},{"$f":"VLOOKUP(A14,Formelhilfe!$A$9:$O$44,15,FALSE)","v":{"v":5,"d":"5.0"}},{"$f":"SUM(L14:Q14)","v":{"v":1546.4,"d":"1,546.4"}},{"$f":"W14/V14","v":308.7},{"$f":"VLOOKUP(A14,Formelhilfe!$A$9:$P$44,16,FALSE)","v":{"v":11,"d":"11.0"}},{"$f":"SUM(C14:H14,L14:Q14)","v":{"v":3395.7,"d":"3,395.7"}}]
["Meiners Bernd",{"$f":"VLOOKUP(A15,'Wettkampf 1'!$B$10:$C$45,2,FALSE)","v":"Ostenwalde I"},{"$f":"VLOOKUP(A15,'Wettkampf 1'!$B$10:$D$45,3,FALSE)","v":310.5},{"$f":"VLOOKUP($A15,'2'!$B$10:$D$45,3,FALSE)","v":306.5},{"$f":"VLOOKUP($A15,'3'!$B$10:$D$45,3,FALSE)","v":305.3},{"$f":"VLOOKUP($A15,'4'!$B$10:$D$45,3,FALSE)","v":312.5},{"$f":"VLOOKUP($A15,'5'!$B$10:$D$45,3,FALSE)","v":307.4},{"$f":"VLOOKUP($A15,'6'!$B$10:$D$45,3,FALSE)","v":306.8},{"$f":"K15/J15","v":{"v":308.16666666666663,"d":"308.2"}},{"$f":"VLOOKUP(A15,Formelhilfe!$A$9:$H$44,8,FALSE)","v":{"v":6,"d":"6.0"}},{"$f":"SUM(C15:H15)","v":{"v":1848.9999999999998,"d":"1,849.0"}},{"$f":"VLOOKUP($A15,'7'!$B$10:$D$45,3,FALSE)","v":{"v":310,"d":"310.0"}},{"$f":"VLOOKUP($A15,'8'!$B$10:$D$45,3,FALSE)","v":303.9},{"$f":"VLOOKUP($A15,'9'!$B$10:$D$45,3,FALSE)","v":308.1},{"$f":"VLOOKUP($A15,'10'!$B$10:$D$45,3,FALSE)","v":309.6},{"$f":"VLOOKUP($A15,'11'!$B$10:$D$45,3,FALSE)","v":312.7},{"$f":"VLOOKUP($A15,'12'!$B$10:$D$45,3,FALSE)","v":{"v":0,"d":"0.0"}},{"$f":"T15/S15","v":{"v":308.86,"d":"308.9"}},{"$f":"VLOOKUP(A15,Formelhilfe!$A$9:$O$44,15,FALSE)","v":{"v":5,"d":"5.0"}},{"$f":"SUM(L15:Q15)","v":{"v":1544.3,"d":"1,544.3"}},{"$f":"W15/V15","v":{"v":308.48181818181814,"d":"308.5"}},{"$f":"VLOOKUP(A15,Formelhilfe!$A$9:$P$44,16,FALSE)","v":{"v":11,"d":"11.0"}},{"$f":"SUM(C15:H15,L15:Q15)","v":{"v":3393.2999999999997,"d":"3,393.3"}}]
["Rode Bernd",{"$f":"VLOOKUP(A16,'Wettkampf 1'!$B$10:$C$45,2,FALSE)","v":"Börger III"},{"$f":"VLOOKUP(A16,'Wettkampf 1'!$B$10:$D$45,3,FALSE)","v":308.4},{"$f":"VLOOKUP($A16,'2'!$B$10:$D$45,3,FALSE)","v":310.6},{"$f":"VLOOKUP($A16,'3'!$B$10:$D$45,3,FALSE)","v":311.2},{"$f":"VLOOKUP($A16,'4'!$B$10:$D$45,3,FALSE)","v":305.6},{"$f":"VLOOKUP($A16,'5'!$B$10:$D$45,3,FALSE)","v":306.9},{"$f":"VLOOKUP($A16,'6'!$B$10:$D$45,3,FALSE)","v":313.1},{"$f":"K16/J16","v":309.3},{"$f":"VLOOKUP(A16,Formelhilfe!$A$9:$H$44,8,FALSE)","v":{"v":6,"d":"6.0"}},{"$f":"SUM(C16:H16)","v":{"v":1855.8000000000002,"d":"1,855.8"}},{"$f":"VLOOKUP($A16,'7'!$B$10:$D$45,3,FALSE)","v":305.8},{"$f":"VLOOKUP($A16,'8'!$B$10:$D$45,3,FALSE)","v":306.9},{"$f":"VLOOKUP($A16,'9'!$B$10:$D$45,3,FALSE)","v":307.1},{"$f":"VLOOKUP($A16,'10'!$B$10:$D$45,3,FALSE)","v":306.1},{"$f":"VLOOKUP($A16,'11'!$B$10:$D$45,3,FALSE)","v":308.6},{"$f":"VLOOKUP($A16,'12'!$B$10:$D$45,3,FALSE)","v":{"v":0,"d":"0.0"}},{"$f":"T16/S16","v":306.9},{"$f":"VLOOKUP(A16,Formelhilfe!$A$9:$O$44,15,FALSE)","v":{"v":5,"d":"5.0"}},{"$f":"SUM(L16:Q16)","v":{"v":1534.5,"d":"1,534.5"}},{"$f":"W16/V16","v":{"v":308.20909090909095,"d":"308.2"}},{"$f":"VLOOKUP(A16,Formelhilfe!$A$9:$P$44,16,FALSE)","v":{"v":11,"d":"11.0"}},{"$f":"SUM(C16:H16,L16:Q16)","v":{"v":3390.3,"d":"3,390.3"}}]
["Meiners Martin",{"$f":"VLOOKUP(A17,'Wettkampf 1'!$B$10:$C$45,2,FALSE)","v":"Ostenwalde I"},{"$f":"VLOOKUP(A17,'Wettkampf 1'!$B$10:$D$45,3,FALSE)","v":305.1},{"$f":"VLOOKUP($A17,'2'!$B$10:$D$45,3,FALSE)","v":312.8},{"$f":"VLOOKUP($A17,'3'!$B$10:$D$45,3,FALSE)","v":311.1},{"$f":"VLOOKUP($A17,'4'!$B$10:$D$45,3,FALSE)","v":308.4},{"$f":"VLOOKUP($A17,'5'!$B$10:$D$45,3,FALSE)","v":309.9},{"$f":"VLOOKUP($A17,'6'!$B$10:$D$45,3,FALSE)","v":308.1},{"$f":"K17/J17","v":{"v":309.23333333333335,"d":"309.2"}},{"$f":"VLOOKUP(A17,Formelhilfe!$A$9:$H$44,8,FALSE)","v":{"v":6,"d":"6.0"}},{"$f":"SUM(C17:H17)","v":{"v":1855.4,"d":"1,855.4"}},{"$f":"VLOOKUP($A17,'7'!$B$10:$D$45,3,FALSE)","v":307.1},{"$f":"VLOOKUP($A17,'8'!$B$10:$D$45,3,FALSE)","v":{"v":310,"d":"310.0"}},{"$f":"VLOOKUP($A17,'9'!$B$10:$D$45,3,FALSE)","v":302.2},{"$f":"VLOOKUP($A17,'10'!$B$10:$D$45,3,FALSE)","v":{"v":306,"d":"306.0"}},{"$f":"VLOOKUP($A17,'11'!$B$10:$D$45,3,FALSE)","v":{"v":308,"d":"308.0"}},{"$f":"VLOOKUP($A17,'12'!$B$10:$D$45,3,FALSE)","v":{"v":0,"d":"0.0"}},{"$f":"T17/S17","v":{"v":306.65999999999997,"d":"306.7"}},{"$f":"VLOOKUP(A17,Formelhilfe!$A$9:$O$44,15,FALSE)","v":{"v":5,"d":"5.0"}},{"$f":"SUM(L17:Q17)","v":{"v":1533.3,"d":"1,533.3"}},{"$f":"W17/V17","v":{"v":308.06363636363636,"d":"308.1"}},{"$f":"VLOOKUP(A17,Formelhilfe!$A$9:$P$44,16,FALSE)","v":{"v":11,"d":"11.0"}},{"$f":"SUM(C17:H17,L17:Q17)","v":{"v":3388.7,"d":"3,388.7"}}]
["Preut Hans",{"$f":"VLOOKUP(A18,'Wettkampf 1'!$B$10:$C$45,2,FALSE)","v":"Neuvrees II"},{"$f":"VLOOKUP(A18,'Wettkampf 1'!$B$10:$D$45,3,FALSE)","v":312.1},{"$f":"VLOOKUP($A18,'2'!$B$10:$D$45,3,FALSE)","v":307.2},{"$f":"VLOOKUP($A18,'3'!$B$10:$D$45,3,FALSE)","v":304.3},{"$f":"VLOOKUP($A18,'4'!$B$10:$D$45,3,FALSE)","v":304.4},{"$f":"VLOOKUP($A18,'5'!$B$10:$D$45,3,FALSE)","v":306.1},{"$f":"VLOOKUP($A18,'6'!$B$10:$D$45,3,FALSE)","v":{"v":309,"d":"309.0"}},{"$f":"K18/J18","v":{"v":307.18333333333334,"d":"307.2"}},{"$f":"VLOOKUP(A18,Formelhilfe!$A$9:$H$44,8,FALSE)","v":{"v":6,"d":"6.0"}},{"$f":"SUM(C18:H18)","v":{"v":1843.1,"d":"1,843.1"}},{"$f":"VLOOKUP($A18,'7'!$B$10:$D$45,3,FALSE)","v":{"v":305,"d":"305.0"}},{"$f":"VLOOKUP($A18,'8'!$B$10:$D$45,3,FALSE)","v":309.2},{"$f":"VLOOKUP($A18,'9'!$B$10:$D$45,3,FALSE)","v":311.8},{"$f":"VLOOKUP($A18,'10'!$B$10:$D$45,3,FALSE)","v":311.1},{"$f":"VLOOKUP($A18,'11'!$B$10:$D$45,3,FALSE)","v":308.5},{"$f":"VLOOKUP($A18,'12'!$B$10:$D$45,3,FALSE)","v":{"v":0,"d":"0.0"}},{"$f":"T18/S18","v":{"v":309.12,"d":"309.1"}},{"$f":"VLOOKUP(A18,Formelhilfe!$A$9:$O$44,15,FALSE)","v":{"v":5,"d":"5.0"}},{"$f":"SUM(L18:Q18)","v":{"v":1545.6,"d":"1,545.6"}},{"$f":"W18/V18","v":{"v":308.06363636363636,"d":"308.1"}},{"$f":"VLOOKUP(A18,Formelhilfe!$A$9:$P$44,16,FALSE)","v":{"v":11,"d":"11.0"}},{"$f":"SUM(C18:H18,L18:Q18)","v":{"v":3388.7,"d":"3,388.7"}}]
["Janßen Markus",{"$f":"VLOOKUP(A19,'Wettkampf 1'!$B$10:$C$45,2,FALSE)","v":"Neuvrees I"},{"$f":"VLOOKUP(A19,'Wettkampf 1'!$B$10:$D$45,3,FALSE)","v":305.7},{"$f":"VLOOKUP($A19,'2'!$B$10:$D$45,3,FALSE)","v":301.8},{"$f":"VLOOKUP($A19,'3'!$B$10:$D$45,3,FALSE)","v":303.2},{"$f":"VLOOKUP($A19,'4'!$B$10:$D$45,3,FALSE)","v":{"v":308,"d":"308.0"}},{"$f":"VLOOKUP($A19,'5'!$B$10:$D$45,3,FALSE)","v":306.1},{"$f":"VLOOKUP($A19,'6'!$B$10:$D$45,3,FALSE)","v":{"v":309,"d":"309.0"}},{"$f":"K19/J19","v":{"v":305.6333333333334,"d":"305.6"}},{"$f":"VLOOKUP(A19,Formelhilfe!$A$9:$H$44,8,FALSE)","v":{"v":6,"d":"6.0"}},{"$f":"SUM(C19:H19)","v":{"v":1833.8000000000002,"d":"1,833.8"}},{"$f":"VLOOKUP($A19,'7'!$B$10:$D$45,3,FALSE)","v":305.6},{"$f":"VLOOKUP($A19,'8'!$B$10:$D$45,3,FALSE)","v":{"v":313,"d":"313.0"}},{"$f":"VLOOKUP($A19,'9'!$B$10:$D$45,3,FALSE)","v":310.3},{"$f":"VLOOKUP($A19,'10'!$B$10:$D$45,3,FALSE)","v":311.7},{"$f":"VLOOKUP($A19,'11'!$B$10:$D$45,3,FALSE)","v":309.9},{"$f":"VLOOKUP($A19,'12'!$B$10:$D$45,3,FALSE)","v":{"v":0,"d":"0.0"}},{"$f":"T19/S19","v":310.1},{"$f":"VLOOKUP(A19,Formelhilfe!$A$9:$O$44,15,FALSE)","v":{"v":5,"d":"5.0"}},{"$f":"SUM(L19:Q19)","v":{"v":1550.5,"d":"1,550.5"}},{"$f":"W19/V19","v":{"v":307.6636363636364,"d":"307.7"}},{"$f":"VLOOKUP(A19,Formelhilfe!$A$9:$P$44,16,FALSE)","v":{"v":11,"d":"11.0"}},{"$f":"SUM(C19:H19,L19:Q19)","v":{"v":3384.3,"d":"3,384.3"}}]
["Szczepanski Holger",{"$f":"VLOOKUP(A20,'Wettkampf 1'!$B$10:$C$45,2,FALSE)","v":"Neuvrees II"},{"$f":"VLOOKUP(A20,'Wettkampf 1'!$B$10:$D$45,3,FALSE)","v":308.2},{"$f":"VLOOKUP($A20,'2'!$B$10:$D$45,3,FALSE)","v":{"v":306,"d":"306.0"}},{"$f":"VLOOKUP($A20,'3'!$B$10:$D$45,3,FALSE)","v":308.7},{"$f":"VLOOKUP($A20,'4'!$B$10:$D$45,3,FALSE)","v":306.2},{"$f":"VLOOKUP($A20,'5'!$B$10:$D$45,3,FALSE)","v":311.1},{"$f":"VLOOKUP($A20,'6'!$B$10:$D$45,3,FALSE)","v":306.7},{"$f":"K20/J20","v":{"v":307.8166666666667,"d":"307.8"}},{"$f":"VLOOKUP(A20,Formelhilfe!$A$9:$H$44,8,FALSE)","v":{"v":6,"d":"6.0"}},{"$f":"SUM(C20:H20)","v":{"v":1846.9000000000003,"d":"1,846.9"}},{"$f":"VLOOKUP($A20,'7'!$B$10:$D$45,3,FALSE)","v":306.8},{"$f":"VLOOKUP($A20,'8'!$B$10:$D$45,3,FALSE)","v":307.7},{"$f":"VLOOKUP($A20,'9'!$B$10:$D$45,3,FALSE)","v":305.2},{"$f":"VLOOKUP($A20,'10'!$B$10:$D$45,3,FALSE)","v":309.7},{"$f":"VLOOKUP($A20,'11'!$B$10:$D$45,3,FALSE)","v":304.3},{"$f":"VLOOKUP($A20,'12'!$B$10:$D$45,3,FALSE)","v":{"v":0,"d":"0.0"}},{"$f":"T20/S20","v":{"v":306.74,"d":"306.7"}},{"$f":"VLOOKUP(A20,Formelhilfe!$A$9:$O$44,15,FALSE)","v":{"v":5,"d":"5.0"}},{"$f":"SUM(L20:Q20)","v":{"v":1533.7,"d":"1,533.7"}},{"$f":"W20/V20","v":{"v":307.3272727272727,"d":"307.3"}},{"$f":"VLOOKUP(A20,Formelhilfe!$A$9:$P$44,16,FALSE)","v":{"v":11,"d":"11.0"}},{"$f":"SUM(C20:H20,L20:Q20)","v":{"v":3380.6,"d":"3,380.6"}}]
["Schroer Jürgen",{"$f":"VLOOKUP(A21,'Wettkampf 1'!$B$10:$C$45,2,FALSE)","v":"Börger III"},{"$f":"VLOOKUP(A21,'Wettkampf 1'!$B$10:$D$45,3,FALSE)","v":306.7},{"$f":"VLOOKUP($A21,'2'!$B$10:$D$45,3,FALSE)","v":307.7},{"$f":"VLOOKUP($A21,'3'!$B$10:$D$45,3,FALSE)","v":307.8},{"$f":"VLOOKUP($A21,'4'!$B$10:$D$45,3,FALSE)","v":307.4},{"$f":"VLOOKUP($A21,'5'!$B$10:$D$45,3,FALSE)","v":303.1},{"$f":"VLOOKUP($A21,'6'!$B$10:$D$45,3,FALSE)","v":307.1},{"$f":"K21/J21","v":{"v":306.63333333333327,"d":"306.6"}},{"$f":"VLOOKUP(A21,Formelhilfe!$A$9:$H$44,8,FALSE)","v":{"v":6,"d":"6.0"}},{"$f":"SUM(C21:H21)","v":{"v":1839.7999999999997,"d":"1,839.8"}},{"$f":"VLOOKUP($A21,'7'!$B$10:$D$45,3,FALSE)","v":306.5},{"$f":"VLOOKUP($A21,'8'!$B$10:$D$45,3,FALSE)","v":308.8},{"$f":"VLOOKUP($A21,'9'!$B$10:$D$45,3,FALSE)","v":305.5},{"$f":"VLOOKUP($A21,'10'!$B$10:$D$45,3,FALSE)","v":303.6},{"$f":"VLOOKUP($A21,'11'!$B$10:$D$45,3,FALSE)","v":{"v":304.20000000000005,"d":"304.2"}},{"$f":"VLOOKUP($A21,'12'!$B$10:$D$45,3,FALSE)","v":{"v":0,"d":"0.0"}},{"$f":"T21/S21","v":{"v":305.72,"d":"305.7"}},{"$f":"VLOOKUP(A21,Formelhilfe!$A$9:$O$44,15,FALSE)","v":{"v":5,"d":"5.0"}},{"$f":"SUM(L21:Q21)","v":{"v":1528.6000000000001,"d":"1,528.6"}},{"$f":"W21/V21","v":{"v":306.2181818181818,"d":"306.2"}},{"$f":"VLOOKUP(A21,Formelhilfe!$A$9:$P$44,16,FALSE)","v":{"v":11,"d":"11.0"}},{"$f":"SUM(C21:H21,L21:Q21)","v":{"v":3368.3999999999996,"d":"3,368.4"}}]
["Bunten Manfred",{"$f":"VLOOKUP(A22,'Wettkampf 1'!$B$10:$C$45,2,FALSE)","v":"Ostenwalde I"},{"$f":"VLOOKUP(A22,'Wettkampf 1'!$B$10:$D$45,3,FALSE)","v":306.8},{"$f":"VLOOKUP($A22,'2'!$B$10:$D$45,3,FALSE)","v":309.7},{"$f":"VLOOKUP($A22,'3'!$B$10:$D$45,3,FALSE)","v":{"v":307,"d":"307.0"}},{"$f":"VLOOKUP($A22,'4'!$B$10:$D$45,3,FALSE)","v":302.3},{"$f":"VLOOKUP($A22,'5'!$B$10:$D$45,3,FALSE)","v":305.7},{"$f":"VLOOKUP($A22,'6'!$B$10:$D$45,3,FALSE)","v":304.6},{"$f":"K22/J22","v":{"v":306.01666666666665,"d":"306.0"}},{"$f":"VLOOKUP(A22,Formelhilfe!$A$9:$H$44,8,FALSE)","v":{"v":6,"d":"6.0"}},{"$f":"SUM(C22:H22)","v":{"v":1836.1,"d":"1,836.1"}},{"$f":"VLOOKUP($A22,'7'!$B$10:$D$45,3,FALSE)","v":{"v":308,"d":"308.0"}},{"$f":"VLOOKUP($A22,'8'!$B$10:$D$45,3,FALSE)","v":307.3},{"$f":"VLOOKUP($A22,'9'!$B$10:$D$45,3,FALSE)","v":302.6},{"$f":"VLOOKUP($A22,'10'!$B$10:$D$45,3,FALSE)","v":304.3},{"$f":"VLOOKUP($A22,'11'!$B$10:$D$45,3,FALSE)","v":304.3},{"$f":"VLOOKUP($A22,'12'!$B$10:$D$45,3,FALSE)","v":{"v":0,"d":"0.0"}},{"$f":"T22/S22","v":305.3},{"$f":"VLOOKUP(A22,Formelhilfe!$A$9:$O$44,15,FALSE)","v":{"v":5,"d":"5.0"}},{"$f":"SUM(L22:Q22)","v":{"v":1526.5,"d":"1,526.5"}},{"$f":"W22/V22","v":{"v":305.69090909090914,"d":"305.7"}},{"$f":"VLOOKUP(A22,Formelhilfe!$A$9:$P$44,16,FALSE)","v":{"v":11,"d":"11.0"}},{"$f":"SUM(C22:H22,L22:Q22)","v":{"v":3362.6000000000004,"d":"3,362.6"}}]
["Hömmen Bernd",{"$f":"VLOOKUP(A23,'Wettkampf 1'!$B$10:$C$45,2,FALSE)","v":"Breddenberg IV"},{"$f":"VLOOKUP(A23,'Wettkampf 1'!$B$10:$D$45,3,FALSE)","v":{"v":306,"d":"306.0"}},{"$f":"VLOOKUP($A23,'2'!$B$10:$D$45,3,FALSE)","v":305.2},{"$f":"VLOOKUP($A23,'3'!$B$10:$D$45,3,FALSE)","v":302.1},{"$f":"VLOOKUP($A23,'4'!$B$10:$D$45,3,FALSE)","v":302.6},{"$f":"VLOOKUP($A23,'5'!$B$10:$D$45,3,FALSE)","v":301.3},{"$f":"VLOOKUP($A23,'6'!$B$10:$D$45,3,FALSE)","v":305.9},{"$f":"K23/J23","v":{"v":303.84999999999997,"d":"303.9"}},{"$f":"VLOOKUP(A23,Formelhilfe!$A$9:$H$44,8,FALSE)","v":{"v":6,"d":"6.0"}},{"$f":"SUM(C23:H23)","v":{"v":1823.1,"d":"1,823.1"}},{"$f":"VLOOKUP($A23,'7'!$B$10:$D$45,3,FALSE)","v":308.4},{"$f":"VLOOKUP($A23,'8'!$B$10:$D$45,3,FALSE)","v":309.9},{"$f":"VLOOKUP($A23,'9'!$B$10:$D$45,3,FALSE)","v":299.3},{"$f":"VLOOKUP($A23,'10'!$B$10:$D$45,3,FALSE)","v":{"v":306,"d":"306.0"}},{"$f":"VLOOKUP($A23,'11'!$B$10:$D$45,3,FALSE)","v":300.8},{"$f":"VLOOKUP($A23,'12'!$B$10:$D$45,3,FALSE)","v":{"v":0,"d":"0.0"}},{"$f":"T23/S23","v":{"v":304.88,"d":"304.9"}},{"$f":"VLOOKUP(A23,Formelhilfe!$A$9:$O$44,15,FALSE)","v":{"v":5,"d":"5.0"}},{"$f":"SUM(L23:Q23)","v":{"v":1524.3999999999999,"d":"1,524.4"}},{"$f":"W23/V23","v":{"v":304.31818181818187,"d":"304.3"}},{"$f":"VLOOKUP(A23,Formelhilfe!$A$9:$P$44,16,FALSE)","v":{"v":11,"d":"11.0"}},{"$f":"SUM(C23:H23,L23:Q23)","v":{"v":3347.5000000000005,"d":"3,347.5"}}]
["Thyen Werner",{"$f":"VLOOKUP(A24,'Wettkampf 1'!$B$10:$C$45,2,FALSE)","v":"Neuvrees I"},{"$f":"VLOOKUP(A24,'Wettkampf 1'!$B$10:$D$45,3,FALSE)","v":304.2},{"$f":"VLOOKUP($A24,'2'!$B$10:$D$45,3,FALSE)","v":297.7},{"$f":"VLOOKUP($A24,'3'!$B$10:$D$45,3,FALSE)","v":305.6},{"$f":"VLOOKUP($A24,'4'!$B$10:$D$45,3,FALSE)","v":309.1},{"$f":"VLOOKUP($A24,'5'!$B$10:$D$45,3,FALSE)","v":303.3},{"$f":"VLOOKUP($A24,'6'!$B$10:$D$45,3,FALSE)","v":300.9},{"$f":"K24/J24","v":{"v":303.46666666666664,"d":"303.5"}},{"$f":"VLOOKUP(A24,Formelhilfe!$A$9:$H$44,8,FALSE)","v":{"v":6,"d":"6.0"}},{"$f":"SUM(C24:H24)","v":{"v":1820.7999999999997,"d":"1,820.8"}},{"$f":"VLOOKUP($A24,'7'!$B$10:$D$45,3,FALSE)","v":304.7},{"$f":"VLOOKUP($A24,'8'!$B$10:$D$45,3,FALSE)","v":304.5},{"$f":"VLOOKUP($A24,'9'!$B$10:$D$45,3,FALSE)","v":304.9},{"$f":"VLOOKUP($A24,'10'!$B$10:$D$45,3,FALSE)","v":307.2},{"$f":"VLOOKUP($A24,'11'!$B$10:$D$45,3,FALSE)","v":{"v":305,"d":"305.0"}},{"$f":"VLOOKUP($A24,'12'!$B$10:$D$45,3,FALSE)","v":{"v":0,"d":"0.0"}},{"$f":"T24/S24","v":{"v":305.26,"d":"305.3"}},{"$f":"VLOOKUP(A24,Formelhilfe!$A$9:$O$44,15,FALSE)","v":{"v":5,"d":"5.0"}},{"$f":"SUM(L24:Q24)","v":{"v":1526.3,"d":"1,526.3"}},{"$f":"W24/V24","v":{"v":304.28181818181815,"d":"304.3"}},{"$f":"VLOOKUP(A24,Formelhilfe!$A$9:$P$44,16,FALSE)","v":{"v":11,"d":"11.0"}},{"$f":"SUM(C24:H24,L24:Q24)","v":{"v":3347.0999999999995,"d":"3,347.1"}}]
["Husmann Michael",{"$f":"VLOOKUP(A25,'Wettkampf 1'!$B$10:$C$45,2,FALSE)","v":"Sögel II"},{"$f":"VLOOKUP(A25,'Wettkampf 1'!$B$10:$D$45,3,FALSE)","v":290.4},{"$f":"VLOOKUP($A25,'2'!$B$10:$D$45,3,FALSE)","v":305.1},{"$f":"VLOOKUP($A25,'3'!$B$10:$D$45,3,FALSE)","v":296.5},{"$f":"VLOOKUP($A25,'4'!$B$10:$D$45,3,FALSE)","v":305.5},{"$f":"VLOOKUP($A25,'5'!$B$10:$D$45,3,FALSE)","v":301.9},{"$f":"VLOOKUP($A25,'6'!$B$10:$D$45,3,FALSE)","v":302.7},{"$f":"K25/J25","v":{"v":300.35,"d":"300.4"}},{"$f":"VLOOKUP(A25,Formelhilfe!$A$9:$H$44,8,FALSE)","v":{"v":6,"d":"6.0"}},{"$f":"SUM(C25:H25)","v":{"v":1802.1000000000001,"d":"1,802.1"}},{"$f":"VLOOKUP($A25,'7'!$B$10:$D$45,3,FALSE)","v":305.9},{"$f":"VLOOKUP($A25,'8'!$B$10:$D$45,3,FALSE)","v":305.2},{"$f":"VLOOKUP($A25,'9'!$B$10:$D$45,3,FALSE)","v":307.9},{"$f":"VLOOKUP($A25,'10'!$B$10:$D$45,3,FALSE)","v":307.3},{"$f":"VLOOKUP($A25,'11'!$B$10:$D$45,3,FALSE)","v":{"v":303.79999999999995,"d":"303.8"}},{"$f":"VLOOKUP($A25,'12'!$B$10:$D$45,3,FALSE)","v":{"v":0,"d":"0.0"}},{"$f":"T25/S25","v":{"v":306.02,"d":"306.0"}},{"$f":"VLOOKUP(A25,Formelhilfe!$A$9:$O$44,15,FALSE)","v":{"v":5,"d":"5.0"}},{"$f":"SUM(L25:Q25)","v":{"v":1530.1,"d":"1,530.1"}},{"$f":"W25/V25","v":{"v":302.92727272727274,"d":"302.9"}},{"$f":"VLOOKUP(A25,Formelhilfe!$A$9:$P$44,16,FALSE)","v":{"v":11,"d":"11.0"}},{"$f":"SUM(C25:H25,L25:Q25)","v":{"v":3332.2,"d":"3,332.2"}}]
["Jansen  Martin",{"$f":"VLOOKUP(A26,'Wettkampf 1'!$B$10:$C$45,2,FALSE)","v":"Breddenberg IV"},{"$f":"VLOOKUP(A26,'Wettkampf 1'!$B$10:$D$45,3,FALSE)","v":300.3},{"$f":"VLOOKUP($A26,'2'!$B$10:$D$45,3,FALSE)","v":302.4},{"$f":"VLOOKUP($A26,'3'!$B$10:$D$45,3,FALSE)","v":293.3},{"$f":"VLOOKUP($A26,'4'!$B$10:$D$45,3,FALSE)","v":302.6},{"$f":"VLOOKUP($A26,'5'!$B$10:$D$45,3,FALSE)","v":304.7},{"$f":"VLOOKUP($A26,'6'!$B$10:$D$45,3,FALSE)","v":300.2},{"$f":"K26/J26","v":{"v":300.5833333333333,"d":"300.6"}},{"$f":"VLOOKUP(A26,Formelhilfe!$A$9:$H$44,8,FALSE)","v":{"v":6,"d":"6.0"}},{"$f":"SUM(C26:H26)","v":{"v":1803.5,"d":"1,803.5"}},{"$f":"VLOOKUP($A26,'7'!$B$10:$D$45,3,FALSE)","v":307.8},{"$f":"VLOOKUP($A26,'8'!$B$10:$D$45,3,FALSE)","v":302.7},{"$f":"VLOOKUP($A26,'9'!$B$10:$D$45,3,FALSE)","v":299.2},{"$f":"VLOOKUP($A26,'10'!$B$10:$D$45,3,FALSE)","v":307.1},{"$f":"VLOOKUP($A26,'11'!$B$10:$D$45,3,FALSE)","v":294.6},{"$f":"VLOOKUP($A26,'12'!$B$10:$D$45,3,FALSE)","v":{"v":0,"d":"0.0"}},{"$f":"T26/S26","v":{"v":302.28000000000003,"d":"302.3"}},{"$f":"VLOOKUP(A26,Formelhilfe!$A$9:$O$44,15,FALSE)","v":{"v":5,"d":"5.0"}},{"$f":"SUM(L26:Q26)","v":{"v":1511.4,"d":"1,511.4"}},{"$f":"W26/V26","v":{"v":301.3545454545454,"d":"301.4"}},{"$f":"VLOOKUP(A26,Formelhilfe!$A$9:$P$44,16,FALSE)","v":{"v":11,"d":"11.0"}},{"$f":"SUM(C26:H26,L26:Q26)","v":{"v":3314.8999999999996,"d":"3,314.9"}}]
["Hanekamp Rudi",{"$f":"VLOOKUP(A27,'Wettkampf 1'!$B$10:$C$45,2,FALSE)","v":"Breddenberg IV"},{"$f":"VLOOKUP(A27,'Wettkampf 1'!$B$10:$D$45,3,FALSE)","v":294.8},{"$f":"VLOOKUP($A27,'2'!$B$10:$D$45,3,FALSE)","v":299.2},{"$f":"VLOOKUP($A27,'3'!$B$10:$D$45,3,FALSE)","v":301.7},{"$f":"VLOOKUP($A27,'4'!$B$10:$D$45,3,FALSE)","v":{"v":304,"d":"304.0"}},{"$f":"VLOOKUP($A27,'5'!$B$10:$D$45,3,FALSE)","v":291.9},{"$f":"VLOOKUP($A27,'6'!$B$10:$D$45,3,FALSE)","v":305.5},{"$f":"K27/J27","v":{"v":299.51666666666665,"d":"299.5"}},{"$f":"VLOOKUP(A27,Formelhilfe!$A$9:$H$44,8,FALSE)","v":{"v":6,"d":"6.0"}},{"$f":"SUM(C27:H27)","v":{"v":1797.1,"d":"1,797.1"}},{"$f":"VLOOKUP($A27,'7'!$B$10:$D$45,3,FALSE)","v":299.4},{"$f":"VLOOKUP($A27,'8'!$B$10:$D$45,3,FALSE)","v":301.9},{"$f":"VLOOKUP($A27,'9'!$B$10:$D$45,3,FALSE)","v":299.6},{"$f":"VLOOKUP($A27,'10'!$B$10:$D$45,3,FALSE)","v":309.6},{"$f":"VLOOKUP($A27,'11'!$B$10:$D$45,3,FALSE)","v":306.1},{"$f":"VLOOKUP($A27,'12'!$B$10:$D$45,3,FALSE)","v":{"v":0,"d":"0.0"}},{"$f":"T27/S27","v":{"v":303.32,"d":"303.3"}},{"$f":"VLOOKUP(A27,Formelhilfe!$A$9:$O$44,15,FALSE)","v":{"v":5,"d":"5.0"}},{"$f":"SUM(L27:Q27)","v":{"v":1516.6,"d":"1,516.6"}},{"$f":"W27/V27","v":{"v":301.24545454545455,"d":"301.2"}},{"$f":"VLOOKUP(A27,Formelhilfe!$A$9:$P$44,16,FALSE)","v":{"v":11,"d":"11.0"}},{"$f":"SUM(C27:H27,L27:Q27)","v":{"v":3313.7,"d":"3,313.7"}}]
["Benten Helmut",{"$f":"VLOOKUP(A28,'Wettkampf 1'!$B$10:$C$45,2,FALSE)","v":"Ostenwalde I"},{"$f":"VLOOKUP(A28,'Wettkampf 1'!$B$10:$D$45,3,FALSE)","v":301.3},{"$f":"VLOOKUP($A28,'2'!$B$10:$D$45,3,FALSE)","v":295.6},{"$f":"VLOOKUP($A28,'3'!$B$10:$D$45,3,FALSE)","v":299.1},{"$f":"VLOOKUP($A28,'4'!$B$10:$D$45,3,FALSE)","v":297.6},{"$f":"VLOOKUP($A28,'5'!$B$10:$D$45,3,FALSE)","v":299.7},{"$f":"VLOOKUP($A28,'6'!$B$10:$D$45,3,FALSE)","v":307.3},{"$f":"K28/J28","v":300.1},{"$f":"VLOOKUP(A28,Formelhilfe!$A$9:$H$44,8,FALSE)","v":{"v":6,"d":"6.0"}},{"$f":"SUM(C28:H28)","v":{"v":1800.6000000000001,"d":"1,800.6"}},{"$f":"VLOOKUP($A28,'7'!$B$10:$D$45,3,FALSE)","v":295.9},{"$f":"VLOOKUP($A28,'8'!$B$10:$D$45,3,FALSE)","v":303.6},{"$f":"VLOOKUP($A28,'9'!$B$10:$D$45,3,FALSE)","v":296.8},{"$f":"VLOOKUP($A28,'10'!$B$10:$D$45,3,FALSE)","v":301.3},{"$f":"VLOOKUP($A28,'11'!$B$10:$D$45,3,FALSE)","v":{"v":300,"d":"300.0"}},{"$f":"VLOOKUP($A28,'12'!$B$10:$D$45,3,FALSE)","v":{"v":0,"d":"0.0"}},{"$f":"T28/S28","v":{"v":299.52,"d":"299.5"}},{"$f":"VLOOKUP(A28,Formelhilfe!$A$9:$O$44,15,FALSE)","v":{"v":5,"d":"5.0"}},{"$f":"SUM(L28:Q28)","v":{"v":1497.6,"d":"1,497.6"}},{"$f":"W28/V28","v":{"v":299.83636363636367,"d":"299.8"}},{"$f":"VLOOKUP(A28,Formelhilfe!$A$9:$P$44,16,FALSE)","v":{"v":11,"d":"11.0"}},{"$f":"SUM(C28:H28,L28:Q28)","v":{"v":3298.2000000000003,"d":"3,298.2"}}]
["Steenken Klaus",{"$f":"VLOOKUP(A29,'Wettkampf 1'!$B$10:$C$45,2,FALSE)","v":"Neuvrees I"},{"$f":"VLOOKUP(A29,'Wettkampf 1'!$B$10:$D$45,3,FALSE)","v":310.8},{"$f":"VLOOKUP($A29,'2'!$B$10:$D$45,3,FALSE)","v":{"v":308,"d":"308.0"}},{"$f":"VLOOKUP($A29,'3'!$B$10:$D$45,3,FALSE)","v":307.4},{"$f":"VLOOKUP($A29,'4'!$B$10:$D$45,3,FALSE)","v":310.3},{"$f":"VLOOKUP($A29,'5'!$B$10:$D$45,3,FALSE)","v":{"v":0,"d":"0.0"}},{"$f":"VLOOKUP($A29,'6'!$B$10:$D$45,3,FALSE)","v":{"v":0,"d":"0.0"}},{"$f":"K29/J29","v":{"v":309.125,"d":"309.1"}},{"$f":"VLOOKUP(A29,Formelhilfe!$A$9:$H$44,8,FALSE)","v":{"v":4,"d":"4.0"}},{"$f":"SUM(C29:H29)","v":{"v":1236.5,"d":"1,236.5"}},{"$f":"VLOOKUP($A29,'7'!$B$10:$D$45,3,FALSE)","v":{"v":0,"d":"0.0"}},{"$f":"VLOOKUP($A29,'8'!$B$10:$D$45,3,FALSE)","v":{"v":0,"d":"0.0"}},{"$f":"VLOOKUP($A29,'9'!$B$10:$D$45,3,FALSE)","v":{"v":0,"d":"0.0"}},{"$f":"VLOOKUP($A29,'10'!$B$10:$D$45,3,FALSE)","v":{"v":0,"d":"0.0"}},{"$f":"VLOOKUP($A29,'11'!$B$10:$D$45,3,FALSE)","v":{"v":0,"d":"0.0"}},{"$f":"VLOOKUP($A29,'12'!$B$10:$D$45,3,FALSE)","v":{"v":0,"d":"0.0"}},{"$f":"T29/S29","v":{"$error":"#DIV/0!"}},{"$f":"VLOOKUP(A29,Formelhilfe!$A$9:$O$44,15,FALSE)","v":{"v":0,"d":"0.0"}},{"$f":"SUM(L29:Q29)","v":{"v":0,"d":"0.0"}},{"$f":"W29/V29","v":{"v":309.125,"d":"309.1"}},{"$f":"VLOOKUP(A29,Formelhilfe!$A$9:$P$44,16,FALSE)","v":{"v":4,"d":"4.0"}},{"$f":"SUM(C29:H29,L29:Q29)","v":{"v":1236.5,"d":"1,236.5"}}]
["Schütze 6",{"$f":"VLOOKUP(A30,'Wettkampf 1'!$B$10:$C$45,2,FALSE)","v":"Sögel II"},{"$f":"VLOOKUP(A30,'Wettkampf 1'!$B$10:$D$45,3,FALSE)","v":{"v":0,"d":"0.0"}},{"$f":"VLOOKUP($A30,'2'!$B$10:$D$45,3,FALSE)","v":{"v":0,"d":"0.0"}},{"$f":"VLOOKUP($A30,'3'!$B$10:$D$45,3,FALSE)","v":{"v":0,"d":"0.0"}},{"$f":"VLOOKUP($A30,'4'!$B$10:$D$45,3,FALSE)","v":{"v":0,"d":"0.0"}},{"$f":"VLOOKUP($A30,'5'!$B$10:$D$45,3,FALSE)","v":{"v":0,"d":"0.0"}},{"$f":"VLOOKUP($A30,'6'!$B$10:$D$45,3,FALSE)","v":{"v":0,"d":"0.0"}},{"$f":"K30/J30","v":{"$error":"#DIV/0!"}},{"$f":"VLOOKUP(A30,Formelhilfe!$A$9:$H$44,8,FALSE)","v":{"v":0,"d":"0.0"}},{"$f":"SUM(C30:H30)","v":{"v":0,"d":"0.0"}},{"$f":"VLOOKUP($A30,'7'!$B$10:$D$45,3,FALSE)","v":{"v":0,"d":"0.0"}},{"$f":"VLOOKUP($A30,'8'!$B$10:$D$45,3,FALSE)","v":{"v":0,"d":"0.0"}},{"$f":"VLOOKUP($A30,'9'!$B$10:$D$45,3,FALSE)","v":{"v":0,"d":"0.0"}},{"$f":"VLOOKUP($A30,'10'!$B$10:$D$45,3,FALSE)","v":{"v":0,"d":"0.0"}},{"$f":"VLOOKUP($A30,'11'!$B$10:$D$45,3,FALSE)","v":{"v":0,"d":"0.0"}},{"$f":"VLOOKUP($A30,'12'!$B$10:$D$45,3,FALSE)","v":{"v":0,"d":"0.0"}},{"$f":"T30/S30","v":{"$error":"#DIV/0!"}},{"$f":"VLOOKUP(A30,Formelhilfe!$A$9:$O$44,15,FALSE)","v":{"v":0,"d":"0.0"}},{"$f":"SUM(L30:Q30)","v":{"v":0,"d":"0.0"}},{"$f":"W30/V30","v":{"$error":"#DIV/0!"}},{"$f":"VLOOKUP(A30,Formelhilfe!$A$9:$P$44,16,FALSE)","v":{"v":0,"d":"0.0"}},{"$f":"SUM(C30:H30,L30:Q30)","v":{"v":0,"d":"0.0"}}]
["Schütze 11",{"$f":"VLOOKUP(A31,'Wettkampf 1'!$B$10:$C$45,2,FALSE)","v":"Ostenwalde I"},{"$f":"VLOOKUP(A31,'Wettkampf 1'!$B$10:$D$45,3,FALSE)","v":{"v":0,"d":"0.0"}},{"$f":"VLOOKUP($A31,'2'!$B$10:$D$45,3,FALSE)","v":{"v":0,"d":"0.0"}},{"$f":"VLOOKUP($A31,'3'!$B$10:$D$45,3,FALSE)","v":{"v":0,"d":"0.0"}},{"$f":"VLOOKUP($A31,'4'!$B$10:$D$45,3,FALSE)","v":{"v":0,"d":"0.0"}},{"$f":"VLOOKUP($A31,'5'!$B$10:$D$45,3,FALSE)","v":{"v":0,"d":"0.0"}},{"$f":"VLOOKUP($A31,'6'!$B$10:$D$45,3,FALSE)","v":{"v":0,"d":"0.0"}},{"$f":"K31/J31","v":{"$error":"#DIV/0!"}},{"$f":"VLOOKUP(A31,Formelhilfe!$A$9:$H$44,8,FALSE)","v":{"v":0,"d":"0.0"}},{"$f":"SUM(C31:H31)","v":{"v":0,"d":"0.0"}},{"$f":"VLOOKUP($A31,'7'!$B$10:$D$45,3,FALSE)","v":{"v":0,"d":"0.0"}},{"$f":"VLOOKUP($A31,'8'!$B$10:$D$45,3,FALSE)","v":{"v":0,"d":"0.0"}},{"$f":"VLOOKUP($A31,'9'!$B$10:$D$45,3,FALSE)","v":{"v":0,"d":"0.0"}},{"$f":"VLOOKUP($A31,'10'!$B$10:$D$45,3,FALSE)","v":{"v":0,"d":"0.0"}},{"$f":"VLOOKUP($A31,'11'!$B$10:$D$45,3,FALSE)","v":{"v":0,"d":"0.0"}},{"$f":"VLOOKUP($A31,'12'!$B$10:$D$45,3,FALSE)","v":{"v":0,"d":"0.0"}},{"$f":"T31/S31","v":{"$error":"#DIV/0!"}},{"$f":"VLOOKUP(A31,Formelhilfe!$A$9:$O$44,15,FALSE)","v":{"v":0,"d":"0.0"}},{"$f":"SUM(L31:Q31)","v":{"v":0,"d":"0.0"}},{"$f":"W31/V31","v":{"$error":"#DIV/0!"}},{"$f":"VLOOKUP(A31,Formelhilfe!$A$9:$P$44,16,FALSE)","v":{"v":0,"d":"0.0"}},{"$f":"SUM(C31:H31,L31:Q31)","v":{"v":0,"d":"0.0"}}]
["Schütze 12",{"$f":"VLOOKUP(A32,'Wettkampf 1'!$B$10:$C$45,2,FALSE)","v":"Ostenwalde I"},{"$f":"VLOOKUP(A32,'Wettkampf 1'!$B$10:$D$45,3,FALSE)","v":{"v":0,"d":"0.0"}},{"$f":"VLOOKUP($A32,'2'!$B$10:$D$45,3,FALSE)","v":{"v":0,"d":"0.0"}},{"$f":"VLOOKUP($A32,'3'!$B$10:$D$45,3,FALSE)","v":{"v":0,"d":"0.0"}},{"$f":"VLOOKUP($A32,'4'!$B$10:$D$45,3,FALSE)","v":{"v":0,"d":"0.0"}},{"$f":"VLOOKUP($A32,'5'!$B$10:$D$45,3,FALSE)","v":{"v":0,"d":"0.0"}},{"$f":"VLOOKUP($A32,'6'!$B$10:$D$45,3,FALSE)","v":{"v":0,"d":"0.0"}},{"$f":"K32/J32","v":{"$error":"#DIV/0!"}},{"$f":"VLOOKUP(A32,Formelhilfe!$A$9:$H$44,8,FALSE)","v":{"v":0,"d":"0.0"}},{"$f":"SUM(C32:H32)","v":{"v":0,"d":"0.0"}},{"$f":"VLOOKUP($A32,'7'!$B$10:$D$45,3,FALSE)","v":{"v":0,"d":"0.0"}},{"$f":"VLOOKUP($A32,'8'!$B$10:$D$45,3,FALSE)","v":{"v":0,"d":"0.0"}},{"$f":"VLOOKUP($A32,'9'!$B$10:$D$45,3,FALSE)","v":{"v":0,"d":"0.0"}},{"$f":"VLOOKUP($A32,'10'!$B$10:$D$45,3,FALSE)","v":{"v":0,"d":"0.0"}},{"$f":"VLOOKUP($A32,'11'!$B$10:$D$45,3,FALSE)","v":{"v":0,"d":"0.0"}},{"$f":"VLOOKUP($A32,'12'!$B$10:$D$45,3,FALSE)","v":{"v":0,"d":"0.0"}},{"$f":"T32/S32","v":{"$error":"#DIV/0!"}},{"$f":"VLOOKUP(A32,Formelhilfe!$A$9:$O$44,15,FALSE)","v":{"v":0,"d":"0.0"}},{"$f":"SUM(L32:Q32)","v":{"v":0,"d":"0.0"}},{"$f":"W32/V32","v":{"$error":"#DIV/0!"}},{"$f":"VLOOKUP(A32,Formelhilfe!$A$9:$P$44,16,FALSE)","v":{"v":0,"d":"0.0"}},{"$f":"SUM(C32:H32,L32:Q32)","v":{"v":0,"d":"0.0"}}]
["Schütze 18",{"$f":"VLOOKUP(A33,'Wettkampf 1'!$B$10:$C$45,2,FALSE)","v":"Neuvrees II"},{"$f":"VLOOKUP(A33,'Wettkampf 1'!$B$10:$D$45,3,FALSE)","v":{"v":0,"d":"0.0"}},{"$f":"VLOOKUP($A33,'2'!$B$10:$D$45,3,FALSE)","v":{"v":0,"d":"0.0"}},{"$f":"VLOOKUP($A33,'3'!$B$10:$D$45,3,FALSE)","v":{"v":0,"d":"0.0"}},{"$f":"VLOOKUP($A33,'4'!$B$10:$D$45,3,FALSE)","v":{"v":0,"d":"0.0"}},{"$f":"VLOOKUP($A33,'5'!$B$10:$D$45,3,FALSE)","v":{"v":0,"d":"0.0"}},{"$f":"VLOOKUP($A33,'6'!$B$10:$D$45,3,FALSE)","v":{"v":0,"d":"0.0"}},{"$f":"K33/J33","v":{"$error":"#DIV/0!"}},{"$f":"VLOOKUP(A33,Formelhilfe!$A$9:$H$44,8,FALSE)","v":{"v":0,"d":"0.0"}},{"$f":"SUM(C33:H33)","v":{"v":0,"d":"0.0"}},{"$f":"VLOOKUP($A33,'7'!$B$10:$D$45,3,FALSE)","v":{"v":0,"d":"0.0"}},{"$f":"VLOOKUP($A33,'8'!$B$10:$D$45,3,FALSE)","v":{"v":0,"d":"0.0"}},{"$f":"VLOOKUP($A33,'9'!$B$10:$D$45,3,FALSE)","v":{"v":0,"d":"0.0"}},{"$f":"VLOOKUP($A33,'10'!$B$10:$D$45,3,FALSE)","v":{"v":0,"d":"0.0"}},{"$f":"VLOOKUP($A33,'11'!$B$10:$D$45,3,FALSE)","v":{"v":0,"d":"0.0"}},{"$f":"VLOOKUP($A33,'12'!$B$10:$D$45,3,FALSE)","v":{"v":0,"d":"0.0"}},{"$f":"T33/S33","v":{"$error":"#DIV/0!"}},{"$f":"VLOOKUP(A33,Formelhilfe!$A$9:$O$44,15,FALSE)","v":{"v":0,"d":"0.0"}},{"$f":"SUM(L33:Q33)","v":{"v":0,"d":"0.0"}},{"$f":"W33/V33","v":{"$error":"#DIV/0!"}},{"$f":"VLOOKUP(A33,Formelhilfe!$A$9:$P$44,16,FALSE)","v":{"v":0,"d":"0.0"}},{"$f":"SUM(C33:H33,L33:Q33)","v":{"v":0,"d":"0.0"}}]
["Schütze 23",{"$f":"VLOOKUP(A34,'Wettkampf 1'!$B$10:$C$45,2,FALSE)","v":"Breddenberg IV"},{"$f":"VLOOKUP(A34,'Wettkampf 1'!$B$10:$D$45,3,FALSE)","v":{"v":0,"d":"0.0"}},{"$f":"VLOOKUP($A34,'2'!$B$10:$D$45,3,FALSE)","v":{"v":0,"d":"0.0"}},{"$f":"VLOOKUP($A34,'3'!$B$10:$D$45,3,FALSE)","v":{"v":0,"d":"0.0"}},{"$f":"VLOOKUP($A34,'4'!$B$10:$D$45,3,FALSE)","v":{"v":0,"d":"0.0"}},{"$f":"VLOOKUP($A34,'5'!$B$10:$D$45,3,FALSE)","v":{"v":0,"d":"0.0"}},{"$f":"VLOOKUP($A34,'6'!$B$10:$D$45,3,FALSE)","v":{"v":0,"d":"0.0"}},{"$f":"K34/J34","v":{"$error":"#DIV/0!"}},{"$f":"VLOOKUP(A34,Formelhilfe!$A$9:$H$44,8,FALSE)","v":{"v":0,"d":"0.0"}},{"$f":"SUM(C34:H34)","v":{"v":0,"d":"0.0"}},{"$f":"VLOOKUP($A34,'7'!$B$10:$D$45,3,FALSE)","v":{"v":0,"d":"0.0"}},{"$f":"VLOOKUP($A34,'8'!$B$10:$D$45,3,FALSE)","v":{"v":0,"d":"0.0"}},{"$f":"VLOOKUP($A34,'9'!$B$10:$D$45,3,FALSE)","v":{"v":0,"d":"0.0"}},{"$f":"VLOOKUP($A34,'10'!$B$10:$D$45,3,FALSE)","v":{"v":0,"d":"0.0"}},{"$f":"VLOOKUP($A34,'11'!$B$10:$D$45,3,FALSE)","v":{"v":0,"d":"0.0"}},{"$f":"VLOOKUP($A34,'12'!$B$10:$D$45,3,FALSE)","v":{"v":0,"d":"0.0"}},{"$f":"T34/S34","v":{"$error":"#DIV/0!"}},{"$f":"VLOOKUP(A34,Formelhilfe!$A$9:$O$44,15,FALSE)","v":{"v":0,"d":"0.0"}},{"$f":"SUM(L34:Q34)","v":{"v":0,"d":"0.0"}},{"$f":"W34/V34","v":{"$error":"#DIV/0!"}},{"$f":"VLOOKUP(A34,Formelhilfe!$A$9:$P$44,16,FALSE)","v":{"v":0,"d":"0.0"}},{"$f":"SUM(C34:H34,L34:Q34)","v":{"v":0,"d":"0.0"}}]
["Schütze 24",{"$f":"VLOOKUP(A35,'Wettkampf 1'!$B$10:$C$45,2,FALSE)","v":"Breddenberg IV"},{"$f":"VLOOKUP(A35,'Wettkampf 1'!$B$10:$D$45,3,FALSE)","v":{"v":0,"d":"0.0"}},{"$f":"VLOOKUP($A35,'2'!$B$10:$D$45,3,FALSE)","v":{"v":0,"d":"0.0"}},{"$f":"VLOOKUP($A35,'3'!$B$10:$D$45,3,FALSE)","v":{"v":0,"d":"0.0"}},{"$f":"VLOOKUP($A35,'4'!$B$10:$D$45,3,FALSE)","v":{"v":0,"d":"0.0"}},{"$f":"VLOOKUP($A35,'5'!$B$10:$D$45,3,FALSE)","v":{"v":0,"d":"0.0"}},{"$f":"VLOOKUP($A35,'6'!$B$10:$D$45,3,FALSE)","v":{"v":0,"d":"0.0"}},{"$f":"K35/J35","v":{"$error":"#DIV/0!"}},{"$f":"VLOOKUP(A35,Formelhilfe!$A$9:$H$44,8,FALSE)","v":{"v":0,"d":"0.0"}},{"$f":"SUM(C35:H35)","v":{"v":0,"d":"0.0"}},{"$f":"VLOOKUP($A35,'7'!$B$10:$D$45,3,FALSE)","v":{"v":0,"d":"0.0"}},{"$f":"VLOOKUP($A35,'8'!$B$10:$D$45,3,FALSE)","v":{"v":0,"d":"0.0"}},{"$f":"VLOOKUP($A35,'9'!$B$10:$D$45,3,FALSE)","v":{"v":0,"d":"0.0"}},{"$f":"VLOOKUP($A35,'10'!$B$10:$D$45,3,FALSE)","v":{"v":0,"d":"0.0"}},{"$f":"VLOOKUP($A35,'11'!$B$10:$D$45,3,FALSE)","v":{"v":0,"d":"0.0"}},{"$f":"VLOOKUP($A35,'12'!$B$10:$D$45,3,FALSE)","v":{"v":0,"d":"0.0"}},{"$f":"T35/S35","v":{"$error":"#DIV/0!"}},{"$f":"VLOOKUP(A35,Formelhilfe!$A$9:$O$44,15,FALSE)","v":{"v":0,"d":"0.0"}},{"$f":"SUM(L35:Q35)","v":{"v":0,"d":"0.0"}},{"$f":"W35/V35","v":{"$error":"#DIV/0!"}},{"$f":"VLOOKUP(A35,Formelhilfe!$A$9:$P$44,16,FALSE)","v":{"v":0,"d":"0.0"}},{"$f":"SUM(C35:H35,L35:Q35)","v":{"v":0,"d":"0.0"}}]
["Schütze 30",{"$f":"VLOOKUP(A36,'Wettkampf 1'!$B$10:$C$45,2,FALSE)","v":"Neuvrees I"},{"$f":"VLOOKUP(A36,'Wettkampf 1'!$B$10:$D$45,3,FALSE)","v":{"v":0,"d":"0.0"}},{"$f":"VLOOKUP($A36,'2'!$B$10:$D$45,3,FALSE)","v":{"v":0,"d":"0.0"}},{"$f":"VLOOKUP($A36,'3'!$B$10:$D$45,3,FALSE)","v":{"v":0,"d":"0.0"}},{"$f":"VLOOKUP($A36,'4'!$B$10:$D$45,3,FALSE)","v":{"v":0,"d":"0.0"}},{"$f":"VLOOKUP($A36,'5'!$B$10:$D$45,3,FALSE)","v":{"v":0,"d":"0.0"}},{"$f":"VLOOKUP($A36,'6'!$B$10:$D$45,3,FALSE)","v":{"v":0,"d":"0.0"}},{"$f":"K36/J36","v":{"$error":"#DIV/0!"}},{"$f":"VLOOKUP(A36,Formelhilfe!$A$9:$H$44,8,FALSE)","v":{"v":0,"d":"0.0"}},{"$f":"SUM(C36:H36)","v":{"v":0,"d":"0.0"}},{"$f":"VLOOKUP($A36,'7'!$B$10:$D$45,3,FALSE)","v":{"v":0,"d":"0.0"}},{"$f":"VLOOKUP($A36,'8'!$B$10:$D$45,3,FALSE)","v":{"v":0,"d":"0.0"}},{"$f":"VLOOKUP($A36,'9'!$B$10:$D$45,3,FALSE)","v":{"v":0,"d":"0.0"}},{"$f":"VLOOKUP($A36,'10'!$B$10:$D$45,3,FALSE)","v":{"v":0,"d":"0.0"}},{"$f":"VLOOKUP($A36,'11'!$B$10:$D$45,3,FALSE)","v":{"v":0,"d":"0.0"}},{"$f":"VLOOKUP($A36,'12'!$B$10:$D$45,3,FALSE)","v":{"v":0,"d":"0.0"}},{"$f":"T36/S36","v":{"$error":"#DIV/0!"}},{"$f":"VLOOKUP(A36,Formelhilfe!$A$9:$O$44,15,FALSE)","v":{"v":0,"d":"0.0"}},{"$f":"SUM(L36:Q36)","v":{"v":0,"d":"0.0"}},{"$f":"W36/V36","v":{"$error":"#DIV/0!"}},{"$f":"VLOOKUP(A36,Formelhilfe!$A$9:$P$44,16,FALSE)","v":{"v":0,"d":"0.0"}},{"$f":"SUM(C36:H36,L36:Q36)","v":{"v":0,"d":"0.0"}}]
["Schütze 36",{"$f":"VLOOKUP(A37,'Wettkampf 1'!$B$10:$C$45,2,FALSE)","v":"Börger III"},{"$f":"VLOOKUP(A37,'Wettkampf 1'!$B$10:$D$45,3,FALSE)","v":{"v":0,"d":"0.0"}},{"$f":"VLOOKUP($A37,'2'!$B$10:$D$45,3,FALSE)","v":{"v":0,"d":"0.0"}},{"$f":"VLOOKUP($A37,'3'!$B$10:$D$45,3,FALSE)","v":{"v":0,"d":"0.0"}},{"$f":"VLOOKUP($A37,'4'!$B$10:$D$45,3,FALSE)","v":{"v":0,"d":"0.0"}},{"$f":"VLOOKUP($A37,'5'!$B$10:$D$45,3,FALSE)","v":{"v":0,"d":"0.0"}},{"$f":"VLOOKUP($A37,'6'!$B$10:$D$45,3,FALSE)","v":{"v":0,"d":"0.0"}},{"$f":"K37/J37","v":{"$error":"#DIV/0!"}},{"$f":"VLOOKUP(A37,Formelhilfe!$A$9:$H$44,8,FALSE)","v":{"v":0,"d":"0.0"}},{"$f":"SUM(C37:H37)","v":{"v":0,"d":"0.0"}},{"$f":"VLOOKUP($A37,'7'!$B$10:$D$45,3,FALSE)","v":{"v":0,"d":"0.0"}},{"$f":"VLOOKUP($A37,'8'!$B$10:$D$45,3,FALSE)","v":{"v":0,"d":"0.0"}},{"$f":"VLOOKUP($A37,'9'!$B$10:$D$45,3,FALSE)","v":{"v":0,"d":"0.0"}},{"$f":"VLOOKUP($A37,'10'!$B$10:$D$45,3,FALSE)","v":{"v":0,"d":"0.0"}},{"$f":"VLOOKUP($A37,'11'!$B$10:$D$45,3,FALSE)","v":{"v":0,"d":"0.0"}},{"$f":"VLOOKUP($A37,'12'!$B$10:$D$45,3,FALSE)","v":{"v":0,"d":"0.0"}},{"$f":"T37/S37","v":{"$error":"#DIV/0!"}},{"$f":"VLOOKUP(A37,Formelhilfe!$A$9:$O$44,15,FALSE)","v":{"v":0,"d":"0.0"}},{"$f":"SUM(L37:Q37)","v":{"v":0,"d":"0.0"}},{"$f":"W37/V37","v":{"$error":"#DIV/0!"}},{"$f":"VLOOKUP(A37,Formelhilfe!$A$9:$P$44,16,FALSE)","v":{"v":0,"d":"0.0"}},{"$f":"SUM(C37:H37,L37:Q37)","v":{"v":0,"d":"0.0"}}]

{"sheet":"Formelhilfe","index":16,"n_rows":45,"n_cols":21,"rows_kept":45,"hidden":true}
[null,1,2,3,4,5,6,"Hinrunde Schnitt",7,8,9,10,11,12,"Rückrunde Schnitt","Gesamt Schnitt",null,null,"Kreisoberliga","Schützen","2019/2020"]
[{"$f":"'Wettkampf 1'!B2","v":"Sögel II"},{"$f":"IF('Wettkampf 1'!D2>0,1,0)","v":1},{"$f":"IF('2'!$D2>0,1,0)","v":1},{"$f":"IF('3'!$D2>0,1,0)","v":1},{"$f":"IF('4'!$D2>0,1,0)","v":1},{"$f":"IF('5'!$D2>0,1,0)","v":1},{"$f":"IF('6'!$D2>0,1,0)","v":1},{"$f":"B2+C2+D2+E2+F2+G2","v":6},{"$f":"IF('7'!$D2>0,1,0)","v":1},{"$f":"IF('8'!$D2>0,1,0)","v":1},{"$f":"IF('9'!$D2>0,1,0)","v":1},{"$f":"IF('10'!$D2>0,1,0)","v":1},{"$f":"IF('11'!$D2>0,1,0)","v":1},{"$f":"IF('12'!$D2>0,1,0)","v":0},{"$f":"I2+J2+K2+L2+M2+N2","v":5},{"$f":"O2+H2","v":11},null,null,"1. Kreisliga","Damen","2020/2021"]
[{"$f":"'Wettkampf 1'!B3","v":"Ostenwalde I"},{"$f":"IF('Wettkampf 1'!D3>0,1,0)","v":1},{"$f":"IF('2'!$D3>0,1,0)","v":1},{"$f":"IF('3'!$D3>0,1,0)","v":1},{"$f":"IF('4'!$D3>0,1,0)","v":1},{"$f":"IF('5'!$D3>0,1,0)","v":1},{"$f":"IF('6'!$D3>0,1,0)","v":1},6,{"$f":"IF('7'!$D3>0,1,0)","v":1},{"$f":"IF('8'!$D3>0,1,0)","v":1},{"$f":"IF('9'!$D3>0,1,0)","v":1},{"$f":"IF('10'!$D3>0,1,0)","v":1},{"$f":"IF('11'!$D3>0,1,0)","v":1},{"$f":"IF('12'!$D3>0,1,0)","v":0},5,11,null,null,"2. Kreisliga","Altersgruppe","2021/2022"]
[{"$f":"'Wettkampf 1'!B4","v":"Neuvrees II"},{"$f":"IF('Wettkampf 1'!D4>0,1,0)","v":1},{"$f":"IF('2'!$D4>0,1,0)","v":1},{"$f":"IF('3'!$D4>0,1,0)","v":1},{"$f":"IF('4'!$D4>0,1,0)","v":1},{"$f":"IF('5'!$D4>0,1,0)","v":1},{"$f":"IF('6'!$D4>0,1,0)","v":1},6,{"$f":"IF('7'!$D4>0,1,0)","v":1},{"$f":"IF('8'!$D4>0,1,0)","v":1},{"$f":"IF('9'!$D4>0,1,0)","v":1},{"$f":"IF('10'!$D4>0,1,0)","v":1},{"$f":"IF('11'!$D4>0,1,0)","v":1},{"$f":"IF('12'!$D4>0,1,0)","v":0},5,11,null,null,"1. Kreisklasse","Senioren","2022/2023"]
[{"$f":"'Wettkampf 1'!B5","v":"Breddenberg IV"},{"$f":"IF('Wettkampf 1'!D5>0,1,0)","v":1},{"$f":"IF('2'!$D5>0,1,0)","v":1},{"$f":"IF('3'!$D5>0,1,0)","v":1},{"$f":"IF('4'!$D5>0,1,0)","v":1},{"$f":"IF('5'!$D5>0,1,0)","v":1},{"$f":"IF('6'!$D5>0,1,0)","v":1},6,{"$f":"IF('7'!$D5>0,1,0)","v":1},{"$f":"IF('8'!$D5>0,1,0)","v":1},{"$f":"IF('9'!$D5>0,1,0)","v":1},{"$f":"IF('10'!$D5>0,1,0)","v":1},{"$f":"IF('11'!$D5>0,1,0)","v":1},{"$f":"IF('12'!$D5>0,1,0)","v":0},5,11,null,null,"2. Kreisklasse","   ","2023/2024"]
[{"$f":"'Wettkampf 1'!B6","v":"Neuvrees I"},{"$f":"IF('Wettkampf 1'!D6>0,1,0)","v":1},{"$f":"IF('2'!$D6>0,1,0)","v":1},{"$f":"IF('3'!$D6>0,1,0)","v":1},{"$f":"IF('4'!$D6>0,1,0)","v":1},{"$f":"IF('5'!$D6>0,1,0)","v":1},{"$f":"IF('6'!$D6>0,1,0)","v":1},6,{"$f":"IF('7'!$D6>0,1,0)","v":1},{"$f":"IF('8'!$D6>0,1,0)","v":1},{"$f":"IF('9'!$D6>0,1,0)","v":1},{"$f":"IF('10'!$D6>0,1,0)","v":1},{"$f":"IF('11'!$D6>0,1,0)","v":1},{"$f":"IF('12'!$D6>0,1,0)","v":0},5,11,null,null,"3. Kreisklasse"]
[{"$f":"'Wettkampf 1'!B7","v":"Börger III"},{"$f":"IF('Wettkampf 1'!D7>0,1,0)","v":1},{"$f":"IF('2'!$D7>0,1,0)","v":1},{"$f":"IF('3'!$D7>0,1,0)","v":1},{"$f":"IF('4'!$D7>0,1,0)","v":1},{"$f":"IF('5'!$D7>0,1,0)","v":1},{"$f":"IF('6'!$D7>0,1,0)","v":1},6,{"$f":"IF('7'!$D7>0,1,0)","v":1},{"$f":"IF('8'!$D7>0,1,0)","v":1},{"$f":"IF('9'!$D7>0,1,0)","v":1},{"$f":"IF('10'!$D7>0,1,0)","v":1},{"$f":"IF('11'!$D7>0,1,0)","v":1},{"$f":"IF('12'!$D7>0,1,0)","v":0},5,11,null,null,"4. Kreisklasse"]
[{"$nulls":18},"5. Kreisklasse"]
["Grünloh Michael",{"$f":"IF('Wettkampf 1'!D10>0,1,0)","v":1},{"$f":"IF('2'!$D10>0,1,0)","v":1},{"$f":"IF('3'!$D10>0,1,0)","v":1},{"$f":"IF('4'!$D10>0,1,0)","v":1},{"$f":"IF('5'!$D10>0,1,0)","v":1},{"$f":"IF('6'!$D10>0,1,0)","v":1},{"$f":"B9+C9+D9+E9+F9+G9","v":6},{"$f":"IF('7'!$D10>0,1,0)","v":1},{"$f":"IF('8'!$D10>0,1,0)","v":1},{"$f":"IF('9'!$D10>0,1,0)","v":1},{"$f":"IF('10'!$D10>0,1,0)","v":1},{"$f":"IF('11'!$D10>0,1,0)","v":1},{"$f":"IF('12'!$D10>0,1,0)","v":0},{"$f":"I9+J9+K9+L9+M9+N9","v":5},{"$f":"O9+H9","v":11},null,null,"6. Kreisklasse"]
["Trempeck Marco",{"$f":"IF('Wettkampf 1'!D11>0,1,0)","v":1},{"$f":"IF('2'!$D11>0,1,0)","v":1},{"$f":"IF('3'!$D11>0,1,0)","v":1},{"$f":"IF('4'!$D11>0,1,0)","v":1},{"$f":"IF('5'!$D11>0,1,0)","v":1},{"$f":"IF('6'!$D11>0,1,0)","v":1},{"$f":"B10+C10+D10+E10+F10+G10","v":6},{"$f":"IF('7'!$D11>0,1,0)","v":1},{"$f":"IF('8'!$D11>0,1,0)","v":1},{"$f":"IF('9'!$D11>0,1,0)","v":1},{"$f":"IF('10'!$D11>0,1,0)","v":1},{"$f":"IF('11'!$D11>0,1,0)","v":1},{"$f":"IF('12'!$D11>0,1,0)","v":0},{"$f":"I10+J10+K10+L10+M10+N10","v":5},{"$f":"O10+H10","v":11},null,null,"7. Kreisklasse"]
["Robbers Heinz",{"$f":"IF('Wettkampf 1'!D12>0,1,0)","v":1},{"$f":"IF('2'!$D12>0,1,0)","v":1},{"$f":"IF('3'!$D12>0,1,0)","v":1},{"$f":"IF('4'!$D12>0,1,0)","v":1},{"$f":"IF('5'!$D12>0,1,0)","v":1},{"$f":"IF('6'!$D12>0,1,0)","v":1},6,{"$f":"IF('7'!$D12>0,1,0)","v":1},{"$f":"IF('8'!$D12>0,1,0)","v":1},{"$f":"IF('9'!$D12>0,1,0)","v":1},{"$f":"IF('10'!$D12>0,1,0)","v":1},{"$f":"IF('11'!$D12>0,1,0)","v":1},{"$f":"IF('12'!$D12>0,1,0)","v":0},5,11]
["Robbers Bernd",{"$f":"IF('Wettkampf 1'!D13>0,1,0)","v":1},{"$f":"IF('2'!$D13>0,1,0)","v":1},{"$f":"IF('3'!$D13>0,1,0)","v":1},{"$f":"IF('4'!$D13>0,1,0)","v":1},{"$f":"IF('5'!$D13>0,1,0)","v":1},{"$f":"IF('6'!$D13>0,1,0)","v":1},6,{"$f":"IF('7'!$D13>0,1,0)","v":1},{"$f":"IF('8'!$D13>0,1,0)","v":1},{"$f":"IF('9'!$D13>0,1,0)","v":1},{"$f":"IF('10'!$D13>0,1,0)","v":1},{"$f":"IF('11'!$D13>0,1,0)","v":1},{"$f":"IF('12'!$D13>0,1,0)","v":0},5,11]
["Husmann Michael",{"$f":"IF('Wettkampf 1'!D14>0,1,0)","v":1},{"$f":"IF('2'!$D14>0,1,0)","v":1},{"$f":"IF('3'!$D14>0,1,0)","v":1},{"$f":"IF('4'!$D14>0,1,0)","v":1},{"$f":"IF('5'!$D14>0,1,0)","v":1},{"$f":"IF('6'!$D14>0,1,0)","v":1},6,{"$f":"IF('7'!$D14>0,1,0)","v":1},{"$f":"IF('8'!$D14>0,1,0)","v":1},{"$f":"IF('9'!$D14>0,1,0)","v":1},{"$f":"IF('10'!$D14>0,1,0)","v":1},{"$f":"IF('11'!$D14>0,1,0)","v":1},{"$f":"IF('12'!$D14>0,1,0)","v":0},5,11]
["Schütze 6",{"$f":"IF('Wettkampf 1'!D15>0,1,0)","v":0},{"$f":"IF('2'!$D15>0,1,0)","v":0},{"$f":"IF('3'!$D15>0,1,0)","v":0},{"$f":"IF('4'!$D15>0,1,0)","v":0},{"$f":"IF('5'!$D15>0,1,0)","v":0},{"$f":"IF('6'!$D15>0,1,0)","v":0},0,{"$f":"IF('7'!$D15>0,1,0)","v":0},{"$f":"IF('8'!$D15>0,1,0)","v":0},{"$f":"IF('9'!$D15>0,1,0)","v":0},{"$f":"IF('10'!$D15>0,1,0)","v":0},{"$f":"IF('11'!$D15>0,1,0)","v":0},{"$f":"IF('12'!$D15>0,1,0)","v":0},0,0]
["Bunten Manfred",{"$f":"IF('Wettkampf 1'!D16>0,1,0)","v":1},{"$f":"IF('2'!$D16>0,1,0)","v":1},{"$f":"IF('3'!$D16>0,1,0)","v":1},{"$f":"IF('4'!$D16>0,1,0)","v":1},{"$f":"IF('5'!$D16>0,1,0)","v":1},{"$f":"IF('6'!$D16>0,1,0)","v":1},6,{"$f":"IF('7'!$D16>0,1,0)","v":1},{"$f":"IF('8'!$D16>0,1,0)","v":1},{"$f":"IF('9'!$D16>0,1,0)","v":1},{"$f":"IF('10'!$D16>0,1,0)","v":1},{"$f":"IF('11'!$D16>0,1,0)","v":1},{"$f":"IF('12'!$D16>0,1,0)","v":0},5,11]
["Benten Helmut",{"$f":"IF('Wettkampf 1'!D17>0,1,0)","v":1},{"$f":"IF('2'!$D17>0,1,0)","v":1},{"$f":"IF('3'!$D17>0,1,0)","v":1},{"$f":"IF('4'!$D17>0,1,0)","v":1},{"$f":"IF('5'!$D17>0,1,0)","v":1},{"$f":"IF('6'!$D17>0,1,0)","v":1},6,{"$f":"IF('7'!$D17>0,1,0)","v":1},{"$f":"IF('8'!$D17>0,1,0)","v":1},{"$f":"IF('9'!$D17>0,1,0)","v":1},{"$f":"IF('10'!$D17>0,1,0)","v":1},{"$f":"IF('11'!$D17>0,1,0)","v":1},{"$f":"IF('12'!$D17>0,1,0)","v":0},5,11]
["Meiners Bernd",{"$f":"IF('Wettkampf 1'!D18>0,1,0)","v":1},{"$f":"IF('2'!$D18>0,1,0)","v":1},{"$f":"IF('3'!$D18>0,1,0)","v":1},{"$f":"IF('4'!$D18>0,1,0)","v":1},{"$f":"IF('5'!$D18>0,1,0)","v":1},{"$f":"IF('6'!$D18>0,1,0)","v":1},6,{"$f":"IF('7'!$D18>0,1,0)","v":1},{"$f":"IF('8'!$D18>0,1,0)","v":1},{"$f":"IF('9'!$D18>0,1,0)","v":1},{"$f":"IF('10'!$D18>0,1,0)","v":1},{"$f":"IF('11'!$D18>0,1,0)","v":1},{"$f":"IF('12'!$D18>0,1,0)","v":0},5,11]
["Meiners Martin",{"$f":"IF('Wettkampf 1'!D19>0,1,0)","v":1},{"$f":"IF('2'!$D19>0,1,0)","v":1},{"$f":"IF('3'!$D19>0,1,0)","v":1},{"$f":"IF('4'!$D19>0,1,0)","v":1},{"$f":"IF('5'!$D19>0,1,0)","v":1},{"$f":"IF('6'!$D19>0,1,0)","v":1},6,{"$f":"IF('7'!$D19>0,1,0)","v":1},{"$f":"IF('8'!$D19>0,1,0)","v":1},{"$f":"IF('9'!$D19>0,1,0)","v":1},{"$f":"IF('10'!$D19>0,1,0)","v":1},{"$f":"IF('11'!$D19>0,1,0)","v":1},{"$f":"IF('12'!$D19>0,1,0)","v":0},5,11]
["Schütze 11",{"$f":"IF('Wettkampf 1'!D20>0,1,0)","v":0},{"$f":"IF('2'!$D20>0,1,0)","v":0},{"$f":"IF('3'!$D20>0,1,0)","v":0},{"$f":"IF('4'!$D20>0,1,0)","v":0},{"$f":"IF('5'!$D20>0,1,0)","v":0},{"$f":"IF('6'!$D20>0,1,0)","v":0},0,{"$f":"IF('7'!$D20>0,1,0)","v":0},{"$f":"IF('8'!$D20>0,1,0)","v":0},{"$f":"IF('9'!$D20>0,1,0)","v":0},{"$f":"IF('10'!$D20>0,1,0)","v":0},{"$f":"IF('11'!$D20>0,1,0)","v":0},{"$f":"IF('12'!$D20>0,1,0)","v":0},0,0]
["Schütze 12",{"$f":"IF('Wettkampf 1'!D21>0,1,0)","v":0},{"$f":"IF('2'!$D21>0,1,0)","v":0},{"$f":"IF('3'!$D21>0,1,0)","v":0},{"$f":"IF('4'!$D21>0,1,0)","v":0},{"$f":"IF('5'!$D21>0,1,0)","v":0},{"$f":"IF('6'!$D21>0,1,0)","v":0},0,{"$f":"IF('7'!$D21>0,1,0)","v":0},{"$f":"IF('8'!$D21>0,1,0)","v":0},{"$f":"IF('9'!$D21>0,1,0)","v":0},{"$f":"IF('10'!$D21>0,1,0)","v":0},{"$f":"IF('11'!$D21>0,1,0)","v":0},{"$f":"IF('12'!$D21>0,1,0)","v":0},0,0]
["Witting Bernhard",{"$f":"IF('Wettkampf 1'!D22>0,1,0)","v":1},{"$f":"IF('2'!$D22>0,1,0)","v":1},{"$f":"IF('3'!$D22>0,1,0)","v":1},{"$f":"IF('4'!$D22>0,1,0)","v":1},{"$f":"IF('5'!$D22>0,1,0)","v":1},{"$f":"IF('6'!$D22>0,1,0)","v":1},6,{"$f":"IF('7'!$D22>0,1,0)","v":1},{"$f":"IF('8'!$D22>0,1,0)","v":1},{"$f":"IF('9'!$D22>0,1,0)","v":1},{"$f":"IF('10'!$D22>0,1,0)","v":1},{"$f":"IF('11'!$D22>0,1,0)","v":1},{"$f":"IF('12'!$D22>0,1,0)","v":0},5,11]
["Szczepanski Holger",{"$f":"IF('Wettkampf 1'!D23>0,1,0)","v":1},{"$f":"IF('2'!$D23>0,1,0)","v":1},{"$f":"IF('3'!$D23>0,1,0)","v":1},{"$f":"IF('4'!$D23>0,1,0)","v":1},{"$f":"IF('5'!$D23>0,1,0)","v":1},{"$f":"IF('6'!$D23>0,1,0)","v":1},6,{"$f":"IF('7'!$D23>0,1,0)","v":1},{"$f":"IF('8'!$D23>0,1,0)","v":1},{"$f":"IF('9'!$D23>0,1,0)","v":1},{"$f":"IF('10'!$D23>0,1,0)","v":1},{"$f":"IF('11'!$D23>0,1,0)","v":1},{"$f":"IF('12'!$D23>0,1,0)","v":0},5,11]
["Schrand Karl-Heinz",{"$f":"IF('Wettkampf 1'!D24>0,1,0)","v":1},{"$f":"IF('2'!$D24>0,1,0)","v":1},{"$f":"IF('3'!$D24>0,1,0)","v":1},{"$f":"IF('4'!$D24>0,1,0)","v":1},{"$f":"IF('5'!$D24>0,1,0)","v":1},{"$f":"IF('6'!$D24>0,1,0)","v":1},6,{"$f":"IF('7'!$D24>0,1,0)","v":1},{"$f":"IF('8'!$D24>0,1,0)","v":1},{"$f":"IF('9'!$D24>0,1,0)","v":1},{"$f":"IF('10'!$D24>0,1,0)","v":1},{"$f":"IF('11'!$D24>0,1,0)","v":1},{"$f":"IF('12'!$D24>0,1,0)","v":0},5,11]
["Preut Hans",{"$f":"IF('Wettkampf 1'!D25>0,1,0)","v":1},{"$f":"IF('2'!$D25>0,1,0)","v":1},{"$f":"IF('3'!$D25>0,1,0)","v":1},{"$f":"IF('4'!$D25>0,1,0)","v":1},{"$f":"IF('5'!$D25>0,1,0)","v":1},{"$f":"IF('6'!$D25>0,1,0)","v":1},6,{"$f":"IF('7'!$D25>0,1,0)","v":1},{"$f":"IF('8'!$D25>0,1,0)","v":1},{"$f":"IF('9'!$D25>0,1,0)","v":1},{"$f":"IF('10'!$D25>0,1,0)","v":1},{"$f":"IF('11'!$D25>0,1,0)","v":1},{"$f":"IF('12'!$D25>0,1,0)","v":0},5,11]
["Thunert  Dirk",{"$f":"IF('Wettkampf 1'!D26>0,1,0)","v":1},{"$f":"IF('2'!$D26>0,1,0)","v":1},{"$f":"IF('3'!$D26>0,1,0)","v":1},{"$f":"IF('4'!$D26>0,1,0)","v":1},{"$f":"IF('5'!$D26>0,1,0)","v":1},{"$f":"IF('6'!$D26>0,1,0)","v":1},6,{"$f":"IF('7'!$D26>0,1,0)","v":1},{"$f":"IF('8'!$D26>0,1,0)","v":1},{"$f":"IF('9'!$D26>0,1,0)","v":1},{"$f":"IF('10'!$D26>0,1,0)","v":1},{"$f":"IF('11'!$D26>0,1,0)","v":1},{"$f":"IF('12'!$D26>0,1,0)","v":0},5,11]
["Schütze 18",{"$f":"IF('Wettkampf 1'!D27>0,1,0)","v":0},{"$f":"IF('2'!$D27>0,1,0)","v":0},{"$f":"IF('3'!$D27>0,1,0)","v":0},{"$f":"IF('4'!$D27>0,1,0)","v":0},{"$f":"IF('5'!$D27>0,1,0)","v":0},{"$f":"IF('6'!$D27>0,1,0)","v":0},0,{"$f":"IF('7'!$D27>0,1,0)","v":0},{"$f":"IF('8'!$D27>0,1,0)","v":0},{"$f":"IF('9'!$D27>0,1,0)","v":0},{"$f":"IF('10'!$D27>0,1,0)","v":0},{"$f":"IF('11'!$D27>0,1,0)","v":0},{"$f":"IF('12'!$D27>0,1,0)","v":0},0,0]
["Hömmen Bernd",{"$f":"IF('Wettkampf 1'!D28>0,1,0)","v":1},{"$f":"IF('2'!$D28>0,1,0)","v":1},{"$f":"IF('3'!$D28>0,1,0)","v":1},{"$f":"IF('4'!$D28>0,1,0)","v":1},{"$f":"IF('5'!$D28>0,1,0)","v":1},{"$f":"IF('6'!$D28>0,1,0)","v":1},6,{"$f":"IF('7'!$D28>0,1,0)","v":1},{"$f":"IF('8'!$D28>0,1,0)","v":1},{"$f":"IF('9'!$D28>0,1,0)","v":1},{"$f":"IF('10'!$D28>0,1,0)","v":1},{"$f":"IF('11'!$D28>0,1,0)","v":1},{"$f":"IF('12'!$D28>0,1,0)","v":0},5,11]
["Hanekamp Rudi",{"$f":"IF('Wettkampf 1'!D29>0,1,0)","v":1},{"$f":"IF('2'!$D29>0,1,0)","v":1},{"$f":"IF('3'!$D29>0,1,0)","v":1},{"$f":"IF('4'!$D29>0,1,0)","v":1},{"$f":"IF('5'!$D29>0,1,0)","v":1},{"$f":"IF('6'!$D29>0,1,0)","v":1},6,{"$f":"IF('7'!$D29>0,1,0)","v":1},{"$f":"IF('8'!$D29>0,1,0)","v":1},{"$f":"IF('9'!$D29>0,1,0)","v":1},{"$f":"IF('10'!$D29>0,1,0)","v":1},{"$f":"IF('11'!$D29>0,1,0)","v":1},{"$f":"IF('12'!$D29>0,1,0)","v":0},5,11]
["Köß Wilhelm",{"$f":"IF('Wettkampf 1'!D30>0,1,0)","v":1},{"$f":"IF('2'!$D30>0,1,0)","v":1},{"$f":"IF('3'!$D30>0,1,0)","v":1},{"$f":"IF('4'!$D30>0,1,0)","v":1},{"$f":"IF('5'!$D30>0,1,0)","v":1},{"$f":"IF('6'!$D30>0,1,0)","v":1},6,{"$f":"IF('7'!$D30>0,1,0)","v":1},{"$f":"IF('8'!$D30>0,1,0)","v":1},{"$f":"IF('9'!$D30>0,1,0)","v":1},{"$f":"IF('10'!$D30>0,1,0)","v":1},{"$f":"IF('11'!$D30>0,1,0)","v":1},{"$f":"IF('12'!$D30>0,1,0)","v":0},5,11]
["Jansen  Martin",{"$f":"IF('Wettkampf 1'!D31>0,1,0)","v":1},{"$f":"IF('2'!$D31>0,1,0)","v":1},{"$f":"IF('3'!$D31>0,1,0)","v":1},{"$f":"IF('4'!$D31>0,1,0)","v":1},{"$f":"IF('5'!$D31>0,1,0)","v":1},{"$f":"IF('6'!$D31>0,1,0)","v":1},6,{"$f":"IF('7'!$D31>0,1,0)","v":1},{"$f":"IF('8'!$D31>0,1,0)","v":1},{"$f":"IF('9'!$D31>0,1,0)","v":1},{"$f":"IF('10'!$D31>0,1,0)","v":1},{"$f":"IF('11'!$D31>0,1,0)","v":1},{"$f":"IF('12'!$D31>0,1,0)","v":0},5,11]
["Schütze 23",{"$f":"IF('Wettkampf 1'!D32>0,1,0)","v":0},{"$f":"IF('2'!$D32>0,1,0)","v":0},{"$f":"IF('3'!$D32>0,1,0)","v":0},{"$f":"IF('4'!$D32>0,1,0)","v":0},{"$f":"IF('5'!$D32>0,1,0)","v":0},{"$f":"IF('6'!$D32>0,1,0)","v":0},0,{"$f":"IF('7'!$D32>0,1,0)","v":0},{"$f":"IF('8'!$D32>0,1,0)","v":0},{"$f":"IF('9'!$D32>0,1,0)","v":0},{"$f":"IF('10'!$D32>0,1,0)","v":0},{"$f":"IF('11'!$D32>0,1,0)","v":0},{"$f":"IF('12'!$D32>0,1,0)","v":0},0,0]
["Schütze 24",{"$f":"IF('Wettkampf 1'!D33>0,1,0)","v":0},{"$f":"IF('2'!$D33>0,1,0)","v":0},{"$f":"IF('3'!$D33>0,1,0)","v":0},{"$f":"IF('4'!$D33>0,1,0)","v":0},{"$f":"IF('5'!$D33>0,1,0)","v":0},{"$f":"IF('6'!$D33>0,1,0)","v":0},0,{"$f":"IF('7'!$D33>0,1,0)","v":0},{"$f":"IF('8'!$D33>0,1,0)","v":0},{"$f":"IF('9'!$D33>0,1,0)","v":0},{"$f":"IF('10'!$D33>0,1,0)","v":0},{"$f":"IF('11'!$D33>0,1,0)","v":0},{"$f":"IF('12'!$D33>0,1,0)","v":0},0,0]
["Rolfes Willi",{"$f":"IF('Wettkampf 1'!D34>0,1,0)","v":1},{"$f":"IF('2'!$D34>0,1,0)","v":1},{"$f":"IF('3'!$D34>0,1,0)","v":1},{"$f":"IF('4'!$D34>0,1,0)","v":1},{"$f":"IF('5'!$D34>0,1,0)","v":1},{"$f":"IF('6'!$D34>0,1,0)","v":1},6,{"$f":"IF('7'!$D34>0,1,0)","v":1},{"$f":"IF('8'!$D34>0,1,0)","v":1},{"$f":"IF('9'!$D34>0,1,0)","v":1},{"$f":"IF('10'!$D34>0,1,0)","v":1},{"$f":"IF('11'!$D34>0,1,0)","v":1},{"$f":"IF('12'!$D34>0,1,0)","v":0},5,11]
["Breyer Wilfried",{"$f":"IF('Wettkampf 1'!D35>0,1,0)","v":1},{"$f":"IF('2'!$D35>0,1,0)","v":1},{"$f":"IF('3'!$D35>0,1,0)","v":1},{"$f":"IF('4'!$D35>0,1,0)","v":1},{"$f":"IF('5'!$D35>0,1,0)","v":1},{"$f":"IF('6'!$D35>0,1,0)","v":1},6,{"$f":"IF('7'!$D35>0,1,0)","v":1},{"$f":"IF('8'!$D35>0,1,0)","v":1},{"$f":"IF('9'!$D35>0,1,0)","v":1},{"$f":"IF('10'!$D35>0,1,0)","v":1},{"$f":"IF('11'!$D35>0,1,0)","v":1},{"$f":"IF('12'!$D35>0,1,0)","v":0},5,11]
["Janßen Markus",{"$f":"IF('Wettkampf 1'!D36>0,1,0)","v":1},{"$f":"IF('2'!$D36>0,1,0)","v":1},{"$f":"IF('3'!$D36>0,1,0)","v":1},{"$f":"IF('4'!$D36>0,1,0)","v":1},{"$f":"IF('5'!$D36>0,1,0)","v":1},{"$f":"IF('6'!$D36>0,1,0)","v":1},6,{"$f":"IF('7'!$D36>0,1,0)","v":1},{"$f":"IF('8'!$D36>0,1,0)","v":1},{"$f":"IF('9'!$D36>0,1,0)","v":1},{"$f":"IF('10'!$D36>0,1,0)","v":1},{"$f":"IF('11'!$D36>0,1,0)","v":1},{"$f":"IF('12'!$D36>0,1,0)","v":0},5,11]
["Steenken Klaus",{"$f":"IF('Wettkampf 1'!D37>0,1,0)","v":1},{"$f":"IF('2'!$D37>0,1,0)","v":1},{"$f":"IF('3'!$D37>0,1,0)","v":1},{"$f":"IF('4'!$D37>0,1,0)","v":1},{"$f":"IF('5'!$D37>0,1,0)","v":0},{"$f":"IF('6'!$D37>0,1,0)","v":0},4,{"$f":"IF('7'!$D37>0,1,0)","v":0},{"$f":"IF('8'!$D37>0,1,0)","v":0},{"$f":"IF('9'!$D37>0,1,0)","v":0},{"$f":"IF('10'!$D37>0,1,0)","v":0},{"$f":"IF('11'!$D37>0,1,0)","v":0},{"$f":"IF('12'!$D37>0,1,0)","v":0},0,4]
["Thyen Werner",{"$f":"IF('Wettkampf 1'!D38>0,1,0)","v":1},{"$f":"IF('2'!$D38>0,1,0)","v":1},{"$f":"IF('3'!$D38>0,1,0)","v":1},{"$f":"IF('4'!$D38>0,1,0)","v":1},{"$f":"IF('5'!$D38>0,1,0)","v":1},{"$f":"IF('6'!$D38>0,1,0)","v":1},6,{"$f":"IF('7'!$D38>0,1,0)","v":1},{"$f":"IF('8'!$D38>0,1,0)","v":1},{"$f":"IF('9'!$D38>0,1,0)","v":1},{"$f":"IF('10'!$D38>0,1,0)","v":1},{"$f":"IF('11'!$D38>0,1,0)","v":1},{"$f":"IF('12'!$D38>0,1,0)","v":0},5,11]
["Schütze 30",{"$f":"IF('Wettkampf 1'!D39>0,1,0)","v":0},{"$f":"IF('2'!$D39>0,1,0)","v":0},{"$f":"IF('3'!$D39>0,1,0)","v":0},{"$f":"IF('4'!$D39>0,1,0)","v":0},{"$f":"IF('5'!$D39>0,1,0)","v":0},{"$f":"IF('6'!$D39>0,1,0)","v":0},0,{"$f":"IF('7'!$D39>0,1,0)","v":0},{"$f":"IF('8'!$D39>0,1,0)","v":0},{"$f":"IF('9'!$D39>0,1,0)","v":0},{"$f":"IF('10'!$D39>0,1,0)","v":0},{"$f":"IF('11'!$D39>0,1,0)","v":0},{"$f":"IF('12'!$D39>0,1,0)","v":0},0,0]
["Schuckenbrock Simon",{"$f":"IF('Wettkampf 1'!D40>0,1,0)","v":1},{"$f":"IF('2'!$D40>0,1,0)","v":1},{"$f":"IF('3'!$D40>0,1,0)","v":1},{"$f":"IF('4'!$D40>0,1,0)","v":1},{"$f":"IF('5'!$D40>0,1,0)","v":1},{"$f":"IF('6'!$D40>0,1,0)","v":1},{"$f":"B39+C39+D39+E39+F39+G39","v":6},{"$f":"IF('7'!$D40>0,1,0)","v":1},{"$f":"IF('8'!$D40>0,1,0)","v":1},{"$f":"IF('9'!$D40>0,1,0)","v":1},{"$f":"IF('10'!$D40>0,1,0)","v":1},{"$f":"IF('11'!$D40>0,1,0)","v":1},{"$f":"IF('12'!$D40>0,1,0)","v":0},{"$f":"I39+J39+K39+L39+M39+N39","v":5},{"$f":"O39+H39","v":11}]
["Henzen Jens",{"$f":"IF('Wettkampf 1'!D41>0,1,0)","v":1},{"$f":"IF('2'!$D41>0,1,0)","v":1},{"$f":"IF('3'!$D41>0,1,0)","v":1},{"$f":"IF('4'!$D41>0,1,0)","v":1},{"$f":"IF('5'!$D41>0,1,0)","v":1},{"$f":"IF('6'!$D41>0,1,0)","v":1},6,{"$f":"IF('7'!$D41>0,1,0)","v":1},{"$f":"IF('8'!$D41>0,1,0)","v":1},{"$f":"IF('9'!$D41>0,1,0)","v":1},{"$f":"IF('10'!$D41>0,1,0)","v":1},{"$f":"IF('11'!$D41>0,1,0)","v":1},{"$f":"IF('12'!$D41>0,1,0)","v":0},5,11]
["Sebers Daniel",{"$f":"IF('Wettkampf 1'!D42>0,1,0)","v":1},{"$f":"IF('2'!$D42>0,1,0)","v":1},{"$f":"IF('3'!$D42>0,1,0)","v":1},{"$f":"IF('4'!$D42>0,1,0)","v":1},{"$f":"IF('5'!$D42>0,1,0)","v":1},{"$f":"IF('6'!$D42>0,1,0)","v":1},6,{"$f":"IF('7'!$D42>0,1,0)","v":1},{"$f":"IF('8'!$D42>0,1,0)","v":1},{"$f":"IF('9'!$D42>0,1,0)","v":1},{"$f":"IF('10'!$D42>0,1,0)","v":1},{"$f":"IF('11'!$D42>0,1,0)","v":1},{"$f":"IF('12'!$D42>0,1,0)","v":0},5,11]
["Rode Bernd",{"$f":"IF('Wettkampf 1'!D43>0,1,0)","v":1},{"$f":"IF('2'!$D43>0,1,0)","v":1},{"$f":"IF('3'!$D43>0,1,0)","v":1},{"$f":"IF('4'!$D43>0,1,0)","v":1},{"$f":"IF('5'!$D43>0,1,0)","v":1},{"$f":"IF('6'!$D43>0,1,0)","v":1},6,{"$f":"IF('7'!$D43>0,1,0)","v":1},{"$f":"IF('8'!$D43>0,1,0)","v":1},{"$f":"IF('9'!$D43>0,1,0)","v":1},{"$f":"IF('10'!$D43>0,1,0)","v":1},{"$f":"IF('11'!$D43>0,1,0)","v":1},{"$f":"IF('12'!$D43>0,1,0)","v":0},5,11]
["Schroer Jürgen",{"$f":"IF('Wettkampf 1'!D44>0,1,0)","v":1},{"$f":"IF('2'!$D44>0,1,0)","v":1},{"$f":"IF('3'!$D44>0,1,0)","v":1},{"$f":"IF('4'!$D44>0,1,0)","v":1},{"$f":"IF('5'!$D44>0,1,0)","v":1},{"$f":"IF('6'!$D44>0,1,0)","v":1},6,{"$f":"IF('7'!$D44>0,1,0)","v":1},{"$f":"IF('8'!$D44>0,1,0)","v":1},{"$f":"IF('9'!$D44>0,1,0)","v":1},{"$f":"IF('10'!$D44>0,1,0)","v":1},{"$f":"IF('11'!$D44>0,1,0)","v":1},{"$f":"IF('12'!$D44>0,1,0)","v":0},5,11]
["Schütze 36",{"$f":"IF('Wettkampf 1'!D45>0,1,0)","v":0},{"$f":"IF('2'!$D45>0,1,0)","v":0},{"$f":"IF('3'!$D45>0,1,0)","v":0},{"$f":"IF('4'!$D45>0,1,0)","v":0},{"$f":"IF('5'!$D45>0,1,0)","v":0},{"$f":"IF('6'!$D45>0,1,0)","v":0},0,{"$f":"IF('7'!$D45>0,1,0)","v":0},{"$f":"IF('8'!$D45>0,1,0)","v":0},{"$f":"IF('9'!$D45>0,1,0)","v":0},{"$f":"IF('10'!$D45>0,1,0)","v":0},{"$f":"IF('11'!$D45>0,1,0)","v":0},{"$f":"IF('12'!$D45>0,1,0)","v":0},0,0]
[null,{"$f":"SUM(B9:B44)","v":{"v":28,"d":"28.00"}},{"$f":"SUM(C9:C44)","v":{"v":28,"d":"28.00"}},{"v":28,"d":"28.00"},{"v":28,"d":"28.00"},{"v":27,"d":"27.00"},{"v":27,"d":"27.00"},{"$f":"SUM(H9:H38)","v":{"v":136,"d":"136.00"}},{"$f":"SUM(I9:I44)","v":{"v":27,"d":"27.00"}},{"$f":"SUM(J9:J44)","v":{"v":27,"d":"27.00"}},{"v":27,"d":"27.00"},{"v":27,"d":"27.00"},{"v":27,"d":"27.00"},{"v":0,"d":"0.00"},{"$f":"SUM(O9:O44)","v":{"v":135,"d":"135.00"}},{"$f":"SUM(P9:P44)","v":{"v":301,"d":"301.00"}}]

{"sheet":"Übersicht Gruppen","index":17,"n_rows":7,"n_cols":20,"rows_kept":7,"hidden":true}
[]
[null,"Sögel II",{"$f":"VLOOKUP($B$2:$B$7,'Wettkampf 1'!$B$2:$D$7,3,FALSE)","v":932.8},{"$f":"VLOOKUP($B$2:$B$7,'2'!$B$2:$D$7,3,FALSE)","v":933.3},{"$f":"VLOOKUP($B$2:$B$7,'3'!$B$2:$D$7,3,FALSE)","v":941.3},{"$f":"VLOOKUP($B$2:$B$7,'4'!$B$2:$D$7,3,FALSE)","v":943.4},{"$f":"VLOOKUP($B$2:$B$7,'5'!$B$2:$D$7,3,FALSE)","v":939.4},{"$f":"VLOOKUP($B$2:$B$7,'6'!$B$2:$D$7,3,FALSE)","v":940.4},{"$f":"J2/Formelhilfe!H5","v":{"v":938.4333333333333,"d":"938.4"}},{"$f":"SUM(C2:H2)","v":{"v":5630.599999999999,"d":"5,630.6"}},{"$f":"VLOOKUP($B$2:$B$7,'7'!$B$2:$D$7,3,FALSE)","v":{"v":944.0999999999999,"d":"944.1"}},{"$f":"VLOOKUP($B$2:$B$7,'8'!$B$2:$D$7,3,FALSE)","v":936.4},{"$f":"VLOOKUP($B$2:$B$7,'9'!$B$2:$D$7,3,FALSE)","v":935.3},{"$f":"VLOOKUP($B$2:$B$7,'10'!$B$2:$D$7,3,FALSE)","v":932.5},{"$f":"VLOOKUP($B$2:$B$7,'11'!$B$2:$D$7,3,FALSE)","v":{"v":941.5999999999999,"d":"941.6"}},{"$f":"VLOOKUP($B$2:$B$7,'12'!$B$2:$D$7,3,FALSE)","v":{"v":0,"d":"0.0"}},{"$f":"R2/Formelhilfe!O5","v":{"v":937.9799999999999,"d":"938.0"}},{"$f":"SUM(K2:P2)","v":{"v":4689.9,"d":"4,689.9"}},{"$f":"T2/Formelhilfe!P5","v":{"v":938.2272727272725,"d":"938.2"}},{"$f":"SUM(C2:H2,K2:P2)","v":{"v":10320.499999999998,"d":"10,320.5"}}]
[null,"Börger III",{"$f":"VLOOKUP($B$2:$B$7,'Wettkampf 1'!$B$2:$D$7,3,FALSE)","v":923.3},{"$f":"VLOOKUP($B$2:$B$7,'2'!$B$2:$D$7,3,FALSE)","v":{"v":931.6999999999999,"d":"931.7"}},{"$f":"VLOOKUP($B$2:$B$7,'3'!$B$2:$D$7,3,FALSE)","v":929.7},{"$f":"VLOOKUP($B$2:$B$7,'4'!$B$2:$D$7,3,FALSE)","v":{"v":926.3999999999999,"d":"926.4"}},{"$f":"VLOOKUP($B$2:$B$7,'5'!$B$2:$D$7,3,FALSE)","v":{"v":935,"d":"935.0"}},{"$f":"VLOOKUP($B$2:$B$7,'6'!$B$2:$D$7,3,FALSE)","v":939.6},{"$f":"J3/Formelhilfe!H4","v":{"v":930.9499999999999,"d":"931.0"}},{"$f":"SUM(C3:H3)","v":{"v":5585.7,"d":"5,585.7"}},{"$f":"VLOOKUP($B$2:$B$7,'7'!$B$2:$D$7,3,FALSE)","v":{"v":934.3999999999999,"d":"934.4"}},{"$f":"VLOOKUP($B$2:$B$7,'8'!$B$2:$D$7,3,FALSE)","v":{"v":925.3000000000001,"d":"925.3"}},{"$f":"VLOOKUP($B$2:$B$7,'9'!$B$2:$D$7,3,FALSE)","v":933.1},{"$f":"VLOOKUP($B$2:$B$7,'10'!$B$2:$D$7,3,FALSE)","v":934.5},{"$f":"VLOOKUP($B$2:$B$7,'11'!$B$2:$D$7,3,FALSE)","v":938.2},{"$f":"VLOOKUP($B$2:$B$7,'12'!$B$2:$D$7,3,FALSE)","v":{"v":0,"d":"0.0"}},{"$f":"R3/Formelhilfe!O4","v":933.1},{"$f":"SUM(K3:P3)","v":{"v":4665.5,"d":"4,665.5"}},{"$f":"T3/Formelhilfe!P4","v":{"v":931.9272727272728,"d":"931.9"}},{"$f":"SUM(C3:H3,K3:P3)","v":{"v":10251.2,"d":"10,251.2"}}]
[null,"Neuvrees II",{"$f":"VLOOKUP($B$2:$B$7,'Wettkampf 1'!$B$2:$D$7,3,FALSE)","v":{"v":933.6999999999999,"d":"933.7"}},{"$f":"VLOOKUP($B$2:$B$7,'2'!$B$2:$D$7,3,FALSE)","v":{"v":934.6000000000001,"d":"934.6"}},{"$f":"VLOOKUP($B$2:$B$7,'3'!$B$2:$D$7,3,FALSE)","v":929.4},{"$f":"VLOOKUP($B$2:$B$7,'4'!$B$2:$D$7,3,FALSE)","v":930.9},{"$f":"VLOOKUP($B$2:$B$7,'5'!$B$2:$D$7,3,FALSE)","v":932.3},{"$f":"VLOOKUP($B$2:$B$7,'6'!$B$2:$D$7,3,FALSE)","v":921.5},{"$f":"J4/Formelhilfe!H3","v":{"v":930.4000000000001,"d":"930.4"}},{"$f":"SUM(C4:H4)","v":{"v":5582.400000000001,"d":"5,582.4"}},{"$f":"VLOOKUP($B$2:$B$7,'7'!$B$2:$D$7,3,FALSE)","v":{"v":922.8000000000001,"d":"922.8"}},{"$f":"VLOOKUP($B$2:$B$7,'8'!$B$2:$D$7,3,FALSE)","v":928.9},{"$f":"VLOOKUP($B$2:$B$7,'9'!$B$2:$D$7,3,FALSE)","v":936.9},{"$f":"VLOOKUP($B$2:$B$7,'10'!$B$2:$D$7,3,FALSE)","v":934.4},{"$f":"VLOOKUP($B$2:$B$7,'11'!$B$2:$D$7,3,FALSE)","v":929.4},{"$f":"VLOOKUP($B$2:$B$7,'12'!$B$2:$D$7,3,FALSE)","v":{"v":0,"d":"0.0"}},{"$f":"R4/Formelhilfe!O3","v":{"v":930.4799999999999,"d":"930.5"}},{"$f":"SUM(K4:P4)","v":{"v":4652.4,"d":"4,652.4"}},{"$f":"T4/Formelhilfe!P3","v":{"v":930.4363636363636,"d":"930.4"}},{"$f":"SUM(C4:H4,K4:P4)","v":{"v":10234.8,"d":"10,234.8"}}]
[null,"Neuvrees I",{"$f":"VLOOKUP($B$2:$B$7,'Wettkampf 1'!$B$2:$D$7,3,FALSE)","v":{"v":930.3000000000001,"d":"930.3"}},{"$f":"VLOOKUP($B$2:$B$7,'2'!$B$2:$D$7,3,FALSE)","v":929.2},{"$f":"VLOOKUP($B$2:$B$7,'3'!$B$2:$D$7,3,FALSE)","v":926.4},{"$f":"VLOOKUP($B$2:$B$7,'4'!$B$2:$D$7,3,FALSE)","v":934.5},{"$f":"VLOOKUP($B$2:$B$7,'5'!$B$2:$D$7,3,FALSE)","v":{"v":924.8000000000001,"d":"924.8"}},{"$f":"VLOOKUP($B$2:$B$7,'6'!$B$2:$D$7,3,FALSE)","v":{"v":929.0999999999999,"d":"929.1"}},{"$f":"J5/Formelhilfe!H7","v":{"v":929.0499999999998,"d":"929.1"}},{"$f":"SUM(C5:H5)","v":{"v":5574.299999999999,"d":"5,574.3"}},{"$f":"VLOOKUP($B$2:$B$7,'7'!$B$2:$D$7,3,FALSE)","v":919.5},{"$f":"VLOOKUP($B$2:$B$7,'8'!$B$2:$D$7,3,FALSE)","v":{"v":939.5999999999999,"d":"939.6"}},{"$f":"VLOOKUP($B$2:$B$7,'9'!$B$2:$D$7,3,FALSE)","v":{"v":933,"d":"933.0"}},{"$f":"VLOOKUP($B$2:$B$7,'10'!$B$2:$D$7,3,FALSE)","v":929.6},{"$f":"VLOOKUP($B$2:$B$7,'11'!$B$2:$D$7,3,FALSE)","v":929.4},{"$f":"VLOOKUP($B$2:$B$7,'12'!$B$2:$D$7,3,FALSE)","v":{"v":0,"d":"0.0"}},{"$f":"R5/Formelhilfe!O7","v":{"v":930.2199999999999,"d":"930.2"}},{"$f":"SUM(K5:P5)","v":{"v":4651.099999999999,"d":"4,651.1"}},{"$f":"T5/Formelhilfe!P7","v":{"v":929.5818181818181,"d":"929.6"}},{"$f":"SUM(C5:H5,K5:P5)","v":{"v":10225.4,"d":"10,225.4"}}]
[null,"Ostenwalde I",{"$f":"VLOOKUP($B$2:$B$7,'Wettkampf 1'!$B$2:$D$7,3,FALSE)","v":922.4},{"$f":"VLOOKUP($B$2:$B$7,'2'!$B$2:$D$7,3,FALSE)","v":{"v":929,"d":"929.0"}},{"$f":"VLOOKUP($B$2:$B$7,'3'!$B$2:$D$7,3,FALSE)","v":{"v":923.4000000000001,"d":"923.4"}},{"$f":"VLOOKUP($B$2:$B$7,'4'!$B$2:$D$7,3,FALSE)","v":923.2},{"$f":"VLOOKUP($B$2:$B$7,'5'!$B$2:$D$7,3,FALSE)","v":{"v":923,"d":"923.0"}},{"$f":"VLOOKUP($B$2:$B$7,'6'!$B$2:$D$7,3,FALSE)","v":922.2},{"$f":"J6/Formelhilfe!H2","v":{"v":923.8666666666667,"d":"923.9"}},{"$f":"SUM(C6:H6)","v":{"v":5543.2,"d":"5,543.2"}},{"$f":"VLOOKUP($B$2:$B$7,'7'!$B$2:$D$7,3,FALSE)","v":925.1},{"$f":"VLOOKUP($B$2:$B$7,'8'!$B$2:$D$7,3,FALSE)","v":{"v":921.1999999999999,"d":"921.2"}},{"$f":"VLOOKUP($B$2:$B$7,'9'!$B$2:$D$7,3,FALSE)","v":{"v":912.9000000000001,"d":"912.9"}},{"$f":"VLOOKUP($B$2:$B$7,'10'!$B$2:$D$7,3,FALSE)","v":{"v":919.9000000000001,"d":"919.9"}},{"$f":"VLOOKUP($B$2:$B$7,'11'!$B$2:$D$7,3,FALSE)","v":{"v":925,"d":"925.0"}},{"$f":"VLOOKUP($B$2:$B$7,'12'!$B$2:$D$7,3,FALSE)","v":{"v":0,"d":"0.0"}},{"$f":"R6/Formelhilfe!O2","v":{"v":920.82,"d":"920.8"}},{"$f":"SUM(K6:P6)","v":{"v":4604.1,"d":"4,604.1"}},{"$f":"T6/Formelhilfe!P2","v":{"v":922.4818181818181,"d":"922.5"}},{"$f":"SUM(C6:H6,K6:P6)","v":{"v":10147.3,"d":"10,147.3"}}]
[null,"Breddenberg IV",{"$f":"VLOOKUP($B$2:$B$7,'Wettkampf 1'!$B$2:$D$7,3,FALSE)","v":915.7},{"$f":"VLOOKUP($B$2:$B$7,'2'!$B$2:$D$7,3,FALSE)","v":919.3},{"$f":"VLOOKUP($B$2:$B$7,'3'!$B$2:$D$7,3,FALSE)","v":{"v":914,"d":"914.0"}},{"$f":"VLOOKUP($B$2:$B$7,'4'!$B$2:$D$7,3,FALSE)","v":917.9},{"$f":"VLOOKUP($B$2:$B$7,'5'!$B$2:$D$7,3,FALSE)","v":914.8},{"$f":"VLOOKUP($B$2:$B$7,'6'!$B$2:$D$7,3,FALSE)","v":921.5},{"$f":"J7/Formelhilfe!H6","v":{"v":917.1999999999999,"d":"917.2"}},{"$f":"SUM(C7:H7)","v":{"v":5503.2,"d":"5,503.2"}},{"$f":"VLOOKUP($B$2:$B$7,'7'!$B$2:$D$7,3,FALSE)","v":929.8},{"$f":"VLOOKUP($B$2:$B$7,'8'!$B$2:$D$7,3,FALSE)","v":922.2},{"$f":"VLOOKUP($B$2:$B$7,'9'!$B$2:$D$7,3,FALSE)","v":909.2},{"$f":"VLOOKUP($B$2:$B$7,'10'!$B$2:$D$7,3,FALSE)","v":{"v":927.8000000000001,"d":"927.8"}},{"$f":"VLOOKUP($B$2:$B$7,'11'!$B$2:$D$7,3,FALSE)","v":916.5},{"$f":"VLOOKUP($B$2:$B$7,'12'!$B$2:$D$7,3,FALSE)","v":{"v":0,"d":"0.0"}},{"$f":"R7/Formelhilfe!O6","v":921.1},{"$f":"SUM(K7:P7)","v":{"v":4605.5,"d":"4,605.5"}},{"$f":"T7/Formelhilfe!P6","v":{"v":918.9727272727272,"d":"919.0"}},{"$f":"SUM(C7:H7,K7:P7)","v":{"v":10108.699999999999,"d":"10,108.7"}}]