{"text_format":"3","workbook":"xlsx","n_sheets":18,"sheets":["Übersicht","Wettkampf 1","2","3","4","5","6","7","8","9","10","11","12","Ausdruck","Ausdruck blank","Übersicht Schützen","Formelhilfe","Übersicht Gruppen"],"not_rendered":{"images":2,"macros":1,"defined_names":12},"read":"whole","date_system":"1900"}

{"sheet":"Übersicht","index":0,"n_rows":54,"n_cols":22,"rows_kept":54,"merged":[[0,10,0,11],[0,12,0,14],[0,15,0,16],[2,9,2,10],[2,17,2,18],[2,19,2,20],[3,1,3,2],[3,21,5,21],[5,1,5,2],[6,1,6,2],[7,1,7,2],[8,1,8,2],[9,1,9,2],[10,1,10,2],[14,9,14,10],[14,17,14,18],[14,19,14,20],[14,21,16,21]]}
[{"$nulls":3},"Kreisrundenwettkampf",{"$nulls":5},"Saison","2024/2025",null,"2. Kreisklasse",null,null,"Schützen"]
[]
[null,null,"Wettkampftag:","25.08.","08.09.","22.09.","06.10.","20.10.","24.11.","Hinrunde",null,"19.01.","02.02.","16.02.","02.03.","16.03.","30.03.","Rückrunde",null,"Serie komplett"]
["Pos.","Verein / Gruppe",null,"Neuvrees","Rastdorf","Börger","Esterwegen","Börgerwald","Spahnharrenstätte","Schnitt","Gesamt ","Esterwegen",{"$f":"E4","v":"Rastdorf"},"Börger","Neuvrees","Börgerwald","Spahnharrenstätte","Schnitt","Gesamt ","Schnitt","Gesamt","Differenz"]
[]
[1,{"$f":"'Übersicht Gruppen'!B2","v":"Rastdorf III"},null,{"$f":"'Übersicht Gruppen'!C2","v":{"v":946,"d":"946.0"}},{"$f":"'Übersicht Gruppen'!D2","v":{"v":938.6999999999999,"d":"938.7"}},{"$f":"'Übersicht Gruppen'!E2","v":935.6},{"$f":"'Übersicht Gruppen'!F2","v":929.8},{"$f":"'Übersicht Gruppen'!G2","v":946.3},{"$f":"'Übersicht Gruppen'!H2","v":939.2},{"$f":"'Übersicht Gruppen'!I2","v":{"v":939.2666666666665,"d":"939.27"}},{"$f":"SUM(D6:I6)","v":{"v":5635.599999999999,"d":"5,635.6"}},{"$f":"'Übersicht Gruppen'!K2","v":936.4},{"$f":"'Übersicht Gruppen'!L2","v":934.4},{"$f":"'Übersicht Gruppen'!M2","v":{"v":936,"d":"936.0"}},{"$f":"'Übersicht Gruppen'!N2","v":923.3},{"$f":"'Übersicht Gruppen'!O2","v":945.9},{"$f":"'Übersicht Gruppen'!P2","v":935.5},{"$f":"'Übersicht Gruppen'!Q2","v":935.25},{"$f":"SUM(L6:Q6)","v":{"v":5611.5,"d":"5,611.5"}},{"$f":"'Übersicht Gruppen'!S2","v":{"v":937.2583333333331,"d":"937.26"}},{"$f":"SUM(S6+K6)","v":{"v":11247.099999999999,"d":"11,247.1"}}]
[2,{"$f":"'Übersicht Gruppen'!B3","v":"Esterwegen III"},null,{"$f":"'Übersicht Gruppen'!C3","v":933.3},{"$f":"'Übersicht Gruppen'!D3","v":{"v":936.6999999999999,"d":"936.7"}},{"$f":"'Übersicht Gruppen'!E3","v":935.7},{"$f":"'Übersicht Gruppen'!F3","v":938.6},{"$f":"'Übersicht Gruppen'!G3","v":{"v":941.6999999999999,"d":"941.7"}},{"$f":"'Übersicht Gruppen'!H3","v":936.1},{"$f":"'Übersicht Gruppen'!I3","v":{"v":937.0166666666668,"d":"937.02"}},{"v":5622.1,"d":"5,622.1"},{"$f":"'Übersicht Gruppen'!K3","v":{"v":937.0999999999999,"d":"937.1"}},{"$f":"'Übersicht Gruppen'!L3","v":934.1},{"$f":"'Übersicht Gruppen'!M3","v":{"v":932.5000000000001,"d":"932.5"}},{"$f":"'Übersicht Gruppen'!N3","v":{"v":938.9000000000001,"d":"938.9"}},{"$f":"'Übersicht Gruppen'!O3","v":939.4},{"$f":"'Übersicht Gruppen'!P3","v":{"v":941.9000000000001,"d":"941.9"}},{"$f":"'Übersicht Gruppen'!Q3","v":{"v":937.3166666666666,"d":"937.32"}},{"v":5623.9,"d":"5,623.9"},{"$f":"'Übersicht Gruppen'!S3","v":{"v":937.1666666666666,"d":"937.17"}},{"$f":"SUM(S7+K7)","v":{"v":11246,"d":"11,246.0"}},{"$f":"(U6-U7)*-1","v":{"v":-1.0999999999985448,"d":"-1.1"}}]
[3,{"$f":"'Übersicht Gruppen'!B4","v":"Spahnharrenstätte II"},null,{"$f":"'Übersicht Gruppen'!C4","v":928.7},{"$f":"'Übersicht Gruppen'!D4","v":934.5},{"$f":"'Übersicht Gruppen'!E4","v":{"v":931.5999999999999,"d":"931.6"}},{"$f":"'Übersicht Gruppen'!F4","v":935.7},{"$f":"'Übersicht Gruppen'!G4","v":{"v":940.9000000000001,"d":"940.9"}},{"$f":"'Übersicht Gruppen'!H4","v":{"v":937,"d":"937.0"}},{"$f":"'Übersicht Gruppen'!I4","v":{"v":934.7333333333332,"d":"934.73"}},{"v":5608.4,"d":"5,608.4"},{"$f":"'Übersicht Gruppen'!K4","v":931.1},{"$f":"'Übersicht Gruppen'!L4","v":934.4},{"$f":"'Übersicht Gruppen'!M4","v":915.8},{"$f":"'Übersicht Gruppen'!N4","v":924.5},{"$f":"'Übersicht Gruppen'!O4","v":933.6},{"$f":"'Übersicht Gruppen'!P4","v":931.4},{"$f":"'Übersicht Gruppen'!Q4","v":{"v":928.4666666666667,"d":"928.47"}},{"v":5570.8,"d":"5,570.8"},{"$f":"'Übersicht Gruppen'!S4","v":{"v":931.5999999999999,"d":"931.60"}},{"v":11179.2,"d":"11,179.2"},{"$f":"(U7-U8)*-1","v":{"v":-66.79999999999927,"d":"-66.8"}}]
[4,{"$f":"'Übersicht Gruppen'!B5","v":"Neuvrees I"},null,{"$f":"'Übersicht Gruppen'!C5","v":938.6},{"$f":"'Übersicht Gruppen'!D5","v":931.2},{"$f":"'Übersicht Gruppen'!E5","v":924.7},{"$f":"'Übersicht Gruppen'!F5","v":929.7},{"$f":"'Übersicht Gruppen'!G5","v":936.5},{"$f":"'Übersicht Gruppen'!H5","v":934.1},{"$f":"'Übersicht Gruppen'!I5","v":{"v":932.4666666666667,"d":"932.47"}},{"v":5594.8,"d":"5,594.8"},{"$f":"'Übersicht Gruppen'!K5","v":{"v":929.6000000000001,"d":"929.6"}},{"$f":"'Übersicht Gruppen'!L5","v":929.5},{"$f":"'Übersicht Gruppen'!M5","v":931.7},{"$f":"'Übersicht Gruppen'!N5","v":{"v":923.1999999999999,"d":"923.2"}},{"$f":"'Übersicht Gruppen'!O5","v":934.5},{"$f":"'Übersicht Gruppen'!P5","v":{"v":935,"d":"935.0"}},{"$f":"'Übersicht Gruppen'!Q5","v":{"v":930.5833333333334,"d":"930.58"}},{"v":5583.5,"d":"5,583.5"},{"$f":"'Übersicht Gruppen'!S5","v":{"v":931.5250000000001,"d":"931.53"}},{"v":11178.3,"d":"11,178.3"},{"v":-0.9000000000014552,"d":"-0.9"}]
[5,{"$f":"'Übersicht Gruppen'!B6","v":"Börgerwald II"},null,{"$f":"'Übersicht Gruppen'!C6","v":929.6},{"$f":"'Übersicht Gruppen'!D6","v":922.8},{"$f":"'Übersicht Gruppen'!E6","v":{"v":930.4000000000001,"d":"930.4"}},{"$f":"'Übersicht Gruppen'!F6","v":931.3},{"$f":"'Übersicht Gruppen'!G6","v":{"v":931.3000000000001,"d":"931.3"}},{"$f":"'Übersicht Gruppen'!H6","v":930.7},{"$f":"'Übersicht Gruppen'!I6","v":929.35},{"v":5576.1,"d":"5,576.1"},{"$f":"'Übersicht Gruppen'!K6","v":924.5},{"$f":"'Übersicht Gruppen'!L6","v":930.7},{"$f":"'Übersicht Gruppen'!M6","v":933.5},{"$f":"'Übersicht Gruppen'!N6","v":931.6},{"$f":"'Übersicht Gruppen'!O6","v":{"v":942.3000000000001,"d":"942.3"}},{"$f":"'Übersicht Gruppen'!P6","v":{"v":939.5999999999999,"d":"939.6"}},{"$f":"'Übersicht Gruppen'!Q6","v":{"v":933.6999999999998,"d":"933.70"}},{"v":5602.199999999999,"d":"5,602.2"},{"$f":"'Übersicht Gruppen'!S6","v":{"v":931.525,"d":"931.53"}},{"v":11178.3,"d":"11,178.3"},{"v":0,"d":"0.0"}]
[6,{"$f":"'Übersicht Gruppen'!B7","v":"Börger II"},null,{"$f":"'Übersicht Gruppen'!C7","v":935.7},{"$f":"'Übersicht Gruppen'!D7","v":916.1},{"$f":"'Übersicht Gruppen'!E7","v":923.6},{"$f":"'Übersicht Gruppen'!F7","v":923.5},{"$f":"'Übersicht Gruppen'!G7","v":934.2},{"$f":"'Übersicht Gruppen'!H7","v":{"v":923.1999999999999,"d":"923.2"}},{"$f":"'Übersicht Gruppen'!I7","v":{"v":926.0500000000001,"d":"926.05"}},{"v":5556.3,"d":"5,556.3"},{"$f":"'Übersicht Gruppen'!K7","v":918.7},{"$f":"'Übersicht Gruppen'!L7","v":{"v":928.1999999999999,"d":"928.2"}},{"$f":"'Übersicht Gruppen'!M7","v":{"v":928.9000000000001,"d":"928.9"}},{"$f":"'Übersicht Gruppen'!N7","v":{"v":916.5999999999999,"d":"916.6"}},{"$f":"'Übersicht Gruppen'!O7","v":{"v":935,"d":"935.0"}},{"$f":"'Übersicht Gruppen'!P7","v":930.7},{"$f":"'Übersicht Gruppen'!Q7","v":{"v":926.3499999999999,"d":"926.35"}},{"v":5558.099999999999,"d":"5,558.1"},{"$f":"'Übersicht Gruppen'!S7","v":{"v":926.2000000000002,"d":"926.20"}},{"v":11114.4,"d":"11,114.4"},{"v":-63.899999999999636,"d":"-63.9"}]
[]
[null,null,"Schnitt:",{"$f":"AVERAGE(D6:D11)","v":{"v":935.3166666666666,"d":"935.3"}},{"$f":"AVERAGE(E6:E11)","v":{"v":930,"d":"930.0"}},{"v":930.2666666666668,"d":"930.3"},{"v":931.4333333333334,"d":"931.4"},{"v":938.4833333333332,"d":"938.5"},{"v":933.3833333333333,"d":"933.4"},{"v":933.1472222222222,"d":"933.15"},{"$f":"SUM(K6:K11)/6","v":{"v":5598.883333333334,"d":"5,598.9"}},{"v":929.5666666666666,"d":"929.6"},{"v":931.8833333333333,"d":"931.9"},{"v":929.7333333333332,"d":"929.7"},{"v":926.35,"d":"926.4"},{"v":938.4499999999999,"d":"938.5"},{"v":935.6833333333333,"d":"935.7"},{"v":931.9444444444443,"d":"931.94"},{"v":5591.666666666667,"d":"5591.7"},{"v":932.5458333333332,"d":"932.55"},{"v":11190.550000000001,"d":"11,190.6"}]
[]
[{"$nulls":9},"Hinrunde",{"$nulls":7},"Rückrunde",null,"Serie komplett",null,"Differenz"]
["Pos.","Vorname Name","Verein / Gruppe",{"$nulls":6},"Schnitt","Gesamt",{"$nulls":6},"Schnitt","Gesamt","Schnitt","Gesamt"]
[1,{"$f":"'Übersicht Schützen'!A2","v":"Meibers Michael"},{"$f":"'Übersicht Schützen'!B2","v":"Esterwegen III"},{"$f":"'Übersicht Schützen'!C2","v":310.3},{"$f":"'Übersicht Schützen'!D2","v":{"v":315,"d":"315.0"}},{"$f":"'Übersicht Schützen'!E2","v":315.8},{"$f":"'Übersicht Schützen'!F2","v":312.1},{"$f":"'Übersicht Schützen'!G2","v":316.4},{"$f":"'Übersicht Schützen'!H2","v":313.3},{"$f":"'Übersicht Schützen'!I2","v":{"v":313.81666666666666,"d":"313.82"}},{"$f":"SUM(D17:I17)","v":{"v":1882.8999999999999,"d":"1,882.9"}},{"$f":"'Übersicht Schützen'!L2","v":317.9},{"$f":"'Übersicht Schützen'!M2","v":314.6},{"$f":"'Übersicht Schützen'!N2","v":317.6},{"$f":"'Übersicht Schützen'!O2","v":315.6},{"$f":"'Übersicht Schützen'!P2","v":{"v":315,"d":"315.0"}},{"$f":"'Übersicht Schützen'!Q2","v":315.8},{"$f":"'Übersicht Schützen'!R2","v":{"v":316.0833333333333,"d":"316.08"}},{"$f":"SUM(L17:Q17)","v":{"v":1896.5,"d":"1,896.5"}},{"$f":"'Übersicht Schützen'!U2","v":314.95},{"$f":"SUM(K17+S17)","v":{"v":3779.3999999999996,"d":"3,779.4"}}]
[2,{"$f":"'Übersicht Schützen'!A3","v":"Zdralik Ingo"},{"$f":"'Übersicht Schützen'!B3","v":"Börger II"},{"$f":"'Übersicht Schützen'!C3","v":315.8},{"$f":"'Übersicht Schützen'!D3","v":311.1},{"$f":"'Übersicht Schützen'!E3","v":310.9},{"$f":"'Übersicht Schützen'!F3","v":313.7},{"$f":"'Übersicht Schützen'!G3","v":318.8},{"$f":"'Übersicht Schützen'!H3","v":305.4},{"$f":"'Übersicht Schützen'!I3","v":{"v":312.6166666666666,"d":"312.62"}},{"$f":"SUM(D18:I18)","v":{"v":1875.6999999999998,"d":"1,875.7"}},{"$f":"'Übersicht Schützen'!L3","v":{"v":314,"d":"314.0"}},{"$f":"'Übersicht Schützen'!M3","v":315.4},{"$f":"'Übersicht Schützen'!N3","v":312.8},{"$f":"'Übersicht Schützen'!O3","v":314.5},{"$f":"'Übersicht Schützen'!P3","v":315.7},{"$f":"'Übersicht Schützen'!Q3","v":315.8},{"$f":"'Übersicht Schützen'!R3","v":{"v":314.7,"d":"314.70"}},{"$f":"SUM(L18:Q18)","v":{"v":1888.2,"d":"1,888.2"}},{"$f":"'Übersicht Schützen'!U3","v":{"v":313.65833333333336,"d":"313.66"}},{"$f":"SUM(K18+S18)","v":{"v":3763.8999999999996,"d":"3,763.9"}},{"$f":"(U17-U18)*-1","v":-15.5}]
[3,{"$f":"'Übersicht Schützen'!A4","v":"Bookjans Günther"},{"$f":"'Übersicht Schützen'!B4","v":"Rastdorf III"},{"$f":"'Übersicht Schützen'!C4","v":311.7},{"$f":"'Übersicht Schützen'!D4","v":315.8},{"$f":"'Übersicht Schützen'!E4","v":311.5},{"$f":"'Übersicht Schützen'!F4","v":{"v":308,"d":"308.0"}},{"$f":"'Übersicht Schützen'!G4","v":316.7},{"$f":"'Übersicht Schützen'!H4","v":314.1},{"$f":"'Übersicht Schützen'!I4","v":{"v":312.9666666666667,"d":"312.97"}},{"$f":"SUM(D19:I19)","v":{"v":1877.8000000000002,"d":"1,877.8"}},{"$f":"'Übersicht Schützen'!L4","v":314.2},{"$f":"'Übersicht Schützen'!M4","v":313.4},{"$f":"'Übersicht Schützen'!N4","v":309.2},{"$f":"'Übersicht Schützen'!O4","v":311.7},{"$f":"'Übersicht Schützen'!P4","v":318.4},{"$f":"'Übersicht Schützen'!Q4","v":309.5},{"$f":"'Übersicht Schützen'!R4","v":{"v":312.73333333333335,"d":"312.73"}},{"v":1876.4,"d":"1,876.4"},{"$f":"'Übersicht Schützen'!U4","v":{"v":312.84999999999997,"d":"312.85"}},{"v":3754.2000000000003,"d":"3,754.2"},{"$f":"(U18-U19)*-1","v":{"v":-9.699999999999363,"d":"-9.7"}}]
[4,{"$f":"'Übersicht Schützen'!A5","v":"Wotte Robert"},{"$f":"'Übersicht Schützen'!B5","v":"Rastdorf III"},{"$f":"'Übersicht Schützen'!C5","v":{"v":317.59999999999997,"d":"317.6"}},{"$f":"'Übersicht Schützen'!D5","v":309.4},{"$f":"'Übersicht Schützen'!E5","v":313.7},{"$f":"'Übersicht Schützen'!F5","v":308.4},{"$f":"'Übersicht Schützen'!G5","v":315.3},{"$f":"'Übersicht Schützen'!H5","v":313.1},{"$f":"'Übersicht Schützen'!I5","v":{"v":312.9166666666667,"d":"312.92"}},{"v":1877.5,"d":"1,877.5"},{"$f":"'Übersicht Schützen'!L5","v":311.7},{"$f":"'Übersicht Schützen'!M5","v":310.9},{"$f":"'Übersicht Schützen'!N5","v":314.4},{"$f":"'Übersicht Schützen'!O5","v":308.4},{"$f":"'Übersicht Schützen'!P5","v":{"v":315,"d":"315.0"}},{"$f":"'Übersicht Schützen'!Q5","v":312.3},{"$f":"'Übersicht Schützen'!R5","v":{"v":312.1166666666666,"d":"312.12"}},{"v":1872.6999999999998,"d":"1,872.7"},{"$f":"'Übersicht Schützen'!U5","v":{"v":312.5166666666667,"d":"312.52"}},{"v":3750.2,"d":"3,750.2"},{"v":-4.000000000000455,"d":"-4.0"}]
[5,{"$f":"'Übersicht Schützen'!A6","v":"Janßen Markus"},{"$f":"'Übersicht Schützen'!B6","v":"Neuvrees I"},{"$f":"'Übersicht Schützen'!C6","v":{"v":314,"d":"314.0"}},{"$f":"'Übersicht Schützen'!D6","v":311.8},{"$f":"'Übersicht Schützen'!E6","v":310.5},{"$f":"'Übersicht Schützen'!F6","v":313.2},{"$f":"'Übersicht Schützen'!G6","v":315.6},{"$f":"'Übersicht Schützen'!H6","v":309.6},{"$f":"'Übersicht Schützen'!I6","v":312.45},{"v":1874.6999999999998,"d":"1,874.7"},{"$f":"'Übersicht Schützen'!L6","v":312.3},{"$f":"'Übersicht Schützen'!M6","v":310.8},{"$f":"'Übersicht Schützen'!N6","v":312.1},{"$f":"'Übersicht Schützen'!O6","v":305.4},{"$f":"'Übersicht Schützen'!P6","v":314.2},{"$f":"'Übersicht Schützen'!Q6","v":313.9},{"$f":"'Übersicht Schützen'!R6","v":311.45},{"v":1868.6999999999998,"d":"1,868.7"},{"$f":"'Übersicht Schützen'!U6","v":311.95},{"v":3743.3999999999996,"d":"3,743.4"},{"v":-6.800000000000182,"d":"-6.8"}]
[6,{"$f":"'Übersicht Schützen'!A7","v":"Middendorf Peter"},{"$f":"'Übersicht Schützen'!B7","v":"Esterwegen III"},{"$f":"'Übersicht Schützen'!C7","v":312.2},{"$f":"'Übersicht Schützen'!D7","v":311.3},{"$f":"'Übersicht Schützen'!E7","v":303.2},{"$f":"'Übersicht Schützen'!F7","v":313.8},{"$f":"'Übersicht Schützen'!G7","v":313.4},{"$f":"'Übersicht Schützen'!H7","v":314.3},{"$f":"'Übersicht Schützen'!I7","v":{"v":311.3666666666667,"d":"311.37"}},{"v":1868.2,"d":"1,868.2"},{"$f":"'Übersicht Schützen'!L7","v":{"v":313,"d":"313.0"}},{"$f":"'Übersicht Schützen'!M7","v":310.9},{"$f":"'Übersicht Schützen'!N7","v":306.6},{"$f":"'Übersicht Schützen'!O7","v":315.5},{"$f":"'Übersicht Schützen'!P7","v":311.9},{"$f":"'Übersicht Schützen'!Q7","v":316.1},{"$f":"'Übersicht Schützen'!R7","v":{"v":312.3333333333333,"d":"312.33"}},{"v":1874,"d":"1,874.0"},{"$f":"'Übersicht Schützen'!U7","v":{"v":311.84999999999997,"d":"311.85"}},{"v":3742.2,"d":"3,742.2"},{"v":-1.199999999999818,"d":"-1.2"}]
[7,{"$f":"'Übersicht Schützen'!A8","v":"Breyer Wilfried"},{"$f":"'Übersicht Schützen'!B8","v":"Neuvrees I"},{"$f":"'Übersicht Schützen'!C8","v":{"v":312,"d":"312.0"}},{"$f":"'Übersicht Schützen'!D8","v":312.4},{"$f":"'Übersicht Schützen'!E8","v":308.5},{"$f":"'Übersicht Schützen'!F8","v":311.3},{"$f":"'Übersicht Schützen'!G8","v":312.1},{"$f":"'Übersicht Schützen'!H8","v":312.9},{"$f":"'Übersicht Schützen'!I8","v":{"v":311.53333333333336,"d":"311.53"}},{"v":1869.2000000000003,"d":"1,869.2"},{"$f":"'Übersicht Schützen'!L8","v":310.1},{"$f":"'Übersicht Schützen'!M8","v":308.4},{"$f":"'Übersicht Schützen'!N8","v":{"v":313,"d":"313.0"}},{"$f":"'Übersicht Schützen'!O8","v":{"v":310,"d":"310.0"}},{"$f":"'Übersicht Schützen'!P8","v":310.6},{"$f":"'Übersicht Schützen'!Q8","v":311.5},{"$f":"'Übersicht Schützen'!R8","v":{"v":310.59999999999997,"d":"310.60"}},{"v":1863.6,"d":"1,863.6"},{"$f":"'Übersicht Schützen'!U8","v":{"v":311.06666666666666,"d":"311.07"}},{"v":3732.8,"d":"3,732.8"},{"v":-9.399999999999636,"d":"-9.4"}]
[8,{"$f":"'Übersicht Schützen'!A9","v":"Micksch Heiko"},{"$f":"'Übersicht Schützen'!B9","v":"Spahnharrenstätte II"},{"$f":"'Übersicht Schützen'!C9","v":310.6},{"$f":"'Übersicht Schützen'!D9","v":308.4},{"$f":"'Übersicht Schützen'!E9","v":308.7},{"$f":"'Übersicht Schützen'!F9","v":312.8},{"$f":"'Übersicht Schützen'!G9","v":314.8},{"$f":"'Übersicht Schützen'!H9","v":312.6},{"$f":"'Übersicht Schützen'!I9","v":{"v":311.31666666666666,"d":"311.32"}},{"v":1867.9,"d":"1,867.9"},{"$f":"'Übersicht Schützen'!L9","v":{"v":312,"d":"312.0"}},{"$f":"'Übersicht Schützen'!M9","v":{"v":311,"d":"311.0"}},{"$f":"'Übersicht Schützen'!N9","v":307.3},{"$f":"'Übersicht Schützen'!O9","v":309.1},{"$f":"'Übersicht Schützen'!P9","v":314.2},{"$f":"'Übersicht Schützen'!Q9","v":310.8},{"$f":"'Übersicht Schützen'!R9","v":{"v":310.73333333333335,"d":"310.73"}},{"v":1864.4,"d":"1,864.4"},{"$f":"'Übersicht Schützen'!U9","v":{"v":311.02500000000003,"d":"311.03"}},{"v":3732.3,"d":"3,732.3"},-0.5]
[9,{"$f":"'Übersicht Schützen'!A10","v":"Hanenkamp Andre"},{"$f":"'Übersicht Schützen'!B10","v":"Börgerwald II"},{"$f":"'Übersicht Schützen'!C10","v":313.3},{"$f":"'Übersicht Schützen'!D10","v":304.4},{"$f":"'Übersicht Schützen'!E10","v":311.3},{"$f":"'Übersicht Schützen'!F10","v":{"v":313,"d":"313.0"}},{"$f":"'Übersicht Schützen'!G10","v":310.9},{"$f":"'Übersicht Schützen'!H10","v":313.1},{"$f":"'Übersicht Schützen'!I10","v":{"v":311,"d":"311.00"}},{"v":1866,"d":"1,866.0"},{"$f":"'Übersicht Schützen'!L10","v":309.3},{"$f":"'Übersicht Schützen'!M10","v":310.2},{"$f":"'Übersicht Schützen'!N10","v":311.9},{"$f":"'Übersicht Schützen'!O10","v":312.2},{"$f":"'Übersicht Schützen'!P10","v":312.6},{"$f":"'Übersicht Schützen'!Q10","v":308.9},{"$f":"'Übersicht Schützen'!R10","v":{"v":310.84999999999997,"d":"310.85"}},{"v":1865.1,"d":"1,865.1"},{"$f":"'Übersicht Schützen'!U10","v":{"v":310.925,"d":"310.93"}},{"v":3731.1,"d":"3,731.1"},{"v":-1.2000000000002728,"d":"-1.2"}]
[10,{"$f":"'Übersicht Schützen'!A11","v":"Meer Michael"},{"$f":"'Übersicht Schützen'!B11","v":"Rastdorf III"},{"$f":"'Übersicht Schützen'!C11","v":312.6},{"$f":"'Übersicht Schützen'!D11","v":313.5},{"$f":"'Übersicht Schützen'!E11","v":310.4},{"$f":"'Übersicht Schützen'!F11","v":313.4},{"$f":"'Übersicht Schützen'!G11","v":314.3},{"$f":"'Übersicht Schützen'!H11","v":311.8},{"$f":"'Übersicht Schützen'!I11","v":{"v":312.6666666666667,"d":"312.67"}},{"v":1876,"d":"1,876.0"},{"$f":"'Übersicht Schützen'!L11","v":310.5},{"$f":"'Übersicht Schützen'!M11","v":304.9},{"$f":"'Übersicht Schützen'!N11","v":305.6},{"$f":"'Übersicht Schützen'!O11","v":303.2},{"$f":"'Übersicht Schützen'!P11","v":312.5},{"$f":"'Übersicht Schützen'!Q11","v":313.7},{"$f":"'Übersicht Schützen'!R11","v":{"v":308.40000000000003,"d":"308.40"}},{"v":1850.4,"d":"1,850.4"},{"$f":"'Übersicht Schützen'!U11","v":{"v":310.5333333333333,"d":"310.53"}},{"v":3726.4,"d":"3,726.4"},{"v":-4.699999999999818,"d":"-4.7"}]
[11,{"$f":"'Übersicht Schützen'!A12","v":"Schröer Friedhelm"},{"$f":"'Übersicht Schützen'!B12","v":"Börgerwald II"},{"$f":"'Übersicht Schützen'!C12","v":306.3},{"$f":"'Übersicht Schützen'!D12","v":309.3},{"$f":"'Übersicht Schützen'!E12","v":307.8},{"$f":"'Übersicht Schützen'!F12","v":310.5},{"$f":"'Übersicht Schützen'!G12","v":311.3},{"$f":"'Übersicht Schützen'!H12","v":311.1},{"$f":"'Übersicht Schützen'!I12","v":{"v":309.3833333333334,"d":"309.38"}},{"v":1856.3000000000002,"d":"1,856.3"},{"$f":"'Übersicht Schützen'!L12","v":306.4},{"$f":"'Übersicht Schützen'!M12","v":310.5},{"$f":"'Übersicht Schützen'!N12","v":{"v":312,"d":"312.0"}},{"$f":"'Übersicht Schützen'!O12","v":311.3},{"$f":"'Übersicht Schützen'!P12","v":{"v":312,"d":"312.0"}},{"$f":"'Übersicht Schützen'!Q12","v":315.7},{"$f":"'Übersicht Schützen'!R12","v":{"v":311.31666666666666,"d":"311.32"}},{"v":1867.9,"d":"1,867.9"},{"$f":"'Übersicht Schützen'!U12","v":310.35},{"v":3724.2000000000003,"d":"3,724.2"},{"v":-2.199999999999818,"d":"-2.2"}]
[12,{"$f":"'Übersicht Schützen'!A13","v":"Will Achim"},{"$f":"'Übersicht Schützen'!B13","v":"Spahnharrenstätte II"},{"$f":"'Übersicht Schützen'!C13","v":{"v":307,"d":"307.0"}},{"$f":"'Übersicht Schützen'!D13","v":313.5},{"$f":"'Übersicht Schützen'!E13","v":309.9},{"$f":"'Übersicht Schützen'!F13","v":{"v":310,"d":"310.0"}},{"$f":"'Übersicht Schützen'!G13","v":{"v":312,"d":"312.0"}},{"$f":"'Übersicht Schützen'!H13","v":313.7},{"$f":"'Übersicht Schützen'!I13","v":{"v":311.0166666666667,"d":"311.02"}},{"v":1866.1000000000001,"d":"1,866.1"},{"$f":"'Übersicht Schützen'!L13","v":308.6},{"$f":"'Übersicht Schützen'!M13","v":309.4},{"$f":"'Übersicht Schützen'!N13","v":310.3},{"$f":"'Übersicht Schützen'!O13","v":305.9},{"$f":"'Übersicht Schützen'!P13","v":308.1},{"$f":"'Übersicht Schützen'!Q13","v":312.7},{"$f":"'Übersicht Schützen'!R13","v":{"v":309.16666666666663,"d":"309.17"}},{"v":1854.9999999999998,"d":"1,855.0"},{"$f":"'Übersicht Schützen'!U13","v":{"v":310.0916666666667,"d":"310.09"}},{"v":3721.1,"d":"3,721.1"},{"v":-3.100000000000364,"d":"-3.1"}]
[13,{"$f":"'Übersicht Schützen'!A14","v":"Schulte Mathias"},{"$f":"'Übersicht Schützen'!B14","v":"Esterwegen III"},{"$f":"'Übersicht Schützen'!C14","v":{"v":310.79999999999995,"d":"310.8"}},{"$f":"'Übersicht Schützen'!D14","v":308.4},{"$f":"'Übersicht Schützen'!E14","v":310.6},{"$f":"'Übersicht Schützen'!F14","v":312.7},{"$f":"'Übersicht Schützen'!G14","v":311.9},{"$f":"'Übersicht Schützen'!H14","v":308.5},{"$f":"'Übersicht Schützen'!I14","v":{"v":310.48333333333335,"d":"310.48"}},{"v":1862.9,"d":"1,862.9"},{"$f":"'Übersicht Schützen'!L14","v":306.2},{"$f":"'Übersicht Schützen'!M14","v":308.6},{"$f":"'Übersicht Schützen'!N14","v":308.3},{"$f":"'Übersicht Schützen'!O14","v":307.8},{"$f":"'Übersicht Schützen'!P14","v":312.5},{"$f":"'Übersicht Schützen'!Q14","v":{"v":310,"d":"310.0"}},{"$f":"'Übersicht Schützen'!R14","v":{"v":308.9,"d":"308.90"}},{"v":1853.3999999999999,"d":"1,853.4"},{"$f":"'Übersicht Schützen'!U14","v":{"v":309.69166666666666,"d":"309.69"}},{"v":3716.3,"d":"3,716.3"},{"v":-4.799999999999727,"d":"-4.8"}]
[14,{"$f":"'Übersicht Schützen'!A15","v":"Müller Helmut"},{"$f":"'Übersicht Schützen'!B15","v":"Rastdorf III"},{"$f":"'Übersicht Schützen'!C15","v":315.8},{"$f":"'Übersicht Schützen'!D15","v":{"v":309,"d":"309.0"}},{"$f":"'Übersicht Schützen'!E15","v":309.8},{"$f":"'Übersicht Schützen'!F15","v":306.9},{"$f":"'Übersicht Schützen'!G15","v":308.3},{"$f":"'Übersicht Schützen'!H15","v":{"v":312,"d":"312.0"}},{"$f":"'Übersicht Schützen'!I15","v":{"v":310.3,"d":"310.30"}},{"v":1861.8,"d":"1,861.8"},{"$f":"'Übersicht Schützen'!L15","v":310.1},{"$f":"'Übersicht Schützen'!M15","v":310.1},{"$f":"'Übersicht Schützen'!N15","v":312.4},{"$f":"'Übersicht Schützen'!O15","v":302.8},{"$f":"'Übersicht Schützen'!P15","v":310.2},{"$f":"'Übersicht Schützen'!Q15","v":308.3},{"$f":"'Übersicht Schützen'!R15","v":{"v":308.98333333333335,"d":"308.98"}},{"v":1853.9,"d":"1,853.9"},{"$f":"'Übersicht Schützen'!U15","v":{"v":309.6416666666667,"d":"309.64"}},{"v":3715.7,"d":"3,715.7"},{"v":-0.6000000000003638,"d":"-0.6"}]
[15,{"$f":"'Übersicht Schützen'!A16","v":"Antons Mathias"},{"$f":"'Übersicht Schützen'!B16","v":"Börgerwald II"},{"$f":"'Übersicht Schützen'!C16","v":308.9},{"$f":"'Übersicht Schützen'!D16","v":{"v":309,"d":"309.0"}},{"$f":"'Übersicht Schützen'!E16","v":308.3},{"$f":"'Übersicht Schützen'!F16","v":303.3},{"$f":"'Übersicht Schützen'!G16","v":309.1},{"$f":"'Übersicht Schützen'!H16","v":306.5},{"$f":"'Übersicht Schützen'!I16","v":{"v":307.51666666666665,"d":"307.52"}},{"v":1845.1,"d":"1,845.1"},{"$f":"'Übersicht Schützen'!L16","v":308.8},{"$f":"'Übersicht Schützen'!M16","v":{"v":310,"d":"310.0"}},{"$f":"'Übersicht Schützen'!N16","v":309.6},{"$f":"'Übersicht Schützen'!O16","v":306.2},{"$f":"'Übersicht Schützen'!P16","v":313.6},{"$f":"'Übersicht Schützen'!Q16","v":312.1},{"$f":"'Übersicht Schützen'!R16","v":{"v":310.04999999999995,"d":"310.05"}},{"v":1860.2999999999997,"d":"1,860.3"},{"$f":"'Übersicht Schützen'!U16","v":{"v":308.7833333333333,"d":"308.78"}},{"v":3705.3999999999996,"d":"3,705.4"},{"v":-10.300000000000182,"d":"-10.3"}]
[16,{"$f":"'Übersicht Schützen'!A17","v":"Hanneken Moritz"},{"$f":"'Übersicht Schützen'!B17","v":"Börgerwald II"},{"$f":"'Übersicht Schützen'!C17","v":307.4},{"$f":"'Übersicht Schützen'!D17","v":304.1},{"$f":"'Übersicht Schützen'!E17","v":310.8},{"$f":"'Übersicht Schützen'!F17","v":307.8},{"$f":"'Übersicht Schützen'!G17","v":306.8},{"$f":"'Übersicht Schützen'!H17","v":305.6},{"$f":"'Übersicht Schützen'!I17","v":{"v":307.0833333333333,"d":"307.08"}},{"v":1842.5,"d":"1,842.5"},{"$f":"'Übersicht Schützen'!L17","v":306.4},{"$f":"'Übersicht Schützen'!M17","v":309.2},{"$f":"'Übersicht Schützen'!N17","v":307.3},{"$f":"'Übersicht Schützen'!O17","v":308.1},{"$f":"'Übersicht Schützen'!P17","v":316.1},{"$f":"'Übersicht Schützen'!Q17","v":311.8},{"$f":"'Übersicht Schützen'!R17","v":{"v":309.81666666666666,"d":"309.82"}},{"v":1858.8999999999999,"d":"1,858.9"},{"$f":"'Übersicht Schützen'!U17","v":308.45},{"v":3701.3999999999996,"d":"3,701.4"},{"v":-4,"d":"-4.0"}]
[17,{"$f":"'Übersicht Schützen'!A18","v":"Steenken Klaus"},{"$f":"'Übersicht Schützen'!B18","v":"Neuvrees I"},{"$f":"'Übersicht Schützen'!C18","v":304.2},{"$f":"'Übersicht Schützen'!D18","v":{"v":307,"d":"307.0"}},{"$f":"'Übersicht Schützen'!E18","v":305.7},{"$f":"'Übersicht Schützen'!F18","v":305.2},{"$f":"'Übersicht Schützen'!G18","v":308.1},{"$f":"'Übersicht Schützen'!H18","v":309.2},{"$f":"'Übersicht Schützen'!I18","v":{"v":306.5666666666667,"d":"306.57"}},{"v":1839.4000000000003,"d":"1,839.4"},{"$f":"'Übersicht Schützen'!L18","v":307.2},{"$f":"'Übersicht Schützen'!M18","v":310.3},{"$f":"'Übersicht Schützen'!N18","v":306.6},{"$f":"'Übersicht Schützen'!O18","v":{"v":305,"d":"305.0"}},{"$f":"'Übersicht Schützen'!P18","v":309.7},{"$f":"'Übersicht Schützen'!Q18","v":309.6},{"$f":"'Übersicht Schützen'!R18","v":{"v":308.06666666666666,"d":"308.07"}},{"v":1848.4,"d":"1,848.4"},{"$f":"'Übersicht Schützen'!U18","v":{"v":307.31666666666666,"d":"307.32"}},{"v":3687.8,"d":"3,687.8"},{"v":-13.599999999999454,"d":"-13.6"}]
[18,{"$f":"'Übersicht Schützen'!A19","v":"Goldenstein Uwe"},{"$f":"'Übersicht Schützen'!B19","v":"Börger II"},{"$f":"'Übersicht Schützen'!C19","v":307.4},{"$f":"'Übersicht Schützen'!D19","v":304.8},{"$f":"'Übersicht Schützen'!E19","v":304.1},{"$f":"'Übersicht Schützen'!F19","v":304.8},{"$f":"'Übersicht Schützen'!G19","v":307.9},{"$f":"'Übersicht Schützen'!H19","v":308.7},{"$f":"'Übersicht Schützen'!I19","v":{"v":306.28333333333336,"d":"306.28"}},{"v":1837.7,"d":"1,837.7"},{"$f":"'Übersicht Schützen'!L19","v":305.1},{"$f":"'Übersicht Schützen'!M19","v":304.6},{"$f":"'Übersicht Schützen'!N19","v":301.7},{"$f":"'Übersicht Schützen'!O19","v":302.3},{"$f":"'Übersicht Schützen'!P19","v":308.8},{"$f":"'Übersicht Schützen'!Q19","v":305.3},{"$f":"'Übersicht Schützen'!R19","v":{"v":304.6333333333333,"d":"304.63"}},{"v":1827.8,"d":"1,827.8"},{"$f":"'Übersicht Schützen'!U19","v":{"v":305.45833333333337,"d":"305.46"}},{"v":3665.5,"d":"3,665.5"},{"v":-22.300000000000182,"d":"-22.3"}]
[19,{"$f":"'Übersicht Schützen'!A20","v":"Rolfes Wilhelm"},{"$f":"'Übersicht Schützen'!B20","v":"Neuvrees I"},{"$f":"'Übersicht Schützen'!C20","v":312.6},{"$f":"'Übersicht Schützen'!D20","v":304.2},{"$f":"'Übersicht Schützen'!E20","v":293.4},{"$f":"'Übersicht Schützen'!F20","v":301.6},{"$f":"'Übersicht Schützen'!G20","v":308.8},{"$f":"'Übersicht Schützen'!H20","v":311.6},{"$f":"'Übersicht Schützen'!I20","v":{"v":305.3666666666666,"d":"305.37"}},{"v":1832.1999999999998,"d":"1,832.2"},{"$f":"'Übersicht Schützen'!L20","v":305.8},{"$f":"'Übersicht Schützen'!M20","v":295.8},{"$f":"'Übersicht Schützen'!N20","v":306.3},{"$f":"'Übersicht Schützen'!O20","v":303.3},{"$f":"'Übersicht Schützen'!P20","v":307.1},{"$f":"'Übersicht Schützen'!Q20","v":311.7},{"$f":"'Übersicht Schützen'!R20","v":{"v":305.00000000000006,"d":"305.00"}},{"v":1830.0000000000002,"d":"1,830.0"},{"$f":"'Übersicht Schützen'!U20","v":{"v":305.18333333333334,"d":"305.18"}},{"v":3662.2,"d":"3,662.2"},{"v":-3.300000000000182,"d":"-3.3"}]
[20,{"$f":"'Übersicht Schützen'!A21","v":"Jungsthoefel Markus"},{"$f":"'Übersicht Schützen'!B21","v":"Börger II"},{"$f":"'Übersicht Schützen'!C21","v":308.3},{"$f":"'Übersicht Schützen'!D21","v":303.5},{"$f":"'Übersicht Schützen'!E21","v":305.4},{"$f":"'Übersicht Schützen'!F21","v":306.1},{"$f":"'Übersicht Schützen'!G21","v":307.5},{"$f":"'Übersicht Schützen'!H21","v":309.1},{"$f":"'Übersicht Schützen'!I21","v":{"v":306.65000000000003,"d":"306.65"}},{"v":1839.9,"d":"1,839.9"},{"$f":"'Übersicht Schützen'!L21","v":299.6},{"$f":"'Übersicht Schützen'!M21","v":307.9},{"$f":"'Übersicht Schützen'!N21","v":308.6},{"$f":"'Übersicht Schützen'!O21","v":287.8},{"$f":"'Übersicht Schützen'!P21","v":301.6},{"$f":"'Übersicht Schützen'!Q21","v":309.1},{"$f":"'Übersicht Schützen'!R21","v":{"v":302.43333333333334,"d":"302.43"}},{"v":1814.6,"d":"1,814.6"},{"$f":"'Übersicht Schützen'!U21","v":{"v":304.5416666666667,"d":"304.54"}},{"v":3654.5,"d":"3,654.5"},{"v":-7.699999999999818,"d":"-7.7"}]
[21,{"$f":"'Übersicht Schützen'!A22","v":"Thyen Werner"},{"$f":"'Übersicht Schützen'!B22","v":"Neuvrees I"},{"$f":"'Übersicht Schützen'!C22","v":304.5},{"$f":"'Übersicht Schützen'!D22","v":295.7},{"$f":"'Übersicht Schützen'!E22","v":302.9},{"$f":"'Übersicht Schützen'!F22","v":304.7},{"$f":"'Übersicht Schützen'!G22","v":{"v":303,"d":"303.0"}},{"$f":"'Übersicht Schützen'!H22","v":303.3},{"$f":"'Übersicht Schützen'!I22","v":{"v":302.34999999999997,"d":"302.35"}},{"v":1814.1,"d":"1,814.1"},{"$f":"'Übersicht Schützen'!L22","v":302.3},{"$f":"'Übersicht Schützen'!M22","v":306.1},{"$f":"'Übersicht Schützen'!N22","v":301.5},{"$f":"'Übersicht Schützen'!O22","v":307.8},{"$f":"'Übersicht Schützen'!P22","v":{"v":309,"d":"309.0"}},{"$f":"'Übersicht Schützen'!Q22","v":308.8},{"$f":"'Übersicht Schützen'!R22","v":{"v":305.9166666666667,"d":"305.92"}},{"v":1835.5,"d":"1,835.5"},{"$f":"'Übersicht Schützen'!U22","v":{"v":304.1333333333334,"d":"304.13"}},{"v":3649.6,"d":"3,649.6"},{"v":-4.900000000000091,"d":"-4.9"}]
[22,{"$f":"'Übersicht Schützen'!A23","v":"Sebers Tobias"},{"$f":"'Übersicht Schützen'!B23","v":"Börgerwald II"},{"$f":"'Übersicht Schützen'!C23","v":305.8},{"$f":"'Übersicht Schützen'!D23","v":304.5},{"$f":"'Übersicht Schützen'!E23","v":300.3},{"$f":"'Übersicht Schützen'!F23","v":307.7},{"$f":"'Übersicht Schützen'!G23","v":302.3},{"$f":"'Übersicht Schützen'!H23","v":304.3},{"$f":"'Übersicht Schützen'!I23","v":304.15},{"v":1824.8999999999999,"d":"1,824.9"},{"$f":"'Übersicht Schützen'!L23","v":{"v":297,"d":"297.0"}},{"$f":"'Übersicht Schützen'!M23","v":301.2},{"$f":"'Übersicht Schützen'!N23","v":302.5},{"$f":"'Übersicht Schützen'!O23","v":298.7},{"$f":"'Übersicht Schützen'!P23","v":301.7},{"$f":"'Übersicht Schützen'!Q23","v":305.1},{"$f":"'Übersicht Schützen'!R23","v":{"v":301.03333333333336,"d":"301.03"}},{"v":1806.2000000000003,"d":"1,806.2"},{"$f":"'Übersicht Schützen'!U23","v":{"v":302.5916666666666,"d":"302.59"}},{"v":3631.1000000000004,"d":"3,631.1"},{"v":-18.499999999999545,"d":"-18.5"}]
[23,{"$f":"'Übersicht Schützen'!A24","v":"Meyer Dirk"},{"$f":"'Übersicht Schützen'!B24","v":"Spahnharrenstätte II"},{"$f":"'Übersicht Schützen'!C24","v":311.1},{"$f":"'Übersicht Schützen'!D24","v":312.6},{"$f":"'Übersicht Schützen'!E24","v":{"v":313,"d":"313.0"}},{"$f":"'Übersicht Schützen'!F24","v":312.9},{"$f":"'Übersicht Schützen'!G24","v":314.1},{"$f":"'Übersicht Schützen'!H24","v":310.7},{"$f":"'Übersicht Schützen'!I24","v":{"v":312.4,"d":"312.40"}},{"v":1874.3999999999999,"d":"1,874.4"},{"$f":"'Übersicht Schützen'!L24","v":310.5},{"$f":"'Übersicht Schützen'!M24","v":{"v":314,"d":"314.0"}},{"$f":"'Übersicht Schützen'!N24","v":{"v":0,"d":"0.0"}},{"$f":"'Übersicht Schützen'!O24","v":309.5},{"$f":"'Übersicht Schützen'!P24","v":311.3},{"$f":"'Übersicht Schützen'!Q24","v":307.9},{"$f":"'Übersicht Schützen'!R24","v":310.64},{"v":1553.1999999999998,"d":"1,553.2"},{"$f":"'Übersicht Schützen'!U24","v":{"v":311.59999999999997,"d":"311.60"}},{"v":3427.5999999999995,"d":"3,427.6"},{"v":-203.5000000000009,"d":"-203.5"}]
[24,{"$f":"'Übersicht Schützen'!A25","v":"Eckmann Mark"},{"$f":"'Übersicht Schützen'!B25","v":"Börger II"},{"$f":"'Übersicht Schützen'!C25","v":310.3},{"$f":"'Übersicht Schützen'!D25","v":301.5},{"$f":"'Übersicht Schützen'!E25","v":304.1},{"$f":"'Übersicht Schützen'!F25","v":301.7},{"$f":"'Übersicht Schützen'!G25","v":311.3},{"$f":"'Übersicht Schützen'!H25","v":304.5},{"$f":"'Übersicht Schützen'!I25","v":{"v":305.56666666666666,"d":"305.57"}},{"v":1833.3999999999999,"d":"1,833.4"},{"$f":"'Übersicht Schützen'!L25","v":303.7},{"$f":"'Übersicht Schützen'!M25","v":{"v":0,"d":"0.0"}},{"$f":"'Übersicht Schützen'!N25","v":{"v":304,"d":"304.0"}},{"$f":"'Übersicht Schützen'!O25","v":299.8},{"$f":"'Übersicht Schützen'!P25","v":310.5},{"$f":"'Übersicht Schützen'!Q25","v":305.8},{"$f":"'Übersicht Schützen'!R25","v":304.76},{"v":1523.8,"d":"1,523.8"},{"$f":"'Übersicht Schützen'!U25","v":{"v":305.20000000000005,"d":"305.20"}},{"v":3357.2,"d":"3,357.2"},{"v":-70.39999999999964,"d":"-70.4"}]
[25,{"$f":"'Übersicht Schützen'!A26","v":"Schulz Simon"},{"$f":"'Übersicht Schützen'!B26","v":"Börger II"},{"$f":"'Übersicht Schützen'!C26","v":305.7},{"$f":"'Übersicht Schützen'!D26","v":299.8},{"$f":"'Übersicht Schützen'!E26","v":308.7},{"$f":"'Übersicht Schützen'!F26","v":303.7},{"$f":"'Übersicht Schützen'!G26","v":304.8},{"$f":"'Übersicht Schützen'!H26","v":309.3},{"$f":"'Übersicht Schützen'!I26","v":{"v":305.3333333333333,"d":"305.33"}},{"v":1832,"d":"1,832.0"},{"$f":"'Übersicht Schützen'!L26","v":298.2},{"$f":"'Übersicht Schützen'!M26","v":302.8},{"$f":"'Übersicht Schützen'!N26","v":296.8},{"$f":"'Übersicht Schützen'!O26","v":{"v":0,"d":"0.0"}},{"$f":"'Übersicht Schützen'!P26","v":299.8},{"$f":"'Übersicht Schützen'!Q26","v":307.8},{"$f":"'Übersicht Schützen'!R26","v":301.08},{"v":1505.3999999999999,"d":"1,505.4"},{"$f":"'Übersicht Schützen'!U26","v":{"v":303.40000000000003,"d":"303.40"}},{"v":3337.3999999999996,"d":"3,337.4"},{"v":-19.800000000000182,"d":"-19.8"}]
[26,{"$f":"'Übersicht Schützen'!A27","v":"Schwarte Hermann"},{"$f":"'Übersicht Schützen'!B27","v":"Börger II"},{"$f":"'Übersicht Schützen'!C27","v":309.6},{"$f":"'Übersicht Schützen'!D27","v":301.5},{"$f":"'Übersicht Schützen'!E27","v":307.3},{"$f":"'Übersicht Schützen'!F27","v":302.5},{"$f":"'Übersicht Schützen'!G27","v":304.7},{"$f":"'Übersicht Schützen'!H27","v":{"v":0,"d":"0.0"}},{"$f":"'Übersicht Schützen'!I27","v":305.12},{"v":1525.6000000000001,"d":"1,525.6"},{"$f":"'Übersicht Schützen'!L27","v":303.1},{"$f":"'Übersicht Schützen'!M27","v":304.9},{"$f":"'Übersicht Schützen'!N27","v":307.5},{"$f":"'Übersicht Schützen'!O27","v":{"v":0,"d":"0.0"}},{"$f":"'Übersicht Schützen'!P27","v":305.1},{"$f":"'Übersicht Schützen'!Q27","v":{"v":0,"d":"0.0"}},{"$f":"'Übersicht Schützen'!R27","v":305.15},{"v":1220.6,"d":"1,220.6"},{"$f":"'Übersicht Schützen'!U27","v":{"v":305.1333333333334,"d":"305.13"}},{"v":2746.2,"d":"2,746.2"},{"v":-591.1999999999998,"d":"-591.2"}]
[27,{"$f":"'Übersicht Schützen'!A28","v":"Hahnenkamp Ulrich"},{"$f":"'Übersicht Schützen'!B28","v":"Spahnharrenstätte II"},{"$f":"'Übersicht Schützen'!C28","v":{"v":0,"d":"0.0"}},{"$f":"'Übersicht Schützen'!D28","v":286.5},{"$f":"'Übersicht Schützen'!E28","v":{"v":0,"d":"0.0"}},{"$f":"'Übersicht Schützen'!F28","v":291.8},{"$f":"'Übersicht Schützen'!G28","v":297.3},{"$f":"'Übersicht Schützen'!H28","v":{"v":0,"d":"0.0"}},{"$f":"'Übersicht Schützen'!I28","v":{"v":291.8666666666666,"d":"291.87"}},{"v":875.5999999999999,"d":"875.6"},{"$f":"'Übersicht Schützen'!L28","v":295.1},{"$f":"'Übersicht Schützen'!M28","v":284.3},{"$f":"'Übersicht Schützen'!N28","v":274.1},{"$f":"'Übersicht Schützen'!O28","v":301.2},{"$f":"'Übersicht Schützen'!P28","v":299.7},{"$f":"'Übersicht Schützen'!Q28","v":291.1},{"$f":"'Übersicht Schützen'!R28","v":{"v":290.9166666666667,"d":"290.92"}},{"v":1745.5,"d":"1,745.5"},{"$f":"'Übersicht Schützen'!U28","v":{"v":291.23333333333335,"d":"291.23"}},{"v":2621.1,"d":"2,621.1"},{"v":-125.09999999999991,"d":"-125.1"}]
[28,{"$f":"'Übersicht Schützen'!A29","v":"Lindemann Gerd"},{"$f":"'Übersicht Schützen'!B29","v":"Esterwegen III"},{"$f":"'Übersicht Schützen'!C29","v":301.5},{"$f":"'Übersicht Schützen'!D29","v":310.4},{"$f":"'Übersicht Schützen'!E29","v":300.8},{"$f":"'Übersicht Schützen'!F29","v":304.3},{"$f":"'Übersicht Schützen'!G29","v":{"v":0,"d":"0.0"}},{"$f":"'Übersicht Schützen'!H29","v":{"v":0,"d":"0.0"}},{"$f":"'Übersicht Schützen'!I29","v":304.25},{"v":1217,"d":"1,217.0"},{"$f":"'Übersicht Schützen'!L29","v":{"v":0,"d":"0.0"}},{"$f":"'Übersicht Schützen'!M29","v":{"v":0,"d":"0.0"}},{"$f":"'Übersicht Schützen'!N29","v":303.3},{"$f":"'Übersicht Schützen'!O29","v":301.3},{"$f":"'Übersicht Schützen'!P29","v":305.1},{"$f":"'Übersicht Schützen'!Q29","v":306.8},{"$f":"'Übersicht Schützen'!R29","v":{"v":304.125,"d":"304.13"}},{"v":1216.5,"d":"1,216.5"},{"$f":"'Übersicht Schützen'!U29","v":{"v":304.1875,"d":"304.19"}},{"v":2433.5,"d":"2,433.5"},{"v":-187.5999999999999,"d":"-187.6"}]
[29,{"$f":"'Übersicht Schützen'!A30","v":"Hahnenkamp Markus"},{"$f":"'Übersicht Schützen'!B30","v":"Spahnharrenstätte II"},{"$f":"'Übersicht Schützen'!C30","v":{"v":0,"d":"0.0"}},{"$f":"'Übersicht Schützen'!D30","v":{"v":0,"d":"0.0"}},{"$f":"'Übersicht Schützen'!E30","v":{"v":0,"d":"0.0"}},{"$f":"'Übersicht Schützen'!F30","v":{"v":0,"d":"0.0"}},{"$f":"'Übersicht Schützen'!G30","v":298.9},{"$f":"'Übersicht Schützen'!H30","v":295.3},{"$f":"'Übersicht Schützen'!I30","v":{"v":297.1,"d":"297.10"}},594.2,{"$f":"'Übersicht Schützen'!L30","v":299.6},{"$f":"'Übersicht Schützen'!M30","v":{"v":304,"d":"304.0"}},{"$f":"'Übersicht Schützen'!N30","v":298.2},{"$f":"'Übersicht Schützen'!O30","v":{"v":0,"d":"0.0"}},{"$f":"'Übersicht Schützen'!P30","v":295.9},{"$f":"'Übersicht Schützen'!Q30","v":{"v":300,"d":"300.0"}},{"$f":"'Übersicht Schützen'!R30","v":{"v":299.53999999999996,"d":"299.54"}},{"v":1497.6999999999998,"d":"1,497.7"},{"$f":"'Übersicht Schützen'!U30","v":{"v":298.84285714285716,"d":"298.84"}},{"v":2091.8999999999996,"d":"2,091.9"},{"v":0,"d":"0.0"}]
[30,{"$f":"'Übersicht Schützen'!A31","v":"Walker Stefan"},{"$f":"'Übersicht Schützen'!B31","v":"Börgerwald II"},{"$f":"'Übersicht Schützen'!C31","v":{"v":0,"d":"0.0"}},{"$f":"'Übersicht Schützen'!D31","v":{"v":0,"d":"0.0"}},{"$f":"'Übersicht Schützen'!E31","v":{"v":0,"d":"0.0"}},{"$f":"'Übersicht Schützen'!F31","v":290.3},{"$f":"'Übersicht Schützen'!G31","v":287.9},{"$f":"'Übersicht Schützen'!H31","v":{"v":287,"d":"287.0"}},{"$f":"'Übersicht Schützen'!I31","v":{"v":288.40000000000003,"d":"288.40"}},865.2,{"$f":"'Übersicht Schützen'!L31","v":{"v":0,"d":"0.0"}},{"$f":"'Übersicht Schützen'!M31","v":{"v":0,"d":"0.0"}},{"$f":"'Übersicht Schützen'!N31","v":{"v":0,"d":"0.0"}},{"$f":"'Übersicht Schützen'!O31","v":{"v":0,"d":"0.0"}},{"$f":"'Übersicht Schützen'!P31","v":304.9},{"$f":"'Übersicht Schützen'!Q31","v":302.1},{"$f":"'Übersicht Schützen'!R31","v":{"v":303.5,"d":"303.50"}},{"v":607,"d":"607.0"},{"$f":"'Übersicht Schützen'!U31","v":{"v":294.43999999999994,"d":"294.44"}},{"v":1472.2,"d":"1,472.2"},{"v":-619.6999999999996,"d":"-619.7"}]
[31,{"$f":"'Übersicht Schützen'!A32","v":"Aldfeld Helmut"},{"$f":"'Übersicht Schützen'!B32","v":"Esterwegen III"},{"$f":"'Übersicht Schützen'!C32","v":298.7},{"$f":"'Übersicht Schützen'!D32","v":296.4},{"$f":"'Übersicht Schützen'!E32","v":{"v":0,"d":"0.0"}},{"$f":"'Übersicht Schützen'!F32","v":{"v":0,"d":"0.0"}},{"$f":"'Übersicht Schützen'!G32","v":304.6},{"$f":"'Übersicht Schützen'!H32","v":298.9},{"$f":"'Übersicht Schützen'!I32","v":299.65},{"v":1198.6,"d":"1,198.6"},{"$f":"'Übersicht Schützen'!L32","v":{"v":0,"d":"0.0"}},{"$f":"'Übersicht Schützen'!M32","v":{"v":0,"d":"0.0"}},{"$f":"'Übersicht Schützen'!N32","v":{"v":0,"d":"0.0"}},{"$f":"'Übersicht Schützen'!O32","v":{"v":0,"d":"0.0"}},{"$f":"'Übersicht Schützen'!P32","v":{"v":0,"d":"0.0"}},{"$f":"'Übersicht Schützen'!Q32","v":{"v":0,"d":"0.0"}},{"$f":"'Übersicht Schützen'!R32","v":{"v":0,"d":"0.00"}},{"v":0,"d":"0.0"},{"$f":"'Übersicht Schützen'!U32","v":299.65},{"v":1198.6,"d":"1,198.6"},{"$f":"(U46-U47)*-1","v":{"v":-273.60000000000014,"d":"-273.6"}}]
[32,{"$f":"'Übersicht Schützen'!A33","v":"Lindemann Rita"},{"$f":"'Übersicht Schützen'!B33","v":"Rastdorf III"},{"$f":"'Übersicht Schützen'!C33","v":{"v":0,"d":"0.0"}},{"$f":"'Übersicht Schützen'!D33","v":{"v":0,"d":"0.0"}},{"$f":"'Übersicht Schützen'!E33","v":{"v":0,"d":"0.0"}},{"$f":"'Übersicht Schützen'!F33","v":{"v":0,"d":"0.0"}},{"$f":"'Übersicht Schützen'!G33","v":{"v":0,"d":"0.0"}},{"$f":"'Übersicht Schützen'!H33","v":{"v":0,"d":"0.0"}},{"$f":"'Übersicht Schützen'!I33","v":{"v":0,"d":"0.00"}},{"v":0,"d":"0.0"},{"$f":"'Übersicht Schützen'!L33","v":317.9},{"$f":"'Übersicht Schützen'!M33","v":314.4},{"$f":"'Übersicht Schützen'!N33","v":{"v":0,"d":"0.0"}},{"$f":"'Übersicht Schützen'!O33","v":316.6},{"$f":"'Übersicht Schützen'!P33","v":{"v":0,"d":"0.0"}},{"$f":"'Übersicht Schützen'!Q33","v":{"v":0,"d":"0.0"}},{"$f":"'Übersicht Schützen'!R33","v":{"v":316.3,"d":"316.30"}},948.9,{"$f":"'Übersicht Schützen'!U33","v":{"v":316.3,"d":"316.30"}},948.9,{"v":-249.69999999999993,"d":"-249.7"}]
[33,{"$f":"'Übersicht Schützen'!A34","v":"Heidemann Jürgen"},{"$f":"'Übersicht Schützen'!B34","v":"Esterwegen III"},{"$f":"'Übersicht Schützen'!C34","v":305.9},{"$f":"'Übersicht Schützen'!D34","v":305.1},{"$f":"'Übersicht Schützen'!E34","v":309.3},{"$f":"'Übersicht Schützen'!F34","v":{"v":0,"d":"0.0"}},{"$f":"'Übersicht Schützen'!G34","v":{"v":0,"d":"0.0"}},{"$f":"'Übersicht Schützen'!H34","v":{"v":0,"d":"0.0"}},{"$f":"'Übersicht Schützen'!I34","v":{"v":306.76666666666665,"d":"306.77"}},920.3,{"$f":"'Übersicht Schützen'!L34","v":{"v":0,"d":"0.0"}},{"$f":"'Übersicht Schützen'!M34","v":{"v":0,"d":"0.0"}},{"$f":"'Übersicht Schützen'!N34","v":{"v":0,"d":"0.0"}},{"$f":"'Übersicht Schützen'!O34","v":{"v":0,"d":"0.0"}},{"$f":"'Übersicht Schützen'!P34","v":{"v":0,"d":"0.0"}},{"$f":"'Übersicht Schützen'!Q34","v":{"v":0,"d":"0.0"}},{"$f":"'Übersicht Schützen'!R34","v":{"v":0,"d":"0.00"}},{"v":0,"d":"0.0"},{"$f":"'Übersicht Schützen'!U34","v":{"v":306.76666666666665,"d":"306.77"}},920.3,{"v":-28.600000000000023,"d":"-28.6"}]
[34,{"$f":"'Übersicht Schützen'!A35","v":"Speeker Dietmar"},{"$f":"'Übersicht Schützen'!B35","v":"Börgerwald II"},{"$f":"'Übersicht Schützen'!C35","v":302.2},{"$f":"'Übersicht Schützen'!D35","v":{"v":0,"d":"0.0"}},{"$f":"'Übersicht Schützen'!E35","v":{"v":0,"d":"0.0"}},{"$f":"'Übersicht Schützen'!F35","v":{"v":0,"d":"0.0"}},{"$f":"'Übersicht Schützen'!G35","v":{"v":0,"d":"0.0"}},{"$f":"'Übersicht Schützen'!H35","v":{"v":0,"d":"0.0"}},{"$f":"'Übersicht Schützen'!I35","v":{"v":302.2,"d":"302.20"}},302.2,{"$f":"'Übersicht Schützen'!L35","v":{"v":0,"d":"0.0"}},{"$f":"'Übersicht Schützen'!M35","v":{"v":0,"d":"0.0"}},{"$f":"'Übersicht Schützen'!N35","v":{"v":0,"d":"0.0"}},{"$f":"'Übersicht Schützen'!O35","v":{"v":0,"d":"0.0"}},{"$f":"'Übersicht Schützen'!P35","v":{"v":0,"d":"0.0"}},{"$f":"'Übersicht Schützen'!Q35","v":{"v":0,"d":"0.0"}},{"$f":"'Übersicht Schützen'!R35","v":{"v":0,"d":"0.00"}},{"v":0,"d":"0.0"},{"$f":"'Übersicht Schützen'!U35","v":{"v":302.2,"d":"302.20"}},302.2,{"v":-618.0999999999999,"d":"-618.1"}]
[35,{"$f":"'Übersicht Schützen'!A36","v":"Olliges Kai"},{"$f":"'Übersicht Schützen'!B36","v":"Börgerwald II"},{"$f":"'Übersicht Schützen'!C36","v":{"v":0,"d":"0.0"}},{"$f":"'Übersicht Schützen'!D36","v":{"v":0,"d":"0.0"}},{"$f":"'Übersicht Schützen'!E36","v":{"v":0,"d":"0.0"}},{"$f":"'Übersicht Schützen'!F36","v":{"v":0,"d":"0.0"}},{"$f":"'Übersicht Schützen'!G36","v":{"v":0,"d":"0.0"}},{"$f":"'Übersicht Schützen'!H36","v":{"v":0,"d":"0.0"}},{"$f":"'Übersicht Schützen'!I36","v":{"v":0,"d":"0.00"}},{"v":0,"d":"0.0"},{"$f":"'Übersicht Schützen'!L36","v":259.6},{"$f":"'Übersicht Schützen'!M36","v":{"v":0,"d":"0.0"}},{"$f":"'Übersicht Schützen'!N36","v":{"v":0,"d":"0.0"}},{"$f":"'Übersicht Schützen'!O36","v":{"v":0,"d":"0.0"}},{"$f":"'Übersicht Schützen'!P36","v":{"v":0,"d":"0.0"}},{"$f":"'Übersicht Schützen'!Q36","v":{"v":0,"d":"0.0"}},{"$f":"'Übersicht Schützen'!R36","v":{"v":259.6,"d":"259.60"}},259.6,{"$f":"'Übersicht Schützen'!U36","v":{"v":259.6,"d":"259.60"}},259.6,{"$f":"(U50-U51)*-1","v":{"v":-42.599999999999966,"d":"-42.6"}}]
[36,{"$f":"'Übersicht Schützen'!A37","v":"Peters Carsten"},{"$f":"'Übersicht Schützen'!B37","v":"Neuvrees I"},{"$f":"'Übersicht Schützen'!C37","v":{"v":0,"d":"0.0"}},{"$f":"'Übersicht Schützen'!D37","v":{"v":0,"d":"0.0"}},{"$f":"'Übersicht Schützen'!E37","v":{"v":0,"d":"0.0"}},{"$f":"'Übersicht Schützen'!F37","v":{"v":0,"d":"0.0"}},{"$f":"'Übersicht Schützen'!G37","v":{"v":0,"d":"0.0"}},{"$f":"'Übersicht Schützen'!H37","v":{"v":0,"d":"0.0"}},{"$f":"'Übersicht Schützen'!I37","v":{"v":0,"d":"0.00"}},{"v":0,"d":"0.0"},{"$f":"'Übersicht Schützen'!L37","v":{"v":0,"d":"0.0"}},{"$f":"'Übersicht Schützen'!M37","v":{"v":0,"d":"0.0"}},{"$f":"'Übersicht Schützen'!N37","v":{"v":0,"d":"0.0"}},{"$f":"'Übersicht Schützen'!O37","v":{"v":0,"d":"0.0"}},{"$f":"'Übersicht Schützen'!P37","v":{"v":0,"d":"0.0"}},{"$f":"'Übersicht Schützen'!Q37","v":{"v":0,"d":"0.0"}},{"$f":"'Übersicht Schützen'!R37","v":{"v":0,"d":"0.00"}},{"v":0,"d":"0.0"},{"$f":"'Übersicht Schützen'!U37","v":{"v":0,"d":"0.00"}},{"v":0,"d":"0.0"},-259.6]
[]
[null,null,"Schnitt:",{"$f":"IF(Formelhilfe!B45 > 0, SUM(D17:D52)/Formelhilfe!B45, 0)","v":{"v":309.13666666666666,"d":"309.1"}},{"$f":"IF(Formelhilfe!C45 > 0, SUM(E17:E52)/Formelhilfe!C45, 0)","v":{"v":306.66333333333336,"d":"306.7"}},{"$f":"IF(Formelhilfe!D45 > 0, SUM(F17:F52)/Formelhilfe!D45, 0)","v":{"v":307.7392857142857,"d":"307.7"}},{"$f":"IF(Formelhilfe!E45 > 0, SUM(G17:G52)/Formelhilfe!E45, 0)","v":{"v":307.17931034482757,"d":"307.2"}},{"$f":"IF(Formelhilfe!F45 > 0, SUM(H17:H52)/Formelhilfe!F45, 0)","v":{"v":308.96333333333337,"d":"309.0"}},{"$f":"IF(Formelhilfe!G45 > 0, SUM(I17:I52)/Formelhilfe!G45, 0)","v":{"v":308.1964285714286,"d":"308.2"}},{"$f":"IF(SUM(J17:J52)<>0,AVERAGEIF(J17:J52,\"<>0\"),0)","v":{"v":306.9228282828282,"d":"306.92"}},{"$f":"IF(SUM(K17:K52)<>0,AVERAGEIF(K17:K52,\"<>0\"),0)","v":{"v":1633.2515151515147,"d":"1633.25"}},{"$f":"IF(Formelhilfe!I45 > 0, SUM(L17:L52)/Formelhilfe!I45, 0)","v":{"v":305.87333333333333,"d":"305.9"}},{"$f":"IF(Formelhilfe!J45 > 0, SUM(M17:M52)/Formelhilfe!J45, 0)","v":{"v":307.8071428571429,"d":"307.8"}},{"$f":"IF(Formelhilfe!K45 > 0, SUM(N17:N52)/Formelhilfe!K45, 0)","v":{"v":306.48214285714295,"d":"306.5"}},{"$f":"IF(Formelhilfe!L45 > 0, SUM(O17:O52)/Formelhilfe!L45, 0)","v":{"v":306.7037037037037,"d":"306.7"}},{"$f":"IF(Formelhilfe!M45 > 0, SUM(P17:P52)/Formelhilfe!M45, 0)","v":{"v":309.4266666666667,"d":"309.4"}},{"$f":"IF(Formelhilfe!N45 > 0, SUM(Q17:Q52)/Formelhilfe!N45, 0)","v":{"v":309.3103448275863,"d":"309.3"}},{"$f":"IF(SUM(R17:R52)<>0,AVERAGEIF(R17:R52,\"<>0\"),0)","v":{"v":306.2790104166667,"d":"306.28"}},{"$f":"IF(SUM(S17:S52)<>0,AVERAGEIF(S17:S52,\"<>0\"),0)","v":{"v":1653.440625,"d":"1653.44"}},{"v":305.8889149659864,"d":"305.89"},{"$f":"(K54+S54)","v":{"v":3286.6921401515146,"d":"3,286.69 "}}]

{"sheet":"Wettkampf 1","index":1,"n_rows":47,"n_cols":29,"rows_kept":47,"merged":[[0,24,0,25],[1,24,1,25],[4,24,4,25],[5,24,5,25],[6,24,6,25],[8,22,8,25]]}
[null,"Verein / Gruppe",null,"Ergebnisse",{"$nulls":19},"Austragungsort:",{"$f":"Übersicht!D4","v":"Neuvrees"}]
[1,"Neuvrees I",null,{"$f":"G46","v":938.6},{"$f":"IF(H46>4,\"Es sind zu viele Schützen in Wertung!\",\" \")","v":" "},{"$nulls":18},"Wettkampftag:",{"$f":"Übersicht!D3","v":"25.08."}]
[2,"Rastdorf III",null,{"$f":"I46","v":{"v":946,"d":"946.0"}},{"$f":"IF(J46>4,\"Es sind zu viele Schützen in Wertung!\",\" \")","v":" "}]
[3,"Börger II",null,{"$f":"K46","v":935.7},{"$f":"IF(L46>4,\"Es sind zu viele Schützen in Wertung!\",\" \")","v":" "},{"$nulls":20},"Ansprechpartner für Rückfragen:"]
[4,"Esterwegen III",null,{"$f":"M46","v":933.3},{"$f":"IF(N46>4,\"Es sind zu viele Schützen in Wertung!\",\" \")","v":" "},{"$nulls":18},"Name:","Janßen Markus"]
[5,"Börgerwald II",null,{"$f":"O46","v":929.6},{"$f":"IF(P46>4,\"Es sind zu viele Schützen in Wertung!\",\" \")","v":" "},{"$nulls":18},"Tel:","01705453583"]
[6,"Spahnharrenstätte II",null,{"$f":"Q46","v":928.7},{"$f":"IF(R46>4,\"Es sind zu viele Schützen in Wertung!\",\" \")","v":" "},{"$nulls":18},"Standaufsicht:","Janßen Markus"]
[]
[null,"Einzelergebnisse:","Verein/Gruppe (per Dropdown-Feld einzutragen)","Ergebnisse","AW? Dann x eintippen",null,"Verein 1",null,"Verein 2",null,"Verein 3",null,"Verein 4",null,"Verein 5",null,"Verein 6",{"$nulls":3},"Geburtsdatum",null,"Proberechnung bei Streifen:"]
[1,"Rolfes Wilhelm","Neuvrees I",312.6,null,{"$f":"IF(E10=\"x\",\"0\",D10)","v":312.6},{"$f":"IF(C10=$B$2,F10,0)","v":312.6},{"$f":"(IF(AND($E10=\"\",$C10=$B$2),1,0))","v":1},{"$f":"IF($C10=$B$3,F10,0)","v":0},{"$f":"(IF(AND($E10=\"\",$C10=$B$3),1,0))","v":0},{"$f":"IF($C10=$B$4,F10,0)","v":0},{"$f":"(IF(AND($E10=\"\",$C10=$B$4),1,0))","v":0},{"$f":"IF($C10=$B$5,F10,0)","v":0},{"$f":"(IF(AND($E10=\"\",$C10=$B$5),1,0))","v":0},{"$f":"IF($C10=$B$6,F10,0)","v":0},{"$f":"(IF(AND($E10=\"\",$C10=$B$6),1,0))","v":0},{"$f":"IF($C10=$B$7,F10,0)","v":0},{"$f":"(IF(AND($E10=\"\",$C10=$B$7),1,0))","v":0},{"$nulls":4},103.2,104.6,104.8,{"$f":"W10+X10+Y10","v":312.6},{"$f":"IF(Z10=D10,1,0)","v":1},{"$f":"IF(Z10=0,0,1)","v":1},{"$f":"IF(AA10+AB10=2,\"Korrekt\",\"\")","v":"Korrekt"}]
[2,"Steenken Klaus","Neuvrees I",304.2,null,{"$f":"IF(E11=\"x\",\"0\",D11)","v":304.2},{"$f":"IF(C11=$B$2,F11,0)","v":304.2},{"$f":"(IF(AND($E11=\"\",$C11=$B$2),1,0))","v":1},{"$f":"IF($C11=$B$3,F11,0)","v":0},{"$f":"(IF(AND($E11=\"\",$C11=$B$3),1,0))","v":0},{"$f":"IF($C11=$B$4,F11,0)","v":0},{"$f":"(IF(AND($E11=\"\",$C11=$B$4),1,0))","v":0},{"$f":"IF($C11=$B$5,F11,0)","v":0},{"$f":"(IF(AND($E11=\"\",$C11=$B$5),1,0))","v":0},{"$f":"IF($C11=$B$6,F11,0)","v":0},{"$f":"(IF(AND($E11=\"\",$C11=$B$6),1,0))","v":0},{"$f":"IF($C11=$B$7,F11,0)","v":0},{"$f":"(IF(AND($E11=\"\",$C11=$B$7),1,0))","v":0},{"$nulls":4},101.7,101.8,100.7,{"$f":"W11+X11+Y11","v":304.2},{"$f":"IF(Z11=D11,1,0)","v":1},{"$f":"IF(Z11=0,0,1)","v":1},{"$f":"IF(AA11+AB11=2,\"Korrekt\",\"\")","v":"Korrekt"}]
[3,"Breyer Wilfried","Neuvrees I",{"v":312,"d":"312.0"},null,312,312,1,0,0,0,0,0,0,0,0,0,0,{"$nulls":4},101.7,103.8,106.5,{"v":312,"d":"312.0"},1,1,"Korrekt"]
[4,"Janßen Markus","Neuvrees I",{"v":314,"d":"314.0"},null,314,314,1,0,0,0,0,0,0,0,0,0,0,{"$nulls":4},104.3,105.4,104.3,{"v":314,"d":"314.0"},1,1,"Korrekt"]
[5,"Thyen Werner","Neuvrees I",304.5,"x","0","0",0,0,0,0,0,0,0,0,0,0,0,{"$nulls":4},103.3,100.6,100.6,304.5,1,1,"Korrekt"]
[6,"Peters Carsten","Neuvrees I",{"v":0,"d":"0.0"},"x","0","0",0,0,0,0,0,0,0,0,0,0,0,{"$nulls":4},{"v":0,"d":"0.0"},{"v":0,"d":"0.0"},{"v":0,"d":"0.0"},{"v":0,"d":"0.0"},1,0,""]
[7,"Wotte Robert","Rastdorf III",{"v":317.59999999999997,"d":"317.6"},null,317.59999999999997,0,0,317.59999999999997,1,0,0,0,0,0,0,0,0,{"$nulls":4},106.1,106.3,105.2,{"v":317.59999999999997,"d":"317.6"},1,1,"Korrekt"]
[8,"Müller Helmut","Rastdorf III",315.8,null,315.8,0,0,315.8,1,0,0,0,0,0,0,0,0,{"$nulls":4},105.6,104.5,105.7,315.8,1,1,"Korrekt"]
[9,"Bookjans Günther","Rastdorf III",311.7,null,311.7,0,0,311.7,1,0,0,0,0,0,0,0,0,{"$nulls":4},105.1,103.5,103.1,311.7,1,1,"Korrekt"]
[10,"Meer Michael","Rastdorf III",312.6,null,312.6,0,0,312.6,1,0,0,0,0,0,0,0,0,{"$nulls":4},104.4,105.1,103.1,312.6,1,1,"Korrekt"]
[11,"Lindemann Rita","Rastdorf III",{"v":0,"d":"0.0"},"x","0",0,0,"0",0,0,0,0,0,0,0,0,0,{"$nulls":7},{"v":0,"d":"0.0"},1,0,""]
[12,"Olliges Kai","Börgerwald II",{"v":0,"d":"0.0"},"x","0",0,0,0,0,0,0,0,0,"0",0,0,0,{"$nulls":7},{"v":0,"d":"0.0"},1,0,""]
[13,"Zdralik Ingo","Börger II",315.8,null,315.8,0,0,0,0,315.8,1,0,0,0,0,0,0,{"$nulls":4},105.7,105.7,104.4,315.8,1,1,"Korrekt"]
[14,"Goldenstein Uwe","Börger II",307.4,"x","0",0,0,0,0,"0",0,0,0,0,0,0,0,{"$nulls":4},104.2,101.6,101.6,307.4,1,1,"Korrekt"]
[15,"Eckmann Mark","Börger II",310.3,null,310.3,0,0,0,0,310.3,1,0,0,0,0,0,0,{"$nulls":4},104.8,103.7,101.8,310.3,1,1,"Korrekt"]
[16,"Schulz Simon","Börger II",305.7,"x","0",0,0,0,0,"0",0,0,0,0,0,0,0,{"$nulls":4},101.7,101.3,102.7,305.7,1,1,"Korrekt"]
[17,"Schwarte Hermann","Börger II",309.6,null,309.6,0,0,0,0,309.6,1,0,0,0,0,0,0,{"$nulls":4},102.3,103.4,103.9,309.6,1,1,"Korrekt"]
[18,"Jungsthoefel Markus","Börger II",308.3,null,308.3,0,0,0,0,308.3,1,0,0,0,0,0,0,{"$nulls":4},{"v":103,"d":"103.0"},102.9,102.4,308.3,1,1,"Korrekt"]
[19,"Aldfeld Helmut","Esterwegen III",298.7,"x","0",0,0,0,0,0,0,"0",0,0,0,0,0,{"$nulls":4},95.2,{"v":101,"d":"101.0"},102.5,298.7,1,1,"Korrekt"]
[20,"Schulte Mathias","Esterwegen III",{"v":310.79999999999995,"d":"310.8"},null,310.79999999999995,0,0,0,0,0,0,310.79999999999995,1,0,0,0,0,{"$nulls":4},103.8,102.1,104.9,{"v":310.79999999999995,"d":"310.8"},1,1,"Korrekt"]
[21,"Middendorf Peter","Esterwegen III",312.2,null,312.2,0,0,0,0,0,0,312.2,1,0,0,0,0,{"$nulls":4},{"v":104,"d":"104.0"},106.4,101.8,312.2,1,1,"Korrekt"]
[22,"Meibers Michael","Esterwegen III",310.3,null,310.3,0,0,0,0,0,0,310.3,1,0,0,0,0,{"$nulls":4},{"v":102,"d":"102.0"},{"v":106,"d":"106.0"},102.3,310.3,1,1,"Korrekt"]
[23,"Heidemann Jürgen","Esterwegen III",305.9,null,305.9,0,0,0,0,0,0,305.9,1,0,0,0,0,{"$nulls":4},103.7,101.2,{"v":101,"d":"101.0"},305.9,1,1,"Korrekt"]
[24,"Lindemann Gerd","Esterwegen III",301.5,"x","0",0,0,0,0,0,0,"0",0,0,0,0,0,{"$nulls":4},102.2,99.6,99.7,301.5,1,1,"Korrekt"]
[25,"Hanenkamp Andre","Börgerwald II",313.3,null,313.3,0,0,0,0,0,0,0,0,313.3,1,0,0,{"$nulls":4},104.5,104.9,103.9,313.3,1,1,"Korrekt"]
[26,"Antons Mathias","Börgerwald II",308.9,null,308.9,0,0,0,0,0,0,0,0,308.9,1,0,0,{"$nulls":4},101.6,103.5,103.8,308.9,1,1,"Korrekt"]
[27,"Schröer Friedhelm","Börgerwald II",306.3,null,306.3,0,0,0,0,0,0,0,0,306.3,1,0,0,{"$nulls":4},98.9,103.9,103.5,306.3,1,1,"Korrekt"]
[28,"Sebers Tobias","Börgerwald II",305.8,"x","0",0,0,0,0,0,0,0,0,"0",0,0,0,{"$nulls":4},103.4,102.1,100.3,305.8,1,1,"Korrekt"]
[29,"Hanneken Moritz","Börgerwald II",307.4,null,307.4,0,0,0,0,0,0,0,0,307.4,1,0,0,{"$nulls":4},101.8,103.9,101.7,307.4,1,1,"Korrekt"]
[30,"Speeker Dietmar","Börgerwald II",302.2,"x","0",0,0,0,0,0,0,0,0,"0",0,0,0,{"$nulls":4},{"v":98,"d":"98.0"},102.6,101.6,302.2,1,1,"Korrekt"]
[31,"Will Achim","Spahnharrenstätte II",{"v":307,"d":"307.0"},null,307,0,0,0,0,0,0,0,0,0,0,307,1,{"$nulls":4},{"v":101,"d":"101.0"},103.7,102.3,{"$f":"W40+X40+Y40","v":{"v":307,"d":"307.0"}},{"$f":"IF(Z40=D40,1,0)","v":1},{"$f":"IF(Z40=0,0,1)","v":1},{"$f":"IF(AA40+AB40=2,\"Korrekt\",\"\")","v":"Korrekt"}]
[32,"Meyer Dirk","Spahnharrenstätte II",311.1,null,311.1,0,0,0,0,0,0,0,0,0,0,311.1,1,{"$nulls":4},101.7,104.6,104.8,311.1,1,1,"Korrekt"]
[33,"Micksch Heiko","Spahnharrenstätte II",310.6,null,310.6,0,0,0,0,0,0,0,0,0,0,310.6,1,{"$nulls":4},103.6,102.9,104.1,310.6,1,1,"Korrekt"]
[34,"Hahnenkamp Ulrich","Spahnharrenstätte II",{"v":0,"d":"0.0"},"x","0",0,0,0,0,0,0,0,0,0,0,"0",0,{"$nulls":7},{"v":0,"d":"0.0"},1,0,""]
[35,"Hahnenkamp Markus","Spahnharrenstätte II",{"v":0,"d":"0.0"},"x","0",0,0,0,0,0,0,0,0,0,0,"0",0,{"$nulls":7},{"v":0,"d":"0.0"},1,0,""]
[36,"Walker Stefan","Börgerwald II",{"v":0,"d":"0.0"},"x","0",0,0,0,0,0,0,0,0,"0",0,0,0,{"$nulls":7},{"$f":"W45+X45+Y45","v":{"v":0,"d":"0.0"}},{"$f":"IF(Z45=D45,1,0)","v":1},{"$f":"IF(Z45=0,0,1)","v":0},{"$f":"IF(AA45+AB45=2,\"Korrekt\",\"\")","v":""}]
[{"$nulls":6},{"$f":"LARGE(G10:G45,1)+LARGE(G10:G45,2)+LARGE(G10:G45,3)","v":938.6},{"$f":"SUM(H10:H45)","v":4},{"$f":"LARGE(I10:I45,1)+LARGE(I10:I45,2)+LARGE(I10:I45,3)","v":946},{"$f":"SUM(J10:J45)","v":4},{"$f":"LARGE(K10:K45,1)+LARGE(K10:K45,2)+LARGE(K10:K45,3)","v":935.7},{"$f":"SUM(L10:L45)","v":4},{"$f":"LARGE(M10:M45,1)+LARGE(M10:M45,2)+LARGE(M10:M45,3)","v":933.3},{"$f":"SUM(N10:N45)","v":4},{"$f":"LARGE(O10:O45,1)+LARGE(O10:O45,2)+LARGE(O10:O45,3)","v":929.6},{"$f":"SUM(P10:P45)","v":4},{"$f":"LARGE(Q10:Q45,1)+LARGE(Q10:Q45,2)+LARGE(Q10:Q45,3)","v":928.7},{"$f":"SUM(R10:S45)","v":3}]
[null,null,"per Email an: sk-huemmling@gmx.de"]

{"sheet":"2","index":2,"n_rows":47,"n_cols":27,"rows_kept":47,"merged":[[0,22,0,23],[1,22,1,23],[4,22,4,23],[5,22,5,23],[6,22,6,23],[8,20,8,23]]}
[null,"Verein / Gruppe",null,"Ergebnisse",{"$nulls":17},"Austragungsort:",{"$f":"Übersicht!E4","v":"Rastdorf"}]
[1,{"$f":"'Wettkampf 1'!B2","v":"Neuvrees I"},null,{"$f":"G46","v":931.2},{"$f":"IF(H46>4,\"Es sind zu viele Schützen in Wertung!\",\" \")","v":" "},{"$nulls":16},"Wettkampftag:",{"$f":"Übersicht!E3","v":"08.09."}]
[2,{"$f":"'Wettkampf 1'!B3","v":"Rastdorf III"},null,{"$f":"I46","v":{"v":938.6999999999999,"d":"938.7"}},{"$f":"IF(J46>4,\"Es sind zu viele Schützen in Wertung!\",\" \")","v":" "}]
[3,{"$f":"'Wettkampf 1'!B4","v":"Börger II"},null,{"$f":"K46","v":916.1},{"$f":"IF(L46>4,\"Es sind zu viele Schützen in Wertung!\",\" \")","v":" "},{"$nulls":18},"Ansprechpartner für Rückfragen:"]
[4,{"$f":"'Wettkampf 1'!B5","v":"Esterwegen III"},null,{"$f":"M46","v":{"v":936.6999999999999,"d":"936.7"}},{"$f":"IF(N46>4,\"Es sind zu viele Schützen in Wertung!\",\" \")","v":" "},{"$nulls":16},"Name:","Michael Meer"]
[5,{"$f":"'Wettkampf 1'!B6","v":"Börgerwald II"},null,{"$f":"O46","v":922.8},{"$f":"IF(P46>4,\"Es sind zu viele Schützen in Wertung!\",\" \")","v":" "},{"$nulls":16},"Tel:","059569269838"]
[6,{"$f":"'Wettkampf 1'!B7","v":"Spahnharrenstätte II"},null,{"$f":"Q46","v":934.5},{"$f":"IF(R46>4,\"Es sind zu viele Schützen in Wertung!\",\" \")","v":" "},{"$nulls":16},"Standaufsicht:","R.Wotte"]
[]
[null,"Einzelergebnisse:","Verein / Gruppe","Ergebnisse (mindestens 0 eintragen)","AW? Dann x eintippen",null,"Verein 1",null,"Verein 2",null,"Verein 3",null,"Verein 4",null,"Verein 5",null,"Verein 6",{"$nulls":3},"Proberechnung bei Streifen:"]
[1,{"$f":"'Wettkampf 1'!B10","v":"Rolfes Wilhelm"},{"$f":"'Wettkampf 1'!C10","v":"Neuvrees I"},304.2,null,{"$f":"IF(E10=\"x\",\"0\",D10)","v":304.2},{"$f":"IF(C10=$B$2,F10,0)","v":304.2},{"$f":"(IF(AND($E10=\"\",$C10=$B$2),1,0))","v":1},{"$f":"IF($C10=$B$3,F10,0)","v":0},{"$f":"(IF(AND($E10=\"\",$C10=$B$3),1,0))","v":0},{"$f":"IF($C10=$B$4,F10,0)","v":0},{"$f":"(IF(AND($E10=\"\",$C10=$B$4),1,0))","v":0},{"$f":"IF($C10=$B$5,F10,0)","v":0},{"$f":"(IF(AND($E10=\"\",$C10=$B$5),1,0))","v":0},{"$f":"IF($C10=$B$6,F10,0)","v":0},{"$f":"(IF(AND($E10=\"\",$C10=$B$6),1,0))","v":0},{"$f":"IF($C10=$B$7,F10,0)","v":0},{"$f":"(IF(AND($E10=\"\",$C10=$B$7),1,0))","v":0},{"$nulls":5},{"$f":"U10+V10+W10","v":{"v":0,"d":"0.0"}},{"$f":"IF(X10=D10,1,0)","v":0},{"$f":"IF(X10=0,0,1)","v":0},{"$f":"IF(Y10+Z10=2,\"Korrekt\",\"\")","v":""}]
[2,{"$f":"'Wettkampf 1'!B11","v":"Steenken Klaus"},{"$f":"'Wettkampf 1'!C11","v":"Neuvrees I"},{"v":307,"d":"307.0"},null,{"$f":"IF(E11=\"x\",\"0\",D11)","v":{"v":307,"d":"307.0"}},{"$f":"IF(C11=$B$2,F11,0)","v":307},{"$f":"(IF(AND($E11=\"\",$C11=$B$2),1,0))","v":1},{"$f":"IF($C11=$B$3,F11,0)","v":0},{"$f":"(IF(AND($E11=\"\",$C11=$B$3),1,0))","v":0},{"$f":"IF($C11=$B$4,F11,0)","v":0},{"$f":"(IF(AND($E11=\"\",$C11=$B$4),1,0))","v":0},{"$f":"IF($C11=$B$5,F11,0)","v":0},{"$f":"(IF(AND($E11=\"\",$C11=$B$5),1,0))","v":0},{"$f":"IF($C11=$B$6,F11,0)","v":0},{"$f":"(IF(AND($E11=\"\",$C11=$B$6),1,0))","v":0},{"$f":"IF($C11=$B$7,F11,0)","v":0},{"$f":"(IF(AND($E11=\"\",$C11=$B$7),1,0))","v":0},{"$nulls":5},{"$f":"U11+V11+W11","v":{"v":0,"d":"0.0"}},{"$f":"IF(X11=D11,1,0)","v":0},{"$f":"IF(X11=0,0,1)","v":0},{"$f":"IF(Y11+Z11=2,\"Korrekt\",\"\")","v":""}]
[3,{"$f":"'Wettkampf 1'!B12","v":"Breyer Wilfried"},{"$f":"'Wettkampf 1'!C12","v":"Neuvrees I"},312.4,null,312.4,312.4,1,0,0,0,0,0,0,0,0,0,0,{"$nulls":5},{"v":0,"d":"0.0"},0,0,""]
[4,{"$f":"'Wettkampf 1'!B13","v":"Janßen Markus"},{"$f":"'Wettkampf 1'!C13","v":"Neuvrees I"},311.8,null,311.8,311.8,1,0,0,0,0,0,0,0,0,0,0,{"$nulls":5},{"v":0,"d":"0.0"},0,0,""]
[5,{"$f":"'Wettkampf 1'!B14","v":"Thyen Werner"},{"$f":"'Wettkampf 1'!C14","v":"Neuvrees I"},295.7,"x","0","0",0,0,0,0,0,0,0,0,0,0,0,{"$nulls":5},{"v":0,"d":"0.0"},0,0,""]
[6,{"$f":"'Wettkampf 1'!B15","v":"Peters Carsten"},{"$f":"'Wettkampf 1'!C15","v":"Neuvrees I"},{"v":0,"d":"0.0"},"x","0","0",0,0,0,0,0,0,0,0,0,0,0,{"$nulls":5},{"v":0,"d":"0.0"},1,0,""]
[7,{"$f":"'Wettkampf 1'!B16","v":"Wotte Robert"},{"$f":"'Wettkampf 1'!C16","v":"Rastdorf III"},309.4,null,309.4,0,0,309.4,1,0,0,0,0,0,0,0,0,{"$nulls":5},{"v":0,"d":"0.0"},0,0,""]
[8,{"$f":"'Wettkampf 1'!B17","v":"Müller Helmut"},{"$f":"'Wettkampf 1'!C17","v":"Rastdorf III"},{"v":309,"d":"309.0"},null,{"v":309,"d":"309.0"},0,0,309,1,0,0,0,0,0,0,0,0,{"$nulls":5},{"v":0,"d":"0.0"},0,0,""]
[9,{"$f":"'Wettkampf 1'!B18","v":"Bookjans Günther"},{"$f":"'Wettkampf 1'!C18","v":"Rastdorf III"},315.8,null,315.8,0,0,315.8,1,0,0,0,0,0,0,0,0,{"$nulls":5},{"v":0,"d":"0.0"},0,0,""]
[10,{"$f":"'Wettkampf 1'!B19","v":"Meer Michael"},{"$f":"'Wettkampf 1'!C19","v":"Rastdorf III"},313.5,null,313.5,0,0,313.5,1,0,0,0,0,0,0,0,0,{"$nulls":5},{"v":0,"d":"0.0"},0,0,""]
[11,{"$f":"'Wettkampf 1'!B20","v":"Lindemann Rita"},{"$f":"'Wettkampf 1'!C20","v":"Rastdorf III"},null,"x","0",0,0,"0",0,0,0,0,0,0,0,0,0,{"$nulls":5},{"v":0,"d":"0.0"},1,0,""]
[12,{"$f":"'Wettkampf 1'!B21","v":"Olliges Kai"},{"$f":"'Wettkampf 1'!C21","v":"Börgerwald II"},null,"x","0",0,0,0,0,0,0,0,0,"0",0,0,0,{"$nulls":5},{"v":0,"d":"0.0"},1,0,""]
[13,{"$f":"'Wettkampf 1'!B22","v":"Zdralik Ingo"},{"$f":"'Wettkampf 1'!C22","v":"Börger II"},311.1,null,311.1,0,0,0,0,311.1,1,0,0,0,0,0,0,{"$nulls":5},{"v":0,"d":"0.0"},0,0,""]
[14,{"$f":"'Wettkampf 1'!B23","v":"Goldenstein Uwe"},{"$f":"'Wettkampf 1'!C23","v":"Börger II"},304.8,"x","0",0,0,0,0,"0",0,0,0,0,0,0,0,{"$nulls":5},{"v":0,"d":"0.0"},0,0,""]
[15,{"$f":"'Wettkampf 1'!B24","v":"Eckmann Mark"},{"$f":"'Wettkampf 1'!C24","v":"Börger II"},301.5,null,301.5,0,0,0,0,301.5,1,0,0,0,0,0,0,{"$nulls":5},{"v":0,"d":"0.0"},0,0,""]
[16,{"$f":"'Wettkampf 1'!B25","v":"Schulz Simon"},{"$f":"'Wettkampf 1'!C25","v":"Börger II"},299.8,"x","0",0,0,0,0,"0",0,0,0,0,0,0,0,{"$nulls":5},{"v":0,"d":"0.0"},0,0,""]
[17,{"$f":"'Wettkampf 1'!B26","v":"Schwarte Hermann"},{"$f":"'Wettkampf 1'!C26","v":"Börger II"},301.5,null,301.5,0,0,0,0,301.5,1,0,0,0,0,0,0,{"$nulls":5},{"v":0,"d":"0.0"},0,0,""]
[18,{"$f":"'Wettkampf 1'!B27","v":"Jungsthoefel Markus"},{"$f":"'Wettkampf 1'!C27","v":"Börger II"},303.5,null,303.5,0,0,0,0,303.5,1,0,0,0,0,0,0,{"$nulls":5},{"v":0,"d":"0.0"},0,0,""]
[19,{"$f":"'Wettkampf 1'!B28","v":"Aldfeld Helmut"},{"$f":"'Wettkampf 1'!C28","v":"Esterwegen III"},296.4,"x","0",0,0,0,0,0,0,"0",0,0,0,0,0,{"$nulls":5},{"v":0,"d":"0.0"},0,0,""]
[20,{"$f":"'Wettkampf 1'!B29","v":"Schulte Mathias"},{"$f":"'Wettkampf 1'!C29","v":"Esterwegen III"},308.4,null,308.4,0,0,0,0,0,0,308.4,1,0,0,0,0,{"$nulls":5},{"v":0,"d":"0.0"},0,0,""]
[21,{"$f":"'Wettkampf 1'!B30","v":"Middendorf Peter"},{"$f":"'Wettkampf 1'!C30","v":"Esterwegen III"},311.3,null,311.3,0,0,0,0,0,0,311.3,1,0,0,0,0,{"$nulls":5},{"v":0,"d":"0.0"},0,0,""]
[22,{"$f":"'Wettkampf 1'!B31","v":"Meibers Michael"},{"$f":"'Wettkampf 1'!C31","v":"Esterwegen III"},{"v":315,"d":"315.0"},null,{"v":315,"d":"315.0"},0,0,0,0,0,0,315,1,0,0,0,0,{"$nulls":5},{"v":0,"d":"0.0"},0,0,""]
[23,{"$f":"'Wettkampf 1'!B32","v":"Heidemann Jürgen"},{"$f":"'Wettkampf 1'!C32","v":"Esterwegen III"},305.1,"x","0",0,0,0,0,0,0,"0",0,0,0,0,0,{"$nulls":5},{"v":0,"d":"0.0"},0,0,""]
[24,{"$f":"'Wettkampf 1'!B33","v":"Lindemann Gerd"},{"$f":"'Wettkampf 1'!C33","v":"Esterwegen III"},310.4,null,310.4,0,0,0,0,0,0,310.4,1,0,0,0,0,{"$nulls":5},{"v":0,"d":"0.0"},0,0,""]
[25,{"$f":"'Wettkampf 1'!B34","v":"Hanenkamp Andre"},{"$f":"'Wettkampf 1'!C34","v":"Börgerwald II"},304.4,null,304.4,0,0,0,0,0,0,0,0,304.4,1,0,0,{"$nulls":5},{"v":0,"d":"0.0"},0,0,""]
[26,{"$f":"'Wettkampf 1'!B35","v":"Antons Mathias"},{"$f":"'Wettkampf 1'!C35","v":"Börgerwald II"},{"v":309,"d":"309.0"},null,{"v":309,"d":"309.0"},0,0,0,0,0,0,0,0,309,1,0,0,{"$nulls":5},{"v":0,"d":"0.0"},0,0,""]
[27,{"$f":"'Wettkampf 1'!B36","v":"Schröer Friedhelm"},{"$f":"'Wettkampf 1'!C36","v":"Börgerwald II"},309.3,null,309.3,0,0,0,0,0,0,0,0,309.3,1,0,0,{"$nulls":5},{"v":0,"d":"0.0"},0,0,""]
[28,{"$f":"'Wettkampf 1'!B37","v":"Sebers Tobias"},{"$f":"'Wettkampf 1'!C37","v":"Börgerwald II"},304.5,null,304.5,0,0,0,0,0,0,0,0,304.5,1,0,0,{"$nulls":5},{"v":0,"d":"0.0"},0,0,""]
[29,{"$f":"'Wettkampf 1'!B38","v":"Hanneken Moritz"},{"$f":"'Wettkampf 1'!C38","v":"Börgerwald II"},304.1,"x","0",0,0,0,0,0,0,0,0,"0",0,0,0,{"$nulls":5},{"v":0,"d":"0.0"},0,0,""]
[30,{"$f":"'Wettkampf 1'!B39","v":"Speeker Dietmar"},{"$f":"'Wettkampf 1'!C39","v":"Börgerwald II"},{"v":0,"d":"0.0"},"x","0",0,0,0,0,0,0,0,0,"0",0,0,0,{"$nulls":5},{"v":0,"d":"0.0"},1,0,""]
[31,{"$f":"'Wettkampf 1'!B40","v":"Will Achim"},{"$f":"'Wettkampf 1'!C40","v":"Spahnharrenstätte II"},313.5,null,313.5,0,0,0,0,0,0,0,0,0,0,313.5,1,{"$nulls":5},{"$f":"U40+V40+W40","v":{"v":0,"d":"0.0"}},{"$f":"IF(X40=D40,1,0)","v":0},{"$f":"IF(X40=0,0,1)","v":0},{"$f":"IF(Y40+Z40=2,\"Korrekt\",\"\")","v":""}]
[32,{"$f":"'Wettkampf 1'!B41","v":"Meyer Dirk"},{"$f":"'Wettkampf 1'!C41","v":"Spahnharrenstätte II"},312.6,null,312.6,0,0,0,0,0,0,0,0,0,0,312.6,1,{"$nulls":5},{"v":0,"d":"0.0"},0,0,""]
[33,{"$f":"'Wettkampf 1'!B42","v":"Micksch Heiko"},{"$f":"'Wettkampf 1'!C42","v":"Spahnharrenstätte II"},308.4,null,308.4,0,0,0,0,0,0,0,0,0,0,308.4,1,{"$nulls":5},{"v":0,"d":"0.0"},0,0,""]
[34,{"$f":"'Wettkampf 1'!B43","v":"Hahnenkamp Ulrich"},{"$f":"'Wettkampf 1'!C43","v":"Spahnharrenstätte II"},286.5,null,286.5,0,0,0,0,0,0,0,0,0,0,286.5,1,{"$nulls":5},{"v":0,"d":"0.0"},0,0,""]
[35,{"$f":"'Wettkampf 1'!B44","v":"Hahnenkamp Markus"},{"$f":"'Wettkampf 1'!C44","v":"Spahnharrenstätte II"},null,"x","0",0,0,0,0,0,0,0,0,0,0,"0",0,{"$nulls":5},{"v":0,"d":"0.0"},1,0,""]
[36,{"$f":"'Wettkampf 1'!B45","v":"Walker Stefan"},{"$f":"'Wettkampf 1'!C45","v":"Börgerwald II"},null,"x","0",0,0,0,0,0,0,0,0,"0",0,0,0,{"$nulls":5},{"$f":"U45+V45+W45","v":{"v":0,"d":"0.0"}},{"$f":"IF(X45=D45,1,0)","v":1},{"$f":"IF(X45=0,0,1)","v":0},{"$f":"IF(Y45+Z45=2,\"Korrekt\",\"\")","v":""}]
[{"$nulls":6},{"$f":"LARGE(G10:G45,1)+LARGE(G10:G45,2)+LARGE(G10:G45,3)","v":931.2},{"$f":"SUM(H10:H45)","v":4},{"$f":"LARGE(I10:I45,1)+LARGE(I10:I45,2)+LARGE(I10:I45,3)","v":938.6999999999999},{"$f":"SUM(J10:J45)","v":4},{"$f":"LARGE(K10:K45,1)+LARGE(K10:K45,2)+LARGE(K10:K45,3)","v":916.1},{"$f":"SUM(L10:L45)","v":4},{"$f":"LARGE(M10:M45,1)+LARGE(M10:M45,2)+LARGE(M10:M45,3)","v":936.6999999999999},{"$f":"SUM(N10:N45)","v":4},{"$f":"LARGE(O10:O45,1)+LARGE(O10:O45,2)+LARGE(O10:O45,3)","v":922.8},{"$f":"SUM(P10:P45)","v":4},{"$f":"LARGE(Q10:Q45,1)+LARGE(Q10:Q45,2)+LARGE(Q10:Q45,3)","v":934.5},{"$f":"SUM(R10:S45)","v":4}]
[null,null,"per Email an: sk-huemmling@gmx.de"]

{"sheet":"3","index":3,"n_rows":47,"n_cols":27,"rows_kept":47,"merged":[[0,22,0,23],[1,22,1,23],[4,22,4,23],[5,22,5,23],[6,22,6,23],[8,20,8,23]]}
[null,"Verein / Gruppe",null,"Ergebnisse",{"$nulls":17},"Austragungsort:",{"$f":"Übersicht!F4","v":"Börger"}]
[1,{"$f":"'Wettkampf 1'!B2","v":"Neuvrees I"},null,{"$f":"G46","v":924.7},{"$f":"IF(H46>4,\"Es sind zu viele Schützen in Wertung!\",\" \")","v":" "},{"$nulls":16},"Wettkampftag:",{"$f":"Übersicht!F3","v":"22.09."}]
[2,{"$f":"'Wettkampf 1'!B3","v":"Rastdorf III"},null,{"$f":"I46","v":935.6},{"$f":"IF(J46>4,\"Es sind zu viele Schützen in Wertung!\",\" \")","v":" "}]
[3,{"$f":"'Wettkampf 1'!B4","v":"Börger II"},null,{"$f":"K46","v":923.6},{"$f":"IF(L46>4,\"Es sind zu viele Schützen in Wertung!\",\" \")","v":" "},{"$nulls":18},"Ansprechpartner für Rückfragen:"]
[4,{"$f":"'Wettkampf 1'!B5","v":"Esterwegen III"},null,{"$f":"M46","v":935.7},{"$f":"IF(N46>4,\"Es sind zu viele Schützen in Wertung!\",\" \")","v":" "},{"$nulls":16},"Name:","Zdralik"]
[5,{"$f":"'Wettkampf 1'!B6","v":"Börgerwald II"},null,{"$f":"O46","v":{"v":930.4000000000001,"d":"930.4"}},{"$f":"IF(P46>4,\"Es sind zu viele Schützen in Wertung!\",\" \")","v":" "},{"$nulls":16},"Tel:","01713283862"]
[6,{"$f":"'Wettkampf 1'!B7","v":"Spahnharrenstätte II"},null,{"$f":"Q46","v":{"v":931.5999999999999,"d":"931.6"}},{"$f":"IF(R46>4,\"Es sind zu viele Schützen in Wertung!\",\" \")","v":" "},{"$nulls":16},"Standaufsicht:","Zdralik"]
[]
[null,"Einzelergebnisse:","Verein / Gruppe","Ergebnisse (mindestens 0 eintragen)","AW? Dann x eintippen",null,"Verein 1",null,"Verein 2",null,"Verein 3",null,"Verein 4",null,"Verein 5",null,"Verein 6",{"$nulls":3},"Proberechnung bei Streifen:"]
[1,{"$f":"'Wettkampf 1'!B10","v":"Rolfes Wilhelm"},{"$f":"'Wettkampf 1'!C10","v":"Neuvrees I"},293.4,"x",{"$f":"IF(E10=\"x\",\"0\",D10)","v":"0"},{"$f":"IF(C10=$B$2,F10,0)","v":"0"},{"$f":"(IF(AND($E10=\"\",$C10=$B$2),1,0))","v":0},{"$f":"IF($C10=$B$3,F10,0)","v":0},{"$f":"(IF(AND($E10=\"\",$C10=$B$3),1,0))","v":0},{"$f":"IF($C10=$B$4,F10,0)","v":0},{"$f":"(IF(AND($E10=\"\",$C10=$B$4),1,0))","v":0},{"$f":"IF($C10=$B$5,F10,0)","v":0},{"$f":"(IF(AND($E10=\"\",$C10=$B$5),1,0))","v":0},{"$f":"IF($C10=$B$6,F10,0)","v":0},{"$f":"(IF(AND($E10=\"\",$C10=$B$6),1,0))","v":0},{"$f":"IF($C10=$B$7,F10,0)","v":0},{"$f":"(IF(AND($E10=\"\",$C10=$B$7),1,0))","v":0},{"$nulls":5},{"$f":"U10+V10+W10","v":{"v":0,"d":"0.0"}},{"$f":"IF(X10=D10,1,0)","v":0},{"$f":"IF(X10=0,0,1)","v":0},{"$f":"IF(Y10+Z10=2,\"Korrekt\",\"\")","v":""}]
[2,{"$f":"'Wettkampf 1'!B11","v":"Steenken Klaus"},{"$f":"'Wettkampf 1'!C11","v":"Neuvrees I"},305.7,null,{"$f":"IF(E11=\"x\",\"0\",D11)","v":305.7},{"$f":"IF(C11=$B$2,F11,0)","v":305.7},{"$f":"(IF(AND($E11=\"\",$C11=$B$2),1,0))","v":1},{"$f":"IF($C11=$B$3,F11,0)","v":0},{"$f":"(IF(AND($E11=\"\",$C11=$B$3),1,0))","v":0},{"$f":"IF($C11=$B$4,F11,0)","v":0},{"$f":"(IF(AND($E11=\"\",$C11=$B$4),1,0))","v":0},{"$f":"IF($C11=$B$5,F11,0)","v":0},{"$f":"(IF(AND($E11=\"\",$C11=$B$5),1,0))","v":0},{"$f":"IF($C11=$B$6,F11,0)","v":0},{"$f":"(IF(AND($E11=\"\",$C11=$B$6),1,0))","v":0},{"$f":"IF($C11=$B$7,F11,0)","v":0},{"$f":"(IF(AND($E11=\"\",$C11=$B$7),1,0))","v":0},{"$nulls":5},{"$f":"U11+V11+W11","v":{"v":0,"d":"0.0"}},{"$f":"IF(X11=D11,1,0)","v":0},{"$f":"IF(X11=0,0,1)","v":0},{"$f":"IF(Y11+Z11=2,\"Korrekt\",\"\")","v":""}]
[3,{"$f":"'Wettkampf 1'!B12","v":"Breyer Wilfried"},{"$f":"'Wettkampf 1'!C12","v":"Neuvrees I"},308.5,null,308.5,308.5,1,0,0,0,0,0,0,0,0,0,0,{"$nulls":5},{"v":0,"d":"0.0"},0,0,""]
[4,{"$f":"'Wettkampf 1'!B13","v":"Janßen Markus"},{"$f":"'Wettkampf 1'!C13","v":"Neuvrees I"},310.5,null,310.5,310.5,1,0,0,0,0,0,0,0,0,0,0,{"$nulls":5},{"v":0,"d":"0.0"},0,0,""]
[5,{"$f":"'Wettkampf 1'!B14","v":"Thyen Werner"},{"$f":"'Wettkampf 1'!C14","v":"Neuvrees I"},302.9,null,302.9,302.9,1,0,0,0,0,0,0,0,0,0,0,{"$nulls":5},{"v":0,"d":"0.0"},0,0,""]
[6,{"$f":"'Wettkampf 1'!B15","v":"Peters Carsten"},{"$f":"'Wettkampf 1'!C15","v":"Neuvrees I"},{"v":0,"d":"0.0"},"x","0","0",0,0,0,0,0,0,0,0,0,0,0,{"$nulls":5},{"v":0,"d":"0.0"},1,0,""]
[7,{"$f":"'Wettkampf 1'!B16","v":"Wotte Robert"},{"$f":"'Wettkampf 1'!C16","v":"Rastdorf III"},313.7,null,313.7,0,0,313.7,1,0,0,0,0,0,0,0,0,{"$nulls":5},{"v":0,"d":"0.0"},0,0,""]
[8,{"$f":"'Wettkampf 1'!B17","v":"Müller Helmut"},{"$f":"'Wettkampf 1'!C17","v":"Rastdorf III"},309.8,null,309.8,0,0,309.8,1,0,0,0,0,0,0,0,0,{"$nulls":5},{"v":0,"d":"0.0"},0,0,""]
[9,{"$f":"'Wettkampf 1'!B18","v":"Bookjans Günther"},{"$f":"'Wettkampf 1'!C18","v":"Rastdorf III"},311.5,null,311.5,0,0,311.5,1,0,0,0,0,0,0,0,0,{"$nulls":5},{"v":0,"d":"0.0"},0,0,""]
[10,{"$f":"'Wettkampf 1'!B19","v":"Meer Michael"},{"$f":"'Wettkampf 1'!C19","v":"Rastdorf III"},310.4,null,310.4,0,0,310.4,1,0,0,0,0,0,0,0,0,{"$nulls":5},{"v":0,"d":"0.0"},0,0,""]
[11,{"$f":"'Wettkampf 1'!B20","v":"Lindemann Rita"},{"$f":"'Wettkampf 1'!C20","v":"Rastdorf III"},null,"x","0",0,0,"0",0,0,0,0,0,0,0,0,0,{"$nulls":5},{"v":0,"d":"0.0"},1,0,""]
[12,{"$f":"'Wettkampf 1'!B21","v":"Olliges Kai"},{"$f":"'Wettkampf 1'!C21","v":"Börgerwald II"},null,"x","0",0,0,0,0,0,0,0,0,"0",0,0,0,{"$nulls":5},{"v":0,"d":"0.0"},1,0,""]
[13,{"$f":"'Wettkampf 1'!B22","v":"Zdralik Ingo"},{"$f":"'Wettkampf 1'!C22","v":"Börger II"},310.9,null,310.9,0,0,0,0,310.9,1,0,0,0,0,0,0,{"$nulls":5},{"v":0,"d":"0.0"},0,0,""]
[14,{"$f":"'Wettkampf 1'!B23","v":"Goldenstein Uwe"},{"$f":"'Wettkampf 1'!C23","v":"Börger II"},304.1,null,304.1,0,0,0,0,304.1,1,0,0,0,0,0,0,{"$nulls":5},{"v":0,"d":"0.0"},0,0,""]
[15,{"$f":"'Wettkampf 1'!B24","v":"Eckmann Mark"},{"$f":"'Wettkampf 1'!C24","v":"Börger II"},304.1,"x","0",0,0,0,0,"0",0,0,0,0,0,0,0,{"$nulls":5},{"v":0,"d":"0.0"},0,0,""]
[16,{"$f":"'Wettkampf 1'!B25","v":"Schulz Simon"},{"$f":"'Wettkampf 1'!C25","v":"Börger II"},308.7,"x","0",0,0,0,0,"0",0,0,0,0,0,0,0,{"$nulls":5},{"v":0,"d":"0.0"},0,0,""]
[17,{"$f":"'Wettkampf 1'!B26","v":"Schwarte Hermann"},{"$f":"'Wettkampf 1'!C26","v":"Börger II"},307.3,null,307.3,0,0,0,0,307.3,1,0,0,0,0,0,0,{"$nulls":5},{"v":0,"d":"0.0"},0,0,""]
[18,{"$f":"'Wettkampf 1'!B27","v":"Jungsthoefel Markus"},{"$f":"'Wettkampf 1'!C27","v":"Börger II"},305.4,null,305.4,0,0,0,0,305.4,1,0,0,0,0,0,0,{"$nulls":5},{"v":0,"d":"0.0"},0,0,""]
[19,{"$f":"'Wettkampf 1'!B28","v":"Aldfeld Helmut"},{"$f":"'Wettkampf 1'!C28","v":"Esterwegen III"},{"v":0,"d":"0.0"},"x","0",0,0,0,0,0,0,"0",0,0,0,0,0,{"$nulls":5},{"v":0,"d":"0.0"},1,0,""]
[20,{"$f":"'Wettkampf 1'!B29","v":"Schulte Mathias"},{"$f":"'Wettkampf 1'!C29","v":"Esterwegen III"},310.6,null,310.6,0,0,0,0,0,0,310.6,1,0,0,0,0,{"$nulls":5},{"v":0,"d":"0.0"},0,0,""]
[21,{"$f":"'Wettkampf 1'!B30","v":"Middendorf Peter"},{"$f":"'Wettkampf 1'!C30","v":"Esterwegen III"},303.2,null,303.2,0,0,0,0,0,0,303.2,1,0,0,0,0,{"$nulls":5},{"v":0,"d":"0.0"},0,0,""]
[22,{"$f":"'Wettkampf 1'!B31","v":"Meibers Michael"},{"$f":"'Wettkampf 1'!C31","v":"Esterwegen III"},315.8,null,315.8,0,0,0,0,0,0,315.8,1,0,0,0,0,{"$nulls":5},{"v":0,"d":"0.0"},0,0,""]
[23,{"$f":"'Wettkampf 1'!B32","v":"Heidemann Jürgen"},{"$f":"'Wettkampf 1'!C32","v":"Esterwegen III"},309.3,null,309.3,0,0,0,0,0,0,309.3,1,0,0,0,0,{"$nulls":5},{"v":0,"d":"0.0"},0,0,""]
[24,{"$f":"'Wettkampf 1'!B33","v":"Lindemann Gerd"},{"$f":"'Wettkampf 1'!C33","v":"Esterwegen III"},300.8,"x","0",0,0,0,0,0,0,"0",0,0,0,0,0,{"$nulls":5},{"v":0,"d":"0.0"},0,0,""]
[25,{"$f":"'Wettkampf 1'!B34","v":"Hanenkamp Andre"},{"$f":"'Wettkampf 1'!C34","v":"Börgerwald II"},311.3,null,311.3,0,0,0,0,0,0,0,0,311.3,1,0,0,{"$nulls":5},{"v":0,"d":"0.0"},0,0,""]
[26,{"$f":"'Wettkampf 1'!B35","v":"Antons Mathias"},{"$f":"'Wettkampf 1'!C35","v":"Börgerwald II"},308.3,null,308.3,0,0,0,0,0,0,0,0,308.3,1,0,0,{"$nulls":5},{"v":0,"d":"0.0"},0,0,""]
[27,{"$f":"'Wettkampf 1'!B36","v":"Schröer Friedhelm"},{"$f":"'Wettkampf 1'!C36","v":"Börgerwald II"},307.8,null,307.8,0,0,0,0,0,0,0,0,307.8,1,0,0,{"$nulls":5},{"v":0,"d":"0.0"},0,0,""]
[28,{"$f":"'Wettkampf 1'!B37","v":"Sebers Tobias"},{"$f":"'Wettkampf 1'!C37","v":"Börgerwald II"},300.3,"x","0",0,0,0,0,0,0,0,0,"0",0,0,0,{"$nulls":5},{"v":0,"d":"0.0"},0,0,""]
[29,{"$f":"'Wettkampf 1'!B38","v":"Hanneken Moritz"},{"$f":"'Wettkampf 1'!C38","v":"Börgerwald II"},310.8,null,310.8,0,0,0,0,0,0,0,0,310.8,1,0,0,{"$nulls":5},{"v":0,"d":"0.0"},0,0,""]
[30,{"$f":"'Wettkampf 1'!B39","v":"Speeker Dietmar"},{"$f":"'Wettkampf 1'!C39","v":"Börgerwald II"},{"v":0,"d":"0.0"},"x","0",0,0,0,0,0,0,0,0,"0",0,0,0,{"$nulls":5},{"v":0,"d":"0.0"},1,0,""]
[31,{"$f":"'Wettkampf 1'!B40","v":"Will Achim"},{"$f":"'Wettkampf 1'!C40","v":"Spahnharrenstätte II"},309.9,null,309.9,0,0,0,0,0,0,0,0,0,0,309.9,1,{"$nulls":5},{"v":0,"d":"0.0"},0,0,""]
[32,{"$f":"'Wettkampf 1'!B41","v":"Meyer Dirk"},{"$f":"'Wettkampf 1'!C41","v":"Spahnharrenstätte II"},{"v":313,"d":"313.0"},null,{"v":313,"d":"313.0"},0,0,0,0,0,0,0,0,0,0,313,1,{"$nulls":5},{"v":0,"d":"0.0"},0,0,""]
[33,{"$f":"'Wettkampf 1'!B42","v":"Micksch Heiko"},{"$f":"'Wettkampf 1'!C42","v":"Spahnharrenstätte II"},308.7,null,308.7,0,0,0,0,0,0,0,0,0,0,308.7,1,{"$nulls":5},{"v":0,"d":"0.0"},0,0,""]
[34,{"$f":"'Wettkampf 1'!B43","v":"Hahnenkamp Ulrich"},{"$f":"'Wettkampf 1'!C43","v":"Spahnharrenstätte II"},null,null,{"v":0,"d":"0.0"},0,0,0,0,0,0,0,0,0,0,0,1,{"$nulls":5},{"v":0,"d":"0.0"},1,0,""]
[35,{"$f":"'Wettkampf 1'!B44","v":"Hahnenkamp Markus"},{"$f":"'Wettkampf 1'!C44","v":"Spahnharrenstätte II"},null,"x","0",0,0,0,0,0,0,0,0,0,0,"0",0,{"$nulls":5},{"v":0,"d":"0.0"},1,0,""]
[36,{"$f":"'Wettkampf 1'!B45","v":"Walker Stefan"},{"$f":"'Wettkampf 1'!C45","v":"Börgerwald II"},null,"x","0",0,0,0,0,0,0,0,0,"0",0,0,0,{"$nulls":5},{"v":0,"d":"0.0"},1,0,""]
[{"$nulls":6},{"$f":"LARGE(G10:G45,1)+LARGE(G10:G45,2)+LARGE(G10:G45,3)","v":924.7},{"$f":"SUM(H10:H45)","v":4},{"$f":"LARGE(I10:I45,1)+LARGE(I10:I45,2)+LARGE(I10:I45,3)","v":935.6},{"$f":"SUM(J10:J45)","v":4},{"$f":"LARGE(K10:K45,1)+LARGE(K10:K45,2)+LARGE(K10:K45,3)","v":923.6},{"$f":"SUM(L10:L45)","v":4},{"$f":"LARGE(M10:M45,1)+LARGE(M10:M45,2)+LARGE(M10:M45,3)","v":935.7},{"$f":"SUM(N10:N45)","v":4},{"$f":"LARGE(O10:O45,1)+LARGE(O10:O45,2)+LARGE(O10:O45,3)","v":930.4000000000001},{"$f":"SUM(P10:P45)","v":4},{"$f":"LARGE(Q10:Q45,1)+LARGE(Q10:Q45,2)+LARGE(Q10:Q45,3)","v":931.5999999999999},{"$f":"SUM(R10:S45)","v":4}]
[null,null,"per Email an: sk-huemmling@gmx.de"]

{"sheet":"4","index":4,"n_rows":47,"n_cols":27,"rows_kept":47,"merged":[[0,22,0,23],[1,22,1,23],[4,22,4,23],[5,22,5,23],[6,22,6,23],[8,20,8,23]]}
[null,"Verein / Gruppe",null,"Ergebnisse",{"$nulls":17},"Austragungsort:",{"$f":"Übersicht!G4","v":"Esterwegen"}]
[1,{"$f":"'Wettkampf 1'!B2","v":"Neuvrees I"},null,{"$f":"G46","v":929.7},{"$f":"IF(H46>4,\"Es sind zu viele Schützen in Wertung!\",\" \")","v":" "},{"$nulls":16},"Wettkampftag:",{"$f":"Übersicht!G3","v":"06.10."}]
[2,{"$f":"'Wettkampf 1'!B3","v":"Rastdorf III"},null,{"$f":"I46","v":929.8},{"$f":"IF(J46>4,\"Es sind zu viele Schützen in Wertung!\",\" \")","v":"Es sind zu viele Schützen in Wertung!"}]
[3,{"$f":"'Wettkampf 1'!B4","v":"Börger II"},null,{"$f":"K46","v":923.5},{"$f":"IF(L46>4,\"Es sind zu viele Schützen in Wertung!\",\" \")","v":" "},{"$nulls":18},"Ansprechpartner für Rückfragen:"]
[4,{"$f":"'Wettkampf 1'!B5","v":"Esterwegen III"},null,{"$f":"M46","v":938.6},{"$f":"IF(N46>4,\"Es sind zu viele Schützen in Wertung!\",\" \")","v":"Es sind zu viele Schützen in Wertung!"},{"$nulls":16},"Name:"]
[5,{"$f":"'Wettkampf 1'!B6","v":"Börgerwald II"},null,{"$f":"O46","v":931.3},{"$f":"IF(P46>4,\"Es sind zu viele Schützen in Wertung!\",\" \")","v":"Es sind zu viele Schützen in Wertung!"},{"$nulls":16},"Tel:"]
[6,{"$f":"'Wettkampf 1'!B7","v":"Spahnharrenstätte II"},null,{"$f":"Q46","v":935.7},{"$f":"IF(R46>4,\"Es sind zu viele Schützen in Wertung!\",\" \")","v":"Es sind zu viele Schützen in Wertung!"},{"$nulls":16},"Standaufsicht:","eintragen"]
[]
[null,"Einzelergebnisse:","Verein / Gruppe","Ergebnisse (mindestens 0 eintragen)","AW? Dann x eintippen",null,"Verein 1",null,"Verein 2",null,"Verein 3",null,"Verein 4",null,"Verein 5",null,"Verein 6",{"$nulls":3},"Proberechnung bei Streifen:"]
[1,{"$f":"'Wettkampf 1'!B10","v":"Rolfes Wilhelm"},{"$f":"'Wettkampf 1'!C10","v":"Neuvrees I"},301.6,"x",{"$f":"IF(E10=\"x\",\"0\",D10)","v":"0"},{"$f":"IF(C10=$B$2,F10,0)","v":"0"},{"$f":"(IF(AND($E10=\"\",$C10=$B$2),1,0))","v":0},{"$f":"IF($C10=$B$3,F10,0)","v":0},{"$f":"(IF(AND($E10=\"\",$C10=$B$3),1,0))","v":0},{"$f":"IF($C10=$B$4,F10,0)","v":0},{"$f":"(IF(AND($E10=\"\",$C10=$B$4),1,0))","v":0},{"$f":"IF($C10=$B$5,F10,0)","v":0},{"$f":"(IF(AND($E10=\"\",$C10=$B$5),1,0))","v":0},{"$f":"IF($C10=$B$6,F10,0)","v":0},{"$f":"(IF(AND($E10=\"\",$C10=$B$6),1,0))","v":0},{"$f":"IF($C10=$B$7,F10,0)","v":0},{"$f":"(IF(AND($E10=\"\",$C10=$B$7),1,0))","v":0},{"$nulls":5},{"$f":"U10+V10+W10","v":{"v":0,"d":"0.0"}},{"$f":"IF(X10=D10,1,0)","v":0},{"$f":"IF(X10=0,0,1)","v":0},{"$f":"IF(Y10+Z10=2,\"Korrekt\",\"\")","v":""}]
[2,{"$f":"'Wettkampf 1'!B11","v":"Steenken Klaus"},{"$f":"'Wettkampf 1'!C11","v":"Neuvrees I"},305.2,null,{"$f":"IF(E11=\"x\",\"0\",D11)","v":305.2},{"$f":"IF(C11=$B$2,F11,0)","v":305.2},{"$f":"(IF(AND($E11=\"\",$C11=$B$2),1,0))","v":1},{"$f":"IF($C11=$B$3,F11,0)","v":0},{"$f":"(IF(AND($E11=\"\",$C11=$B$3),1,0))","v":0},{"$f":"IF($C11=$B$4,F11,0)","v":0},{"$f":"(IF(AND($E11=\"\",$C11=$B$4),1,0))","v":0},{"$f":"IF($C11=$B$5,F11,0)","v":0},{"$f":"(IF(AND($E11=\"\",$C11=$B$5),1,0))","v":0},{"$f":"IF($C11=$B$6,F11,0)","v":0},{"$f":"(IF(AND($E11=\"\",$C11=$B$6),1,0))","v":0},{"$f":"IF($C11=$B$7,F11,0)","v":0},{"$f":"(IF(AND($E11=\"\",$C11=$B$7),1,0))","v":0},{"$nulls":5},{"$f":"U11+V11+W11","v":{"v":0,"d":"0.0"}},{"$f":"IF(X11=D11,1,0)","v":0},{"$f":"IF(X11=0,0,1)","v":0},{"$f":"IF(Y11+Z11=2,\"Korrekt\",\"\")","v":""}]
[3,{"$f":"'Wettkampf 1'!B12","v":"Breyer Wilfried"},{"$f":"'Wettkampf 1'!C12","v":"Neuvrees I"},311.3,null,311.3,311.3,1,0,0,0,0,0,0,0,0,0,0,{"$nulls":5},{"v":0,"d":"0.0"},0,0,""]
[4,{"$f":"'Wettkampf 1'!B13","v":"Janßen Markus"},{"$f":"'Wettkampf 1'!C13","v":"Neuvrees I"},313.2,null,313.2,313.2,1,0,0,0,0,0,0,0,0,0,0,{"$nulls":5},{"v":0,"d":"0.0"},0,0,""]
[5,{"$f":"'Wettkampf 1'!B14","v":"Thyen Werner"},{"$f":"'Wettkampf 1'!C14","v":"Neuvrees I"},304.7,"x","0","0",0,0,0,0,0,0,0,0,0,0,0,{"$nulls":5},{"v":0,"d":"0.0"},0,0,""]
[6,{"$f":"'Wettkampf 1'!B15","v":"Peters Carsten"},{"$f":"'Wettkampf 1'!C15","v":"Neuvrees I"},null,null,{"v":0,"d":"0.0"},0,1,0,0,0,0,0,0,0,0,0,0,{"$nulls":5},{"v":0,"d":"0.0"},1,0,""]
[7,{"$f":"'Wettkampf 1'!B16","v":"Wotte Robert"},{"$f":"'Wettkampf 1'!C16","v":"Rastdorf III"},308.4,null,308.4,0,0,308.4,1,0,0,0,0,0,0,0,0,{"$nulls":5},{"v":0,"d":"0.0"},0,0,""]
[8,{"$f":"'Wettkampf 1'!B17","v":"Müller Helmut"},{"$f":"'Wettkampf 1'!C17","v":"Rastdorf III"},306.9,null,306.9,0,0,306.9,1,0,0,0,0,0,0,0,0,{"$nulls":5},{"v":0,"d":"0.0"},0,0,""]
[9,{"$f":"'Wettkampf 1'!B18","v":"Bookjans Günther"},{"$f":"'Wettkampf 1'!C18","v":"Rastdorf III"},{"v":308,"d":"308.0"},null,{"v":308,"d":"308.0"},0,0,308,1,0,0,0,0,0,0,0,0,{"$nulls":5},{"v":0,"d":"0.0"},0,0,""]
[10,{"$f":"'Wettkampf 1'!B19","v":"Meer Michael"},{"$f":"'Wettkampf 1'!C19","v":"Rastdorf III"},313.4,null,313.4,0,0,313.4,1,0,0,0,0,0,0,0,0,{"$nulls":5},{"v":0,"d":"0.0"},0,0,""]
[11,{"$f":"'Wettkampf 1'!B20","v":"Lindemann Rita"},{"$f":"'Wettkampf 1'!C20","v":"Rastdorf III"},null,null,{"v":0,"d":"0.0"},0,0,0,1,0,0,0,0,0,0,0,0,{"$nulls":5},{"v":0,"d":"0.0"},1,0,""]
[12,{"$f":"'Wettkampf 1'!B21","v":"Olliges Kai"},{"$f":"'Wettkampf 1'!C21","v":"Börgerwald II"},null,null,{"v":0,"d":"0.0"},0,0,0,0,0,0,0,0,0,1,0,0,{"$nulls":5},{"v":0,"d":"0.0"},1,0,""]
[13,{"$f":"'Wettkampf 1'!B22","v":"Zdralik Ingo"},{"$f":"'Wettkampf 1'!C22","v":"Börger II"},313.7,null,313.7,0,0,0,0,313.7,1,0,0,0,0,0,0,{"$nulls":5},{"v":0,"d":"0.0"},0,0,""]
[14,{"$f":"'Wettkampf 1'!B23","v":"Goldenstein Uwe"},{"$f":"'Wettkampf 1'!C23","v":"Börger II"},304.8,"x","0",0,0,0,0,"0",0,0,0,0,0,0,0,{"$nulls":5},{"v":0,"d":"0.0"},0,0,""]
[15,{"$f":"'Wettkampf 1'!B24","v":"Eckmann Mark"},{"$f":"'Wettkampf 1'!C24","v":"Börger II"},301.7,"x","0",0,0,0,0,"0",0,0,0,0,0,0,0,{"$nulls":5},{"v":0,"d":"0.0"},0,0,""]
[16,{"$f":"'Wettkampf 1'!B25","v":"Schulz Simon"},{"$f":"'Wettkampf 1'!C25","v":"Börger II"},303.7,null,303.7,0,0,0,0,303.7,1,0,0,0,0,0,0,{"$nulls":5},{"v":0,"d":"0.0"},0,0,""]
[17,{"$f":"'Wettkampf 1'!B26","v":"Schwarte Hermann"},{"$f":"'Wettkampf 1'!C26","v":"Börger II"},302.5,null,302.5,0,0,0,0,302.5,1,0,0,0,0,0,0,{"$nulls":5},{"v":0,"d":"0.0"},0,0,""]
[18,{"$f":"'Wettkampf 1'!B27","v":"Jungsthoefel Markus"},{"$f":"'Wettkampf 1'!C27","v":"Börger II"},306.1,null,306.1,0,0,0,0,306.1,1,0,0,0,0,0,0,{"$nulls":5},{"v":0,"d":"0.0"},0,0,""]
[19,{"$f":"'Wettkampf 1'!B28","v":"Aldfeld Helmut"},{"$f":"'Wettkampf 1'!C28","v":"Esterwegen III"},null,null,{"v":0,"d":"0.0"},0,0,0,0,0,0,0,1,0,0,0,0,{"$nulls":5},{"v":0,"d":"0.0"},1,0,""]
[20,{"$f":"'Wettkampf 1'!B29","v":"Schulte Mathias"},{"$f":"'Wettkampf 1'!C29","v":"Esterwegen III"},312.7,null,312.7,0,0,0,0,0,0,312.7,1,0,0,0,0,{"$nulls":5},{"v":0,"d":"0.0"},0,0,""]
[21,{"$f":"'Wettkampf 1'!B30","v":"Middendorf Peter"},{"$f":"'Wettkampf 1'!C30","v":"Esterwegen III"},313.8,null,313.8,0,0,0,0,0,0,313.8,1,0,0,0,0,{"$nulls":5},{"v":0,"d":"0.0"},0,0,""]
[22,{"$f":"'Wettkampf 1'!B31","v":"Meibers Michael"},{"$f":"'Wettkampf 1'!C31","v":"Esterwegen III"},312.1,null,312.1,0,0,0,0,0,0,312.1,1,0,0,0,0,{"$nulls":5},{"v":0,"d":"0.0"},0,0,""]
[23,{"$f":"'Wettkampf 1'!B32","v":"Heidemann Jürgen"},{"$f":"'Wettkampf 1'!C32","v":"Esterwegen III"},null,null,{"v":0,"d":"0.0"},0,0,0,0,0,0,0,1,0,0,0,0,{"$nulls":5},{"v":0,"d":"0.0"},1,0,""]
[24,{"$f":"'Wettkampf 1'!B33","v":"Lindemann Gerd"},{"$f":"'Wettkampf 1'!C33","v":"Esterwegen III"},304.3,"x","0",0,0,0,0,0,0,"0",0,0,0,0,0,{"$nulls":5},{"v":0,"d":"0.0"},0,0,""]
[25,{"$f":"'Wettkampf 1'!B34","v":"Hanenkamp Andre"},{"$f":"'Wettkampf 1'!C34","v":"Börgerwald II"},{"v":313,"d":"313.0"},null,{"v":313,"d":"313.0"},0,0,0,0,0,0,0,0,313,1,0,0,{"$nulls":5},{"v":0,"d":"0.0"},0,0,""]
[26,{"$f":"'Wettkampf 1'!B35","v":"Antons Mathias"},{"$f":"'Wettkampf 1'!C35","v":"Börgerwald II"},303.3,null,303.3,0,0,0,0,0,0,0,0,303.3,1,0,0,{"$nulls":5},{"v":0,"d":"0.0"},0,0,""]
[27,{"$f":"'Wettkampf 1'!B36","v":"Schröer Friedhelm"},{"$f":"'Wettkampf 1'!C36","v":"Börgerwald II"},310.5,null,310.5,0,0,0,0,0,0,0,0,310.5,1,0,0,{"$nulls":5},{"v":0,"d":"0.0"},0,0,""]
[28,{"$f":"'Wettkampf 1'!B37","v":"Sebers Tobias"},{"$f":"'Wettkampf 1'!C37","v":"Börgerwald II"},307.7,"x","0",0,0,0,0,0,0,0,0,"0",0,0,0,{"$nulls":5},{"v":0,"d":"0.0"},0,0,""]
[29,{"$f":"'Wettkampf 1'!B38","v":"Hanneken Moritz"},{"$f":"'Wettkampf 1'!C38","v":"Börgerwald II"},307.8,null,307.8,0,0,0,0,0,0,0,0,307.8,1,0,0,{"$nulls":5},{"v":0,"d":"0.0"},0,0,""]
[30,{"$f":"'Wettkampf 1'!B39","v":"Speeker Dietmar"},{"$f":"'Wettkampf 1'!C39","v":"Börgerwald II"},null,null,{"v":0,"d":"0.0"},0,0,0,0,0,0,0,0,0,1,0,0,{"$nulls":5},{"v":0,"d":"0.0"},1,0,""]
[31,{"$f":"'Wettkampf 1'!B40","v":"Will Achim"},{"$f":"'Wettkampf 1'!C40","v":"Spahnharrenstätte II"},{"v":310,"d":"310.0"},null,{"v":310,"d":"310.0"},0,0,0,0,0,0,0,0,0,0,310,1,{"$nulls":5},{"v":0,"d":"0.0"},0,0,""]
[32,{"$f":"'Wettkampf 1'!B41","v":"Meyer Dirk"},{"$f":"'Wettkampf 1'!C41","v":"Spahnharrenstätte II"},312.9,null,312.9,0,0,0,0,0,0,0,0,0,0,312.9,1,{"$nulls":5},{"v":0,"d":"0.0"},0,0,""]
[33,{"$f":"'Wettkampf 1'!B42","v":"Micksch Heiko"},{"$f":"'Wettkampf 1'!C42","v":"Spahnharrenstätte II"},312.8,null,312.8,0,0,0,0,0,0,0,0,0,0,312.8,1,{"$nulls":5},{"v":0,"d":"0.0"},0,0,""]
[34,{"$f":"'Wettkampf 1'!B43","v":"Hahnenkamp Ulrich"},{"$f":"'Wettkampf 1'!C43","v":"Spahnharrenstätte II"},291.8,null,291.8,0,0,0,0,0,0,0,0,0,0,291.8,1,{"$nulls":5},{"v":0,"d":"0.0"},0,0,""]
[35,{"$f":"'Wettkampf 1'!B44","v":"Hahnenkamp Markus"},{"$f":"'Wettkampf 1'!C44","v":"Spahnharrenstätte II"},null,null,{"v":0,"d":"0.0"},0,0,0,0,0,0,0,0,0,0,0,1,{"$nulls":5},{"v":0,"d":"0.0"},1,0,""]
[36,{"$f":"'Wettkampf 1'!B45","v":"Walker Stefan"},{"$f":"'Wettkampf 1'!C45","v":"Börgerwald II"},290.3,"x","0",0,0,0,0,0,0,0,0,"0",0,0,0,{"$nulls":5},{"v":0,"d":"0.0"},0,0,""]
[{"$nulls":6},{"$f":"LARGE(G10:G45,1)+LARGE(G10:G45,2)+LARGE(G10:G45,3)","v":929.7},{"$f":"SUM(H10:H45)","v":4},{"$f":"LARGE(I10:I45,1)+LARGE(I10:I45,2)+LARGE(I10:I45,3)","v":929.8},{"$f":"SUM(J10:J45)","v":5},{"$f":"LARGE(K10:K45,1)+LARGE(K10:K45,2)+LARGE(K10:K45,3)","v":923.5},{"$f":"SUM(L10:L45)","v":4},{"$f":"LARGE(M10:M45,1)+LARGE(M10:M45,2)+LARGE(M10:M45,3)","v":938.6},{"$f":"SUM(N10:N45)","v":5},{"$f":"LARGE(O10:O45,1)+LARGE(O10:O45,2)+LARGE(O10:O45,3)","v":931.3},{"$f":"SUM(P10:P45)","v":6},{"$f":"LARGE(Q10:Q45,1)+LARGE(Q10:Q45,2)+LARGE(Q10:Q45,3)","v":935.7},{"$f":"SUM(R10:S45)","v":5}]
[null,null,"per Email an: sk-huemmling@gmx.de"]

{"sheet":"5","index":5,"n_rows":47,"n_cols":27,"rows_kept":47,"merged":[[0,22,0,23],[1,22,1,23],[4,22,4,23],[5,22,5,23],[6,22,6,23],[8,20,8,23]]}
[null,"Verein / Gruppe",null,"Ergebnisse",{"$nulls":17},"Austragungsort:",{"$f":"Übersicht!H4","v":"Börgerwald"}]
[1,{"$f":"'Wettkampf 1'!B2","v":"Neuvrees I"},null,{"$f":"G46","v":936.5},{"$f":"IF(H46>4,\"Es sind zu viele Schützen in Wertung!\",\" \")","v":" "},{"$nulls":16},"Wettkampftag:",{"$f":"Übersicht!H3","v":"20.10."}]
[2,{"$f":"'Wettkampf 1'!B3","v":"Rastdorf III"},null,{"$f":"I46","v":946.3},{"$f":"IF(J46>4,\"Es sind zu viele Schützen in Wertung!\",\" \")","v":" "}]
[3,{"$f":"'Wettkampf 1'!B4","v":"Börger II"},null,{"$f":"K46","v":934.2},{"$f":"IF(L46>4,\"Es sind zu viele Schützen in Wertung!\",\" \")","v":" "},{"$nulls":18},"Ansprechpartner für Rückfragen:"]
[4,{"$f":"'Wettkampf 1'!B5","v":"Esterwegen III"},null,{"$f":"M46","v":{"v":941.6999999999999,"d":"941.7"}},{"$f":"IF(N46>4,\"Es sind zu viele Schützen in Wertung!\",\" \")","v":" "},{"$nulls":16},"Name:","Antons, Mathis"]
[5,{"$f":"'Wettkampf 1'!B6","v":"Börgerwald II"},null,{"$f":"O46","v":{"v":931.3000000000001,"d":"931.3"}},{"$f":"IF(P46>4,\"Es sind zu viele Schützen in Wertung!\",\" \")","v":" "},{"$nulls":16},"Tel:","015252103868"]
[6,{"$f":"'Wettkampf 1'!B7","v":"Spahnharrenstätte II"},null,{"$f":"Q46","v":{"v":940.9000000000001,"d":"940.9"}},{"$f":"IF(R46>4,\"Es sind zu viele Schützen in Wertung!\",\" \")","v":" "},{"$nulls":16},"Standaufsicht:","Antons, Mathis"]
[]
[null,"Einzelergebnisse:","Verein / Gruppe","Ergebnisse (mindestens 0 eintragen)","AW? Dann x eintippen",null,"Verein 1",null,"Verein 2",null,"Verein 3",null,"Verein 4",null,"Verein 5",null,"Verein 6",{"$nulls":3},"Proberechnung bei Streifen:"]
[1,{"$f":"'Wettkampf 1'!B10","v":"Rolfes Wilhelm"},{"$f":"'Wettkampf 1'!C10","v":"Neuvrees I"},308.8,null,{"$f":"IF(E10=\"x\",\"0\",D10)","v":308.8},{"$f":"IF(C10=$B$2,F10,0)","v":308.8},{"$f":"(IF(AND($E10=\"\",$C10=$B$2),1,0))","v":1},{"$f":"IF($C10=$B$3,F10,0)","v":0},{"$f":"(IF(AND($E10=\"\",$C10=$B$3),1,0))","v":0},{"$f":"IF($C10=$B$4,F10,0)","v":0},{"$f":"(IF(AND($E10=\"\",$C10=$B$4),1,0))","v":0},{"$f":"IF($C10=$B$5,F10,0)","v":0},{"$f":"(IF(AND($E10=\"\",$C10=$B$5),1,0))","v":0},{"$f":"IF($C10=$B$6,F10,0)","v":0},{"$f":"(IF(AND($E10=\"\",$C10=$B$6),1,0))","v":0},{"$f":"IF($C10=$B$7,F10,0)","v":0},{"$f":"(IF(AND($E10=\"\",$C10=$B$7),1,0))","v":0},null,null,103.1,103.3,102.4,{"$f":"U10+V10+W10","v":{"v":308.79999999999995,"d":"308.8"}},{"$f":"IF(X10=D10,1,0)","v":1},{"$f":"IF(X10=0,0,1)","v":1},{"$f":"IF(Y10+Z10=2,\"Korrekt\",\"\")","v":"Korrekt"}]
[2,{"$f":"'Wettkampf 1'!B11","v":"Steenken Klaus"},{"$f":"'Wettkampf 1'!C11","v":"Neuvrees I"},308.1,null,{"$f":"IF(E11=\"x\",\"0\",D11)","v":308.1},{"$f":"IF(C11=$B$2,F11,0)","v":308.1},{"$f":"(IF(AND($E11=\"\",$C11=$B$2),1,0))","v":1},{"$f":"IF($C11=$B$3,F11,0)","v":0},{"$f":"(IF(AND($E11=\"\",$C11=$B$3),1,0))","v":0},{"$f":"IF($C11=$B$4,F11,0)","v":0},{"$f":"(IF(AND($E11=\"\",$C11=$B$4),1,0))","v":0},{"$f":"IF($C11=$B$5,F11,0)","v":0},{"$f":"(IF(AND($E11=\"\",$C11=$B$5),1,0))","v":0},{"$f":"IF($C11=$B$6,F11,0)","v":0},{"$f":"(IF(AND($E11=\"\",$C11=$B$6),1,0))","v":0},{"$f":"IF($C11=$B$7,F11,0)","v":0},{"$f":"(IF(AND($E11=\"\",$C11=$B$7),1,0))","v":0},null,null,103.9,{"v":102,"d":"102.0"},102.2,{"$f":"U11+V11+W11","v":308.1},{"$f":"IF(X11=D11,1,0)","v":1},{"$f":"IF(X11=0,0,1)","v":1},{"$f":"IF(Y11+Z11=2,\"Korrekt\",\"\")","v":"Korrekt"}]
[3,{"$f":"'Wettkampf 1'!B12","v":"Breyer Wilfried"},{"$f":"'Wettkampf 1'!C12","v":"Neuvrees I"},312.1,null,312.1,312.1,1,0,0,0,0,0,0,0,0,0,0,null,null,102.3,104.8,{"v":105,"d":"105.0"},312.1,1,1,"Korrekt"]
[4,{"$f":"'Wettkampf 1'!B13","v":"Janßen Markus"},{"$f":"'Wettkampf 1'!C13","v":"Neuvrees I"},315.6,null,315.6,315.6,1,0,0,0,0,0,0,0,0,0,0,null,null,104.7,105.9,{"v":105,"d":"105.0"},315.6,1,1,"Korrekt"]
[5,{"$f":"'Wettkampf 1'!B14","v":"Thyen Werner"},{"$f":"'Wettkampf 1'!C14","v":"Neuvrees I"},{"v":303,"d":"303.0"},"x","0","0",0,0,0,0,0,0,0,0,0,0,0,null,null,100.1,102.2,100.7,{"v":303,"d":"303.0"},1,1,"Korrekt"]
[6,{"$f":"'Wettkampf 1'!B15","v":"Peters Carsten"},{"$f":"'Wettkampf 1'!C15","v":"Neuvrees I"},{"v":0,"d":"0.0"},"x","0","0",0,0,0,0,0,0,0,0,0,0,0,{"$nulls":5},{"v":0,"d":"0.0"},1,0,""]
[7,{"$f":"'Wettkampf 1'!B16","v":"Wotte Robert"},{"$f":"'Wettkampf 1'!C16","v":"Rastdorf III"},315.3,null,315.3,0,0,315.3,1,0,0,0,0,0,0,0,0,null,null,105.6,105.1,104.6,{"v":315.29999999999995,"d":"315.3"},1,1,"Korrekt"]
[8,{"$f":"'Wettkampf 1'!B17","v":"Müller Helmut"},{"$f":"'Wettkampf 1'!C17","v":"Rastdorf III"},308.3,null,308.3,0,0,308.3,1,0,0,0,0,0,0,0,0,null,null,102.2,103.6,102.5,308.3,1,1,"Korrekt"]
[9,{"$f":"'Wettkampf 1'!B18","v":"Bookjans Günther"},{"$f":"'Wettkampf 1'!C18","v":"Rastdorf III"},316.7,null,316.7,0,0,316.7,1,0,0,0,0,0,0,0,0,null,null,105.2,105.1,106.4,{"v":316.70000000000005,"d":"316.7"},1,1,"Korrekt"]
[10,{"$f":"'Wettkampf 1'!B19","v":"Meer Michael"},{"$f":"'Wettkampf 1'!C19","v":"Rastdorf III"},314.3,null,314.3,0,0,314.3,1,0,0,0,0,0,0,0,0,null,null,{"v":103,"d":"103.0"},{"v":105,"d":"105.0"},106.3,314.3,1,1,"Korrekt"]
[11,{"$f":"'Wettkampf 1'!B20","v":"Lindemann Rita"},{"$f":"'Wettkampf 1'!C20","v":"Rastdorf III"},{"v":0,"d":"0.0"},"x","0",0,0,"0",0,0,0,0,0,0,0,0,0,{"$nulls":5},{"v":0,"d":"0.0"},1,0,""]
[12,{"$f":"'Wettkampf 1'!B21","v":"Olliges Kai"},{"$f":"'Wettkampf 1'!C21","v":"Börgerwald II"},{"v":0,"d":"0.0"},"x","0",0,0,0,0,0,0,0,0,"0",0,0,0,{"$nulls":5},{"v":0,"d":"0.0"},1,0,""]
[13,{"$f":"'Wettkampf 1'!B22","v":"Zdralik Ingo"},{"$f":"'Wettkampf 1'!C22","v":"Börger II"},318.8,null,318.8,0,0,0,0,318.8,1,0,0,0,0,0,0,null,null,105.7,106.7,106.4,318.8,1,1,"Korrekt"]
[14,{"$f":"'Wettkampf 1'!B23","v":"Goldenstein Uwe"},{"$f":"'Wettkampf 1'!C23","v":"Börger II"},307.9,null,307.9,0,0,0,0,307.9,1,0,0,0,0,0,0,null,null,99.8,104.2,103.9,307.9,1,1,"Korrekt"]
[15,{"$f":"'Wettkampf 1'!B24","v":"Eckmann Mark"},{"$f":"'Wettkampf 1'!C24","v":"Börger II"},311.3,"x","0",0,0,0,0,"0",0,0,0,0,0,0,0,null,null,102.7,104.4,104.2,311.3,1,1,"Korrekt"]
[16,{"$f":"'Wettkampf 1'!B25","v":"Schulz Simon"},{"$f":"'Wettkampf 1'!C25","v":"Börger II"},304.8,null,304.8,0,0,0,0,304.8,1,0,0,0,0,0,0,null,null,101.1,102.7,{"v":101,"d":"101.0"},304.8,1,1,"Korrekt"]
[17,{"$f":"'Wettkampf 1'!B26","v":"Schwarte Hermann"},{"$f":"'Wettkampf 1'!C26","v":"Börger II"},304.7,"x","0",0,0,0,0,"0",0,0,0,0,0,0,0,null,null,101.1,100.3,103.3,304.7,1,1,"Korrekt"]
[18,{"$f":"'Wettkampf 1'!B27","v":"Jungsthoefel Markus"},{"$f":"'Wettkampf 1'!C27","v":"Börger II"},307.5,null,307.5,0,0,0,0,307.5,1,0,0,0,0,0,0,null,null,101.7,102.8,{"v":103,"d":"103.0"},307.5,1,1,"Korrekt"]
[19,{"$f":"'Wettkampf 1'!B28","v":"Aldfeld Helmut"},{"$f":"'Wettkampf 1'!C28","v":"Esterwegen III"},304.6,null,304.6,0,0,0,0,0,0,304.6,1,0,0,0,0,null,null,99.7,101.5,103.4,304.6,1,1,"Korrekt"]
[20,{"$f":"'Wettkampf 1'!B29","v":"Schulte Mathias"},{"$f":"'Wettkampf 1'!C29","v":"Esterwegen III"},311.9,null,311.9,0,0,0,0,0,0,311.9,1,0,0,0,0,null,null,102.2,105.6,104.1,311.9,1,1,"Korrekt"]
[21,{"$f":"'Wettkampf 1'!B30","v":"Middendorf Peter"},{"$f":"'Wettkampf 1'!C30","v":"Esterwegen III"},313.4,null,313.4,0,0,0,0,0,0,313.4,1,0,0,0,0,null,null,104.5,103.7,105.2,313.4,1,1,"Korrekt"]
[22,{"$f":"'Wettkampf 1'!B31","v":"Meibers Michael"},{"$f":"'Wettkampf 1'!C31","v":"Esterwegen III"},316.4,null,316.4,0,0,0,0,0,0,316.4,1,0,0,0,0,null,null,106.3,104.6,105.5,316.4,1,1,"Korrekt"]
[23,{"$f":"'Wettkampf 1'!B32","v":"Heidemann Jürgen"},{"$f":"'Wettkampf 1'!C32","v":"Esterwegen III"},{"v":0,"d":"0.0"},"x","0",0,0,0,0,0,0,"0",0,0,0,0,0,{"$nulls":5},{"v":0,"d":"0.0"},1,0,""]
[24,{"$f":"'Wettkampf 1'!B33","v":"Lindemann Gerd"},{"$f":"'Wettkampf 1'!C33","v":"Esterwegen III"},{"v":0,"d":"0.0"},"x","0",0,0,0,0,0,0,"0",0,0,0,0,0,{"$nulls":5},{"v":0,"d":"0.0"},1,0,""]
[25,{"$f":"'Wettkampf 1'!B34","v":"Hanenkamp Andre"},{"$f":"'Wettkampf 1'!C34","v":"Börgerwald II"},310.9,null,310.9,0,0,0,0,0,0,0,0,310.9,1,0,0,null,null,104.1,103.1,103.7,310.9,1,1,"Korrekt"]
[26,{"$f":"'Wettkampf 1'!B35","v":"Antons Mathias"},{"$f":"'Wettkampf 1'!C35","v":"Börgerwald II"},309.1,null,309.1,0,0,0,0,0,0,0,0,309.1,1,0,0,null,null,101.5,104.3,103.3,309.1,1,1,"Korrekt"]
[27,{"$f":"'Wettkampf 1'!B36","v":"Schröer Friedhelm"},{"$f":"'Wettkampf 1'!C36","v":"Börgerwald II"},311.3,null,311.3,0,0,0,0,0,0,0,0,311.3,1,0,0,null,null,103.1,103.7,104.5,311.3,1,1,"Korrekt"]
[28,{"$f":"'Wettkampf 1'!B37","v":"Sebers Tobias"},{"$f":"'Wettkampf 1'!C37","v":"Börgerwald II"},302.3,"x","0",0,0,0,0,0,0,0,0,"0",0,0,0,null,null,100.8,101.8,99.7,302.3,1,1,"Korrekt"]
[29,{"$f":"'Wettkampf 1'!B38","v":"Hanneken Moritz"},{"$f":"'Wettkampf 1'!C38","v":"Börgerwald II"},306.8,null,306.8,0,0,0,0,0,0,0,0,306.8,1,0,0,null,null,102.3,101.2,103.3,306.8,1,1,"Korrekt"]
[30,{"$f":"'Wettkampf 1'!B39","v":"Speeker Dietmar"},{"$f":"'Wettkampf 1'!C39","v":"Börgerwald II"},{"v":0,"d":"0.0"},"x","0",0,0,0,0,0,0,0,0,"0",0,0,0,{"$nulls":5},{"v":0,"d":"0.0"},1,0,""]
[31,{"$f":"'Wettkampf 1'!B40","v":"Will Achim"},{"$f":"'Wettkampf 1'!C40","v":"Spahnharrenstätte II"},{"v":312,"d":"312.0"},null,{"v":312,"d":"312.0"},0,0,0,0,0,0,0,0,0,0,312,1,null,null,103.4,103.5,105.1,{"v":312,"d":"312.0"},1,1,"Korrekt"]
[32,{"$f":"'Wettkampf 1'!B41","v":"Meyer Dirk"},{"$f":"'Wettkampf 1'!C41","v":"Spahnharrenstätte II"},314.1,null,314.1,0,0,0,0,0,0,0,0,0,0,314.1,1,null,null,104.3,104.3,105.5,314.1,1,1,"Korrekt"]
[33,{"$f":"'Wettkampf 1'!B42","v":"Micksch Heiko"},{"$f":"'Wettkampf 1'!C42","v":"Spahnharrenstätte II"},314.8,null,314.8,0,0,0,0,0,0,0,0,0,0,314.8,1,null,null,103.3,105.6,105.9,{"v":314.79999999999995,"d":"314.8"},1,1,"Korrekt"]
[34,{"$f":"'Wettkampf 1'!B43","v":"Hahnenkamp Ulrich"},{"$f":"'Wettkampf 1'!C43","v":"Spahnharrenstätte II"},297.3,"x","0",0,0,0,0,0,0,0,0,0,0,"0",0,null,null,101.2,98.7,97.4,297.3,1,1,"Korrekt"]
[35,{"$f":"'Wettkampf 1'!B44","v":"Hahnenkamp Markus"},{"$f":"'Wettkampf 1'!C44","v":"Spahnharrenstätte II"},298.9,null,298.9,0,0,0,0,0,0,0,0,0,0,298.9,1,null,null,98.8,100.4,99.7,298.9,1,1,"Korrekt"]
[36,{"$f":"'Wettkampf 1'!B45","v":"Walker Stefan"},{"$f":"'Wettkampf 1'!C45","v":"Börgerwald II"},287.9,"x","0",0,0,0,0,0,0,0,0,"0",0,0,0,null,null,91.2,95.7,{"v":101,"d":"101.0"},287.9,1,1,"Korrekt"]
[{"$nulls":6},{"$f":"LARGE(G10:G45,1)+LARGE(G10:G45,2)+LARGE(G10:G45,3)","v":936.5},{"$f":"SUM(H10:H45)","v":4},{"$f":"LARGE(I10:I45,1)+LARGE(I10:I45,2)+LARGE(I10:I45,3)","v":946.3},{"$f":"SUM(J10:J45)","v":4},{"$f":"LARGE(K10:K45,1)+LARGE(K10:K45,2)+LARGE(K10:K45,3)","v":934.2},{"$f":"SUM(L10:L45)","v":4},{"$f":"LARGE(M10:M45,1)+LARGE(M10:M45,2)+LARGE(M10:M45,3)","v":941.6999999999999},{"$f":"SUM(N10:N45)","v":4},{"$f":"LARGE(O10:O45,1)+LARGE(O10:O45,2)+LARGE(O10:O45,3)","v":931.3000000000001},{"$f":"SUM(P10:P45)","v":4},{"$f":"LARGE(Q10:Q45,1)+LARGE(Q10:Q45,2)+LARGE(Q10:Q45,3)","v":940.9000000000001},{"$f":"SUM(R10:S45)","v":4}]
[null,null,"per Email an: sk-huemmling@gmx.de"]

{"sheet":"6","index":6,"n_rows":47,"n_cols":27,"rows_kept":47,"merged":[[0,22,0,23],[1,22,1,23],[4,22,4,23],[5,22,5,23],[6,22,6,23],[8,20,8,23]]}
[null,"Verein / Gruppe",null,"Ergebnisse",{"$nulls":17},"Austragungsort:",{"$f":"Übersicht!I4","v":"Spahnharrenstätte"}]
[1,{"$f":"'Wettkampf 1'!B2","v":"Neuvrees I"},null,{"$f":"G46","v":934.1},{"$f":"IF(H46>4,\"Es sind zu viele Schützen in Wertung!\",\" \")","v":" "},{"$nulls":16},"Wettkampftag:",{"$f":"Übersicht!I3","v":"24.11."}]
[2,{"$f":"'Wettkampf 1'!B3","v":"Rastdorf III"},null,{"$f":"I46","v":939.2},{"$f":"IF(J46>4,\"Es sind zu viele Schützen in Wertung!\",\" \")","v":" "}]
[3,{"$f":"'Wettkampf 1'!B4","v":"Börger II"},null,{"$f":"K46","v":{"v":923.1999999999999,"d":"923.2"}},{"$f":"IF(L46>4,\"Es sind zu viele Schützen in Wertung!\",\" \")","v":" "},{"$nulls":18},"Ansprechpartner für Rückfragen:"]
[4,{"$f":"'Wettkampf 1'!B5","v":"Esterwegen III"},null,{"$f":"M46","v":936.1},{"$f":"IF(N46>4,\"Es sind zu viele Schützen in Wertung!\",\" \")","v":" "},{"$nulls":16},"Name:","Achim Will"]
[5,{"$f":"'Wettkampf 1'!B6","v":"Börgerwald II"},null,{"$f":"O46","v":930.7},{"$f":"IF(P46>4,\"Es sind zu viele Schützen in Wertung!\",\" \")","v":" "},{"$nulls":16},"Tel:"]
[6,{"$f":"'Wettkampf 1'!B7","v":"Spahnharrenstätte II"},null,{"$f":"Q46","v":{"v":937,"d":"937.0"}},{"$f":"IF(R46>4,\"Es sind zu viele Schützen in Wertung!\",\" \")","v":" "},{"$nulls":16},"Standaufsicht:","Achim Will"]
[]
[null,"Einzelergebnisse:","Verein / Gruppe","Ergebnisse (mindestens 0 eintragen)","AW? Dann x eintippen",null,"Verein 1",null,"Verein 2",null,"Verein 3",null,"Verein 4",null,"Verein 5",null,"Verein 6",{"$nulls":3},"Proberechnung bei Streifen:"]
[1,{"$f":"'Wettkampf 1'!B10","v":"Rolfes Wilhelm"},{"$f":"'Wettkampf 1'!C10","v":"Neuvrees I"},311.6,null,{"$f":"IF(E10=\"x\",\"0\",D10)","v":311.6},{"$f":"IF(C10=$B$2,F10,0)","v":311.6},{"$f":"(IF(AND($E10=\"\",$C10=$B$2),1,0))","v":1},{"$f":"IF($C10=$B$3,F10,0)","v":0},{"$f":"(IF(AND($E10=\"\",$C10=$B$3),1,0))","v":0},{"$f":"IF($C10=$B$4,F10,0)","v":0},{"$f":"(IF(AND($E10=\"\",$C10=$B$4),1,0))","v":0},{"$f":"IF($C10=$B$5,F10,0)","v":0},{"$f":"(IF(AND($E10=\"\",$C10=$B$5),1,0))","v":0},{"$f":"IF($C10=$B$6,F10,0)","v":0},{"$f":"(IF(AND($E10=\"\",$C10=$B$6),1,0))","v":0},{"$f":"IF($C10=$B$7,F10,0)","v":0},{"$f":"(IF(AND($E10=\"\",$C10=$B$7),1,0))","v":0},null,null,103.5,104.4,103.7,{"$f":"U10+V10+W10","v":311.6},{"$f":"IF(X10=D10,1,0)","v":1},{"$f":"IF(X10=0,0,1)","v":1},{"$f":"IF(Y10+Z10=2,\"Korrekt\",\"\")","v":"Korrekt"}]
[2,{"$f":"'Wettkampf 1'!B11","v":"Steenken Klaus"},{"$f":"'Wettkampf 1'!C11","v":"Neuvrees I"},309.2,null,{"$f":"IF(E11=\"x\",\"0\",D11)","v":309.2},{"$f":"IF(C11=$B$2,F11,0)","v":309.2},{"$f":"(IF(AND($E11=\"\",$C11=$B$2),1,0))","v":1},{"$f":"IF($C11=$B$3,F11,0)","v":0},{"$f":"(IF(AND($E11=\"\",$C11=$B$3),1,0))","v":0},{"$f":"IF($C11=$B$4,F11,0)","v":0},{"$f":"(IF(AND($E11=\"\",$C11=$B$4),1,0))","v":0},{"$f":"IF($C11=$B$5,F11,0)","v":0},{"$f":"(IF(AND($E11=\"\",$C11=$B$5),1,0))","v":0},{"$f":"IF($C11=$B$6,F11,0)","v":0},{"$f":"(IF(AND($E11=\"\",$C11=$B$6),1,0))","v":0},{"$f":"IF($C11=$B$7,F11,0)","v":0},{"$f":"(IF(AND($E11=\"\",$C11=$B$7),1,0))","v":0},null,null,101.9,103.9,103.4,{"$f":"U11+V11+W11","v":{"v":309.20000000000005,"d":"309.2"}},{"$f":"IF(X11=D11,1,0)","v":1},{"$f":"IF(X11=0,0,1)","v":1},{"$f":"IF(Y11+Z11=2,\"Korrekt\",\"\")","v":"Korrekt"}]
[3,{"$f":"'Wettkampf 1'!B12","v":"Breyer Wilfried"},{"$f":"'Wettkampf 1'!C12","v":"Neuvrees I"},312.9,null,312.9,312.9,1,0,0,0,0,0,0,0,0,0,0,null,null,103.8,105.4,103.7,312.9,1,1,"Korrekt"]
[4,{"$f":"'Wettkampf 1'!B13","v":"Janßen Markus"},{"$f":"'Wettkampf 1'!C13","v":"Neuvrees I"},309.6,null,309.6,309.6,1,0,0,0,0,0,0,0,0,0,0,null,null,103.6,102.6,103.6,{"v":309.79999999999995,"d":"309.8"},0,1,""]
[5,{"$f":"'Wettkampf 1'!B14","v":"Thyen Werner"},{"$f":"'Wettkampf 1'!C14","v":"Neuvrees I"},303.3,"X","0","0",0,0,0,0,0,0,0,0,0,0,0,null,null,101.3,{"v":99,"d":"99.0"},{"v":103,"d":"103.0"},303.3,1,1,"Korrekt"]
[6,{"$f":"'Wettkampf 1'!B15","v":"Peters Carsten"},{"$f":"'Wettkampf 1'!C15","v":"Neuvrees I"},{"v":0,"d":"0.0"},"X","0","0",0,0,0,0,0,0,0,0,0,0,0,{"$nulls":5},{"v":0,"d":"0.0"},1,0,""]
[7,{"$f":"'Wettkampf 1'!B16","v":"Wotte Robert"},{"$f":"'Wettkampf 1'!C16","v":"Rastdorf III"},313.1,null,313.1,0,0,313.1,1,0,0,0,0,0,0,0,0,null,null,103.8,104.9,104.4,313.1,1,1,"Korrekt"]
[8,{"$f":"'Wettkampf 1'!B17","v":"Müller Helmut"},{"$f":"'Wettkampf 1'!C17","v":"Rastdorf III"},{"v":312,"d":"312.0"},null,{"v":312,"d":"312.0"},0,0,312,1,0,0,0,0,0,0,0,0,null,null,105.1,102.8,104.1,{"v":312,"d":"312.0"},1,1,"Korrekt"]
[9,{"$f":"'Wettkampf 1'!B18","v":"Bookjans Günther"},{"$f":"'Wettkampf 1'!C18","v":"Rastdorf III"},314.1,null,314.1,0,0,314.1,1,0,0,0,0,0,0,0,0,null,null,104.8,103.5,105.8,314.1,1,1,"Korrekt"]
[10,{"$f":"'Wettkampf 1'!B19","v":"Meer Michael"},{"$f":"'Wettkampf 1'!C19","v":"Rastdorf III"},311.8,null,311.8,0,0,311.8,1,0,0,0,0,0,0,0,0,null,null,{"v":104,"d":"104.0"},{"v":105,"d":"105.0"},102.8,311.8,1,1,"Korrekt"]
[11,{"$f":"'Wettkampf 1'!B20","v":"Lindemann Rita"},{"$f":"'Wettkampf 1'!C20","v":"Rastdorf III"},{"v":0,"d":"0.0"},"X","0",0,0,"0",0,0,0,0,0,0,0,0,0,{"$nulls":5},{"v":0,"d":"0.0"},1,0,""]
[12,{"$f":"'Wettkampf 1'!B21","v":"Olliges Kai"},{"$f":"'Wettkampf 1'!C21","v":"Börgerwald II"},{"v":0,"d":"0.0"},"X","0",0,0,0,0,0,0,0,0,"0",0,0,0,{"$nulls":5},{"v":0,"d":"0.0"},1,0,""]
[13,{"$f":"'Wettkampf 1'!B22","v":"Zdralik Ingo"},{"$f":"'Wettkampf 1'!C22","v":"Börger II"},305.4,null,305.4,0,0,0,0,305.4,1,0,0,0,0,0,0,null,null,106.8,{"v":94.02,"d":"94.0"},104.4,{"v":305.22,"d":"305.2"},0,1,""]
[14,{"$f":"'Wettkampf 1'!B23","v":"Goldenstein Uwe"},{"$f":"'Wettkampf 1'!C23","v":"Börger II"},308.7,null,308.7,0,0,0,0,308.7,1,0,0,0,0,0,0,null,null,103.5,103.6,101.6,308.7,1,1,"Korrekt"]
[15,{"$f":"'Wettkampf 1'!B24","v":"Eckmann Mark"},{"$f":"'Wettkampf 1'!C24","v":"Börger II"},304.5,null,304.5,0,0,0,0,304.5,1,0,0,0,0,0,0,null,null,100.5,101.8,102.2,304.5,1,1,"Korrekt"]
[16,{"$f":"'Wettkampf 1'!B25","v":"Schulz Simon"},{"$f":"'Wettkampf 1'!C25","v":"Börger II"},309.3,"X","0",0,0,0,0,"0",0,0,0,0,0,0,0,null,null,101.9,103.8,103.6,{"v":309.29999999999995,"d":"309.3"},1,1,"Korrekt"]
[17,{"$f":"'Wettkampf 1'!B26","v":"Schwarte Hermann"},{"$f":"'Wettkampf 1'!C26","v":"Börger II"},{"v":0,"d":"0.0"},"X","0",0,0,0,0,"0",0,0,0,0,0,0,0,{"$nulls":5},{"v":0,"d":"0.0"},1,0,""]
[18,{"$f":"'Wettkampf 1'!B27","v":"Jungsthoefel Markus"},{"$f":"'Wettkampf 1'!C27","v":"Börger II"},309.1,null,309.1,0,0,0,0,309.1,1,0,0,0,0,0,0,null,null,{"v":103,"d":"103.0"},102.5,103.6,309.1,1,1,"Korrekt"]
[19,{"$f":"'Wettkampf 1'!B28","v":"Aldfeld Helmut"},{"$f":"'Wettkampf 1'!C28","v":"Esterwegen III"},298.9,null,298.9,0,0,0,0,0,0,298.9,1,0,0,0,0,null,null,99.5,99.6,99.8,298.9,1,1,"Korrekt"]
[20,{"$f":"'Wettkampf 1'!B29","v":"Schulte Mathias"},{"$f":"'Wettkampf 1'!C29","v":"Esterwegen III"},308.5,null,308.5,0,0,0,0,0,0,308.5,1,0,0,0,0,null,null,103.9,102.1,102.5,308.5,1,1,"Korrekt"]
[21,{"$f":"'Wettkampf 1'!B30","v":"Middendorf Peter"},{"$f":"'Wettkampf 1'!C30","v":"Esterwegen III"},314.3,null,314.3,0,0,0,0,0,0,314.3,1,0,0,0,0,null,null,104.9,104.5,104.9,314.3,1,1,"Korrekt"]
[22,{"$f":"'Wettkampf 1'!B31","v":"Meibers Michael"},{"$f":"'Wettkampf 1'!C31","v":"Esterwegen III"},313.3,null,313.3,0,0,0,0,0,0,313.3,1,0,0,0,0,null,null,105.6,104.1,103.6,{"v":313.29999999999995,"d":"313.3"},1,1,"Korrekt"]
[23,{"$f":"'Wettkampf 1'!B32","v":"Heidemann Jürgen"},{"$f":"'Wettkampf 1'!C32","v":"Esterwegen III"},{"v":0,"d":"0.0"},"X","0",0,0,0,0,0,0,"0",0,0,0,0,0,{"$nulls":5},{"v":0,"d":"0.0"},1,0,""]
[24,{"$f":"'Wettkampf 1'!B33","v":"Lindemann Gerd"},{"$f":"'Wettkampf 1'!C33","v":"Esterwegen III"},{"v":0,"d":"0.0"},"X","0",0,0,0,0,0,0,"0",0,0,0,0,0,{"$nulls":5},{"v":0,"d":"0.0"},1,0,""]
[25,{"$f":"'Wettkampf 1'!B34","v":"Hanenkamp Andre"},{"$f":"'Wettkampf 1'!C34","v":"Börgerwald II"},313.1,null,313.1,0,0,0,0,0,0,0,0,313.1,1,0,0,null,null,104.3,104.2,104.6,313.1,1,1,"Korrekt"]
[26,{"$f":"'Wettkampf 1'!B35","v":"Antons Mathias"},{"$f":"'Wettkampf 1'!C35","v":"Börgerwald II"},306.5,null,306.5,0,0,0,0,0,0,0,0,306.5,1,0,0,null,null,100.9,102.8,102.8,306.5,1,1,"Korrekt"]
[27,{"$f":"'Wettkampf 1'!B36","v":"Schröer Friedhelm"},{"$f":"'Wettkampf 1'!C36","v":"Börgerwald II"},311.1,null,311.1,0,0,0,0,0,0,0,0,311.1,1,0,0,null,null,102.9,103.7,104.5,311.1,1,1,"Korrekt"]
[28,{"$f":"'Wettkampf 1'!B37","v":"Sebers Tobias"},{"$f":"'Wettkampf 1'!C37","v":"Börgerwald II"},304.3,"X","0",0,0,0,0,0,0,0,0,"0",0,0,0,null,null,102.2,101.5,100.6,{"v":304.29999999999995,"d":"304.3"},1,1,"Korrekt"]
[29,{"$f":"'Wettkampf 1'!B38","v":"Hanneken Moritz"},{"$f":"'Wettkampf 1'!C38","v":"Börgerwald II"},305.6,null,305.6,0,0,0,0,0,0,0,0,305.6,1,0,0,null,null,102.1,{"v":104,"d":"104.0"},99.5,305.6,1,1,"Korrekt"]
[30,{"$f":"'Wettkampf 1'!B39","v":"Speeker Dietmar"},{"$f":"'Wettkampf 1'!C39","v":"Börgerwald II"},{"v":0,"d":"0.0"},"X","0",0,0,0,0,0,0,0,0,"0",0,0,0,{"$nulls":5},{"v":0,"d":"0.0"},1,0,""]
[31,{"$f":"'Wettkampf 1'!B40","v":"Will Achim"},{"$f":"'Wettkampf 1'!C40","v":"Spahnharrenstätte II"},313.7,null,313.7,0,0,0,0,0,0,0,0,0,0,313.7,1,null,null,{"v":104,"d":"104.0"},105.3,104.4,{"v":313.70000000000005,"d":"313.7"},1,1,"Korrekt"]
[32,{"$f":"'Wettkampf 1'!B41","v":"Meyer Dirk"},{"$f":"'Wettkampf 1'!C41","v":"Spahnharrenstätte II"},310.7,null,310.7,0,0,0,0,0,0,0,0,0,0,310.7,1,null,null,104.4,102.8,103.5,310.7,1,1,"Korrekt"]
[33,{"$f":"'Wettkampf 1'!B42","v":"Micksch Heiko"},{"$f":"'Wettkampf 1'!C42","v":"Spahnharrenstätte II"},312.6,null,312.6,0,0,0,0,0,0,0,0,0,0,312.6,1,null,null,104.3,104.3,{"v":104,"d":"104.0"},312.6,1,1,"Korrekt"]
[34,{"$f":"'Wettkampf 1'!B43","v":"Hahnenkamp Ulrich"},{"$f":"'Wettkampf 1'!C43","v":"Spahnharrenstätte II"},{"v":0,"d":"0.0"},"X","0",0,0,0,0,0,0,0,0,0,0,"0",0,{"$nulls":5},{"v":0,"d":"0.0"},1,0,""]
[35,{"$f":"'Wettkampf 1'!B44","v":"Hahnenkamp Markus"},{"$f":"'Wettkampf 1'!C44","v":"Spahnharrenstätte II"},295.3,null,295.3,0,0,0,0,0,0,0,0,0,0,295.3,1,null,null,100.6,96.5,98.2,295.3,1,1,"Korrekt"]
[36,{"$f":"'Wettkampf 1'!B45","v":"Walker Stefan"},{"$f":"'Wettkampf 1'!C45","v":"Börgerwald II"},{"v":287,"d":"287.0"},"X","0",0,0,0,0,0,0,0,0,"0",0,0,0,null,null,95.4,92.9,98.7,{"v":287,"d":"287.0"},1,1,"Korrekt"]
[{"$nulls":6},{"$f":"LARGE(G10:G45,1)+LARGE(G10:G45,2)+LARGE(G10:G45,3)","v":934.1},{"$f":"SUM(H10:H45)","v":4},{"$f":"LARGE(I10:I45,1)+LARGE(I10:I45,2)+LARGE(I10:I45,3)","v":939.2},{"$f":"SUM(J10:J45)","v":4},{"$f":"LARGE(K10:K45,1)+LARGE(K10:K45,2)+LARGE(K10:K45,3)","v":923.1999999999999},{"$f":"SUM(L10:L45)","v":4},{"$f":"LARGE(M10:M45,1)+LARGE(M10:M45,2)+LARGE(M10:M45,3)","v":936.1},{"$f":"SUM(N10:N45)","v":4},{"$f":"LARGE(O10:O45,1)+LARGE(O10:O45,2)+LARGE(O10:O45,3)","v":930.7},{"$f":"SUM(P10:P45)","v":4},{"$f":"LARGE(Q10:Q45,1)+LARGE(Q10:Q45,2)+LARGE(Q10:Q45,3)","v":937},{"$f":"SUM(R10:S45)","v":4}]
[null,null,"per Email an: sk-huemmling@gmx.de"]

{"sheet":"7","index":7,"n_rows":47,"n_cols":27,"rows_kept":47,"merged":[[0,22,0,23],[1,22,1,23],[4,22,4,23],[5,22,5,23],[6,22,6,23],[8,20,8,23]]}
[null,"Verein / Gruppe",null,"Ergebnisse",{"$nulls":17},"Austragungsort:",{"$f":"Übersicht!L4","v":"Esterwegen"}]
[1,{"$f":"'Wettkampf 1'!B2","v":"Neuvrees I"},null,{"$f":"G46","v":{"v":929.6000000000001,"d":"929.6"}},{"$f":"IF(H46>4,\"Es sind zu viele Schützen in Wertung!\",\" \")","v":"Es sind zu viele Schützen in Wertung!"},{"$nulls":16},"Wettkampftag:",{"$f":"Übersicht!L3","v":"19.01."}]
[2,{"$f":"'Wettkampf 1'!B3","v":"Rastdorf III"},null,{"$f":"I46","v":936.4},{"$f":"IF(J46>4,\"Es sind zu viele Schützen in Wertung!\",\" \")","v":" "}]
[3,{"$f":"'Wettkampf 1'!B4","v":"Börger II"},null,{"$f":"K46","v":918.7},{"$f":"IF(L46>4,\"Es sind zu viele Schützen in Wertung!\",\" \")","v":" "},{"$nulls":18},"Ansprechpartner für Rückfragen:"]
[4,{"$f":"'Wettkampf 1'!B5","v":"Esterwegen III"},null,{"$f":"M46","v":{"v":937.0999999999999,"d":"937.1"}},{"$f":"IF(N46>4,\"Es sind zu viele Schützen in Wertung!\",\" \")","v":" "},{"$nulls":16},"Name:","Michael Meibers"]
[5,{"$f":"'Wettkampf 1'!B6","v":"Börgerwald II"},null,{"$f":"O46","v":924.5},{"$f":"IF(P46>4,\"Es sind zu viele Schützen in Wertung!\",\" \")","v":"Es sind zu viele Schützen in Wertung!"},{"$nulls":16},"Tel:"]
[6,{"$f":"'Wettkampf 1'!B7","v":"Spahnharrenstätte II"},null,{"$f":"Q46","v":931.1},{"$f":"IF(R46>4,\"Es sind zu viele Schützen in Wertung!\",\" \")","v":" "},{"$nulls":16},"Standaufsicht:","Michael Meibers"]
[]
[null,"Einzelergebnisse:","Verein / Gruppe","Ergebnisse (mindestens 0 eintragen)","AW? Dann x eintippen",null,"Verein 1",null,"Verein 2",null,"Verein 3",null,"Verein 4",null,"Verein 5",null,"Verein 6",{"$nulls":3},"Proberechnung bei Streifen:"]
[1,{"$f":"'Wettkampf 1'!B10","v":"Rolfes Wilhelm"},{"$f":"'Wettkampf 1'!C10","v":"Neuvrees I"},305.8,null,{"$f":"IF(E10=\"x\",\"0\",D10)","v":305.8},{"$f":"IF(C10=$B$2,F10,0)","v":305.8},{"$f":"(IF(AND($E10=\"\",$C10=$B$2),1,0))","v":1},{"$f":"IF($C10=$B$3,F10,0)","v":0},{"$f":"(IF(AND($E10=\"\",$C10=$B$3),1,0))","v":0},{"$f":"IF($C10=$B$4,F10,0)","v":0},{"$f":"(IF(AND($E10=\"\",$C10=$B$4),1,0))","v":0},{"$f":"IF($C10=$B$5,F10,0)","v":0},{"$f":"(IF(AND($E10=\"\",$C10=$B$5),1,0))","v":0},{"$f":"IF($C10=$B$6,F10,0)","v":0},{"$f":"(IF(AND($E10=\"\",$C10=$B$6),1,0))","v":0},{"$f":"IF($C10=$B$7,F10,0)","v":0},{"$f":"(IF(AND($E10=\"\",$C10=$B$7),1,0))","v":0},{"$nulls":5},{"$f":"U10+V10+W10","v":{"v":0,"d":"0.0"}},{"$f":"IF(X10=D10,1,0)","v":0},{"$f":"IF(X10=0,0,1)","v":0},{"$f":"IF(Y10+Z10=2,\"Korrekt\",\"\")","v":""}]
[2,{"$f":"'Wettkampf 1'!B11","v":"Steenken Klaus"},{"$f":"'Wettkampf 1'!C11","v":"Neuvrees I"},307.2,null,{"$f":"IF(E11=\"x\",\"0\",D11)","v":307.2},{"$f":"IF(C11=$B$2,F11,0)","v":307.2},{"$f":"(IF(AND($E11=\"\",$C11=$B$2),1,0))","v":1},{"$f":"IF($C11=$B$3,F11,0)","v":0},{"$f":"(IF(AND($E11=\"\",$C11=$B$3),1,0))","v":0},{"$f":"IF($C11=$B$4,F11,0)","v":0},{"$f":"(IF(AND($E11=\"\",$C11=$B$4),1,0))","v":0},{"$f":"IF($C11=$B$5,F11,0)","v":0},{"$f":"(IF(AND($E11=\"\",$C11=$B$5),1,0))","v":0},{"$f":"IF($C11=$B$6,F11,0)","v":0},{"$f":"(IF(AND($E11=\"\",$C11=$B$6),1,0))","v":0},{"$f":"IF($C11=$B$7,F11,0)","v":0},{"$f":"(IF(AND($E11=\"\",$C11=$B$7),1,0))","v":0},{"$nulls":5},{"$f":"U11+V11+W11","v":{"v":0,"d":"0.0"}},{"$f":"IF(X11=D11,1,0)","v":0},{"$f":"IF(X11=0,0,1)","v":0},{"$f":"IF(Y11+Z11=2,\"Korrekt\",\"\")","v":""}]
[3,{"$f":"'Wettkampf 1'!B12","v":"Breyer Wilfried"},{"$f":"'Wettkampf 1'!C12","v":"Neuvrees I"},310.1,null,310.1,310.1,1,0,0,0,0,0,0,0,0,0,0,{"$nulls":5},{"v":0,"d":"0.0"},0,0,""]
[4,{"$f":"'Wettkampf 1'!B13","v":"Janßen Markus"},{"$f":"'Wettkampf 1'!C13","v":"Neuvrees I"},312.3,null,312.3,312.3,1,0,0,0,0,0,0,0,0,0,0,{"$nulls":5},{"v":0,"d":"0.0"},0,0,""]
[5,{"$f":"'Wettkampf 1'!B14","v":"Thyen Werner"},{"$f":"'Wettkampf 1'!C14","v":"Neuvrees I"},302.3,"x","0","0",0,0,0,0,0,0,0,0,0,0,0,{"$nulls":5},{"v":0,"d":"0.0"},0,0,""]
[6,{"$f":"'Wettkampf 1'!B15","v":"Peters Carsten"},{"$f":"'Wettkampf 1'!C15","v":"Neuvrees I"},null,null,{"v":0,"d":"0.0"},0,1,0,0,0,0,0,0,0,0,0,0,{"$nulls":5},{"v":0,"d":"0.0"},1,0,""]
[7,{"$f":"'Wettkampf 1'!B16","v":"Wotte Robert"},{"$f":"'Wettkampf 1'!C16","v":"Rastdorf III"},311.7,null,311.7,0,0,311.7,1,0,0,0,0,0,0,0,0,{"$nulls":5},{"v":0,"d":"0.0"},0,0,""]
[8,{"$f":"'Wettkampf 1'!B17","v":"Müller Helmut"},{"$f":"'Wettkampf 1'!C17","v":"Rastdorf III"},310.1,null,310.1,0,0,310.1,1,0,0,0,0,0,0,0,0,{"$nulls":5},{"v":0,"d":"0.0"},0,0,""]
[9,{"$f":"'Wettkampf 1'!B18","v":"Bookjans Günther"},{"$f":"'Wettkampf 1'!C18","v":"Rastdorf III"},314.2,null,314.2,0,0,314.2,1,0,0,0,0,0,0,0,0,{"$nulls":5},{"v":0,"d":"0.0"},0,0,""]
[10,{"$f":"'Wettkampf 1'!B19","v":"Meer Michael"},{"$f":"'Wettkampf 1'!C19","v":"Rastdorf III"},310.5,null,310.5,0,0,310.5,1,0,0,0,0,0,0,0,0,{"$nulls":5},{"v":0,"d":"0.0"},0,0,""]
[11,{"$f":"'Wettkampf 1'!B20","v":"Lindemann Rita"},{"$f":"'Wettkampf 1'!C20","v":"Rastdorf III"},317.9,"x","0",0,0,"0",0,0,0,0,0,0,0,0,0,{"$nulls":5},{"v":0,"d":"0.0"},0,0,""]
[12,{"$f":"'Wettkampf 1'!B21","v":"Olliges Kai"},{"$f":"'Wettkampf 1'!C21","v":"Börgerwald II"},259.6,"x","0",0,0,0,0,0,0,0,0,"0",0,0,0,{"$nulls":5},{"v":0,"d":"0.0"},0,0,""]
[13,{"$f":"'Wettkampf 1'!B22","v":"Zdralik Ingo"},{"$f":"'Wettkampf 1'!C22","v":"Börger II"},{"v":314,"d":"314.0"},null,{"v":314,"d":"314.0"},0,0,0,0,314,1,0,0,0,0,0,0,{"$nulls":5},{"v":0,"d":"0.0"},0,0,""]
[14,{"$f":"'Wettkampf 1'!B23","v":"Goldenstein Uwe"},{"$f":"'Wettkampf 1'!C23","v":"Börger II"},305.1,null,305.1,0,0,0,0,305.1,1,0,0,0,0,0,0,{"$nulls":5},{"v":0,"d":"0.0"},0,0,""]
[15,{"$f":"'Wettkampf 1'!B24","v":"Eckmann Mark"},{"$f":"'Wettkampf 1'!C24","v":"Börger II"},303.7,"x","0",0,0,0,0,"0",0,0,0,0,0,0,0,{"$nulls":5},{"v":0,"d":"0.0"},0,0,""]
[16,{"$f":"'Wettkampf 1'!B25","v":"Schulz Simon"},{"$f":"'Wettkampf 1'!C25","v":"Börger II"},298.2,null,298.2,0,0,0,0,298.2,1,0,0,0,0,0,0,{"$nulls":5},{"v":0,"d":"0.0"},0,0,""]
[17,{"$f":"'Wettkampf 1'!B26","v":"Schwarte Hermann"},{"$f":"'Wettkampf 1'!C26","v":"Börger II"},303.1,"x","0",0,0,0,0,"0",0,0,0,0,0,0,0,{"$nulls":5},{"v":0,"d":"0.0"},0,0,""]
[18,{"$f":"'Wettkampf 1'!B27","v":"Jungsthoefel Markus"},{"$f":"'Wettkampf 1'!C27","v":"Börger II"},299.6,null,299.6,0,0,0,0,299.6,1,0,0,0,0,0,0,{"$nulls":5},{"v":0,"d":"0.0"},0,0,""]
[19,{"$f":"'Wettkampf 1'!B28","v":"Aldfeld Helmut"},{"$f":"'Wettkampf 1'!C28","v":"Esterwegen III"},null,null,{"v":0,"d":"0.0"},0,0,0,0,0,0,0,1,0,0,0,0,{"$nulls":5},{"v":0,"d":"0.0"},1,0,""]
[20,{"$f":"'Wettkampf 1'!B29","v":"Schulte Mathias"},{"$f":"'Wettkampf 1'!C29","v":"Esterwegen III"},306.2,null,306.2,0,0,0,0,0,0,306.2,1,0,0,0,0,{"$nulls":5},{"v":0,"d":"0.0"},0,0,""]
[21,{"$f":"'Wettkampf 1'!B30","v":"Middendorf Peter"},{"$f":"'Wettkampf 1'!C30","v":"Esterwegen III"},{"v":313,"d":"313.0"},null,{"v":313,"d":"313.0"},0,0,0,0,0,0,313,1,0,0,0,0,{"$nulls":5},{"v":0,"d":"0.0"},0,0,""]
[22,{"$f":"'Wettkampf 1'!B31","v":"Meibers Michael"},{"$f":"'Wettkampf 1'!C31","v":"Esterwegen III"},317.9,null,317.9,0,0,0,0,0,0,317.9,1,0,0,0,0,{"$nulls":5},{"v":0,"d":"0.0"},0,0,""]
[23,{"$f":"'Wettkampf 1'!B32","v":"Heidemann Jürgen"},{"$f":"'Wettkampf 1'!C32","v":"Esterwegen III"},null,"x","0",0,0,0,0,0,0,"0",0,0,0,0,0,{"$nulls":5},{"v":0,"d":"0.0"},1,0,""]
[24,{"$f":"'Wettkampf 1'!B33","v":"Lindemann Gerd"},{"$f":"'Wettkampf 1'!C33","v":"Esterwegen III"},null,"x","0",0,0,0,0,0,0,"0",0,0,0,0,0,{"$nulls":5},{"v":0,"d":"0.0"},1,0,""]
[25,{"$f":"'Wettkampf 1'!B34","v":"Hanenkamp Andre"},{"$f":"'Wettkampf 1'!C34","v":"Börgerwald II"},309.3,null,309.3,0,0,0,0,0,0,0,0,309.3,1,0,0,{"$nulls":5},{"v":0,"d":"0.0"},0,0,""]
[26,{"$f":"'Wettkampf 1'!B35","v":"Antons Mathias"},{"$f":"'Wettkampf 1'!C35","v":"Börgerwald II"},308.8,null,308.8,0,0,0,0,0,0,0,0,308.8,1,0,0,{"$nulls":5},{"v":0,"d":"0.0"},0,0,""]
[27,{"$f":"'Wettkampf 1'!B36","v":"Schröer Friedhelm"},{"$f":"'Wettkampf 1'!C36","v":"Börgerwald II"},306.4,null,306.4,0,0,0,0,0,0,0,0,306.4,1,0,0,{"$nulls":5},{"v":0,"d":"0.0"},0,0,""]
[28,{"$f":"'Wettkampf 1'!B37","v":"Sebers Tobias"},{"$f":"'Wettkampf 1'!C37","v":"Börgerwald II"},{"v":297,"d":"297.0"},"x","0",0,0,0,0,0,0,0,0,"0",0,0,0,{"$nulls":5},{"v":0,"d":"0.0"},0,0,""]
[29,{"$f":"'Wettkampf 1'!B38","v":"Hanneken Moritz"},{"$f":"'Wettkampf 1'!C38","v":"Börgerwald II"},306.4,null,306.4,0,0,0,0,0,0,0,0,306.4,1,0,0,{"$nulls":5},{"v":0,"d":"0.0"},0,0,""]
[30,{"$f":"'Wettkampf 1'!B39","v":"Speeker Dietmar"},{"$f":"'Wettkampf 1'!C39","v":"Börgerwald II"},null,null,{"v":0,"d":"0.0"},0,0,0,0,0,0,0,0,0,1,0,0,{"$nulls":5},{"v":0,"d":"0.0"},1,0,""]
[31,{"$f":"'Wettkampf 1'!B40","v":"Will Achim"},{"$f":"'Wettkampf 1'!C40","v":"Spahnharrenstätte II"},308.6,null,308.6,0,0,0,0,0,0,0,0,0,0,308.6,1,{"$nulls":5},{"v":0,"d":"0.0"},0,0,""]
[32,{"$f":"'Wettkampf 1'!B41","v":"Meyer Dirk"},{"$f":"'Wettkampf 1'!C41","v":"Spahnharrenstätte II"},310.5,null,310.5,0,0,0,0,0,0,0,0,0,0,310.5,1,{"$nulls":5},{"v":0,"d":"0.0"},0,0,""]
[33,{"$f":"'Wettkampf 1'!B42","v":"Micksch Heiko"},{"$f":"'Wettkampf 1'!C42","v":"Spahnharrenstätte II"},{"v":312,"d":"312.0"},null,{"v":312,"d":"312.0"},0,0,0,0,0,0,0,0,0,0,312,1,{"$nulls":5},{"v":0,"d":"0.0"},0,0,""]
[34,{"$f":"'Wettkampf 1'!B43","v":"Hahnenkamp Ulrich"},{"$f":"'Wettkampf 1'!C43","v":"Spahnharrenstätte II"},295.1,"x","0",0,0,0,0,0,0,0,0,0,0,"0",0,{"$nulls":5},{"v":0,"d":"0.0"},0,0,""]
[35,{"$f":"'Wettkampf 1'!B44","v":"Hahnenkamp Markus"},{"$f":"'Wettkampf 1'!C44","v":"Spahnharrenstätte II"},299.6,null,299.6,0,0,0,0,0,0,0,0,0,0,299.6,1,{"$nulls":5},{"v":0,"d":"0.0"},0,0,""]
[36,{"$f":"'Wettkampf 1'!B45","v":"Walker Stefan"},{"$f":"'Wettkampf 1'!C45","v":"Börgerwald II"},null,null,{"v":0,"d":"0.0"},0,0,0,0,0,0,0,0,0,1,0,0,{"$nulls":5},{"v":0,"d":"0.0"},1,0,""]
[{"$nulls":6},{"$f":"LARGE(G10:G45,1)+LARGE(G10:G45,2)+LARGE(G10:G45,3)","v":929.6000000000001},{"$f":"SUM(H10:H45)","v":5},{"$f":"LARGE(I10:I45,1)+LARGE(I10:I45,2)+LARGE(I10:I45,3)","v":936.4},{"$f":"SUM(J10:J45)","v":4},{"$f":"LARGE(K10:K45,1)+LARGE(K10:K45,2)+LARGE(K10:K45,3)","v":918.7},{"$f":"SUM(L10:L45)","v":4},{"$f":"LARGE(M10:M45,1)+LARGE(M10:M45,2)+LARGE(M10:M45,3)","v":937.0999999999999},{"$f":"SUM(N10:N45)","v":4},{"$f":"LARGE(O10:O45,1)+LARGE(O10:O45,2)+LARGE(O10:O45,3)","v":924.5},{"$f":"SUM(P10:P45)","v":6},{"$f":"LARGE(Q10:Q45,1)+LARGE(Q10:Q45,2)+LARGE(Q10:Q45,3)","v":931.1},{"$f":"SUM(R10:S45)","v":4}]
[null,null,"per Email an: sk-huemmling@gmx.de"]

{"sheet":"8","index":8,"n_rows":47,"n_cols":27,"rows_kept":47,"merged":[[0,22,0,23],[1,22,1,23],[4,22,4,23],[5,22,5,23],[6,22,6,23],[8,20,8,23]]}
[null,"Verein / Gruppe",null,"Ergebnisse",{"$nulls":17},"Austragungsort:",{"$f":"Übersicht!M4","v":"Rastdorf"}]
[1,{"$f":"'Wettkampf 1'!B2","v":"Neuvrees I"},null,{"$f":"G46","v":929.5},{"$f":"IF(H46>4,\"Es sind zu viele Schützen in Wertung!\",\" \")","v":" "},{"$nulls":16},"Wettkampftag:",{"$f":"Übersicht!M3","v":"02.02."}]
[2,{"$f":"'Wettkampf 1'!B3","v":"Rastdorf III"},null,{"$f":"I46","v":934.4},{"$f":"IF(J46>4,\"Es sind zu viele Schützen in Wertung!\",\" \")","v":" "}]
[3,{"$f":"'Wettkampf 1'!B4","v":"Börger II"},null,{"$f":"K46","v":{"v":928.1999999999999,"d":"928.2"}},{"$f":"IF(L46>4,\"Es sind zu viele Schützen in Wertung!\",\" \")","v":" "},{"$nulls":18},"Ansprechpartner für Rückfragen:"]
[4,{"$f":"'Wettkampf 1'!B5","v":"Esterwegen III"},null,{"$f":"M46","v":934.1},{"$f":"IF(N46>4,\"Es sind zu viele Schützen in Wertung!\",\" \")","v":" "},{"$nulls":16},"Name:","M.Meer"]
[5,{"$f":"'Wettkampf 1'!B6","v":"Börgerwald II"},null,{"$f":"O46","v":930.7},{"$f":"IF(P46>4,\"Es sind zu viele Schützen in Wertung!\",\" \")","v":" "},{"$nulls":16},"Tel:","015226250201"]
[6,{"$f":"'Wettkampf 1'!B7","v":"Spahnharrenstätte II"},null,{"$f":"Q46","v":934.4},{"$f":"IF(R46>4,\"Es sind zu viele Schützen in Wertung!\",\" \")","v":" "},{"$nulls":16},"Standaufsicht:","F.Sommerfeld"]
[]
[null,"Einzelergebnisse:","Verein / Gruppe","Ergebnisse (mindestens 0 eintragen)","AW? Dann x eintippen",null,"Verein 1",null,"Verein 2",null,"Verein 3",null,"Verein 4",null,"Verein 5",null,"Verein 6",{"$nulls":3},"Proberechnung bei Streifen:"]
[1,{"$f":"'Wettkampf 1'!B10","v":"Rolfes Wilhelm"},{"$f":"'Wettkampf 1'!C10","v":"Neuvrees I"},295.8," ",{"$f":"IF(E10=\"x\",\"0\",D10)","v":295.8},{"$f":"IF(C10=$B$2,F10,0)","v":295.8},{"$f":"(IF(AND($E10=\"\",$C10=$B$2),1,0))","v":0},{"$f":"IF($C10=$B$3,F10,0)","v":0},{"$f":"(IF(AND($E10=\"\",$C10=$B$3),1,0))","v":0},{"$f":"IF($C10=$B$4,F10,0)","v":0},{"$f":"(IF(AND($E10=\"\",$C10=$B$4),1,0))","v":0},{"$f":"IF($C10=$B$5,F10,0)","v":0},{"$f":"(IF(AND($E10=\"\",$C10=$B$5),1,0))","v":0},{"$f":"IF($C10=$B$6,F10,0)","v":0},{"$f":"(IF(AND($E10=\"\",$C10=$B$6),1,0))","v":0},{"$f":"IF($C10=$B$7,F10,0)","v":0},{"$f":"(IF(AND($E10=\"\",$C10=$B$7),1,0))","v":0},{"$nulls":5},{"$f":"U10+V10+W10","v":{"v":0,"d":"0.0"}},{"$f":"IF(X10=D10,1,0)","v":0},{"$f":"IF(X10=0,0,1)","v":0},{"$f":"IF(Y10+Z10=2,\"Korrekt\",\"\")","v":""}]
[2,{"$f":"'Wettkampf 1'!B11","v":"Steenken Klaus"},{"$f":"'Wettkampf 1'!C11","v":"Neuvrees I"},310.3,null,{"$f":"IF(E11=\"x\",\"0\",D11)","v":310.3},{"$f":"IF(C11=$B$2,F11,0)","v":310.3},{"$f":"(IF(AND($E11=\"\",$C11=$B$2),1,0))","v":1},{"$f":"IF($C11=$B$3,F11,0)","v":0},{"$f":"(IF(AND($E11=\"\",$C11=$B$3),1,0))","v":0},{"$f":"IF($C11=$B$4,F11,0)","v":0},{"$f":"(IF(AND($E11=\"\",$C11=$B$4),1,0))","v":0},{"$f":"IF($C11=$B$5,F11,0)","v":0},{"$f":"(IF(AND($E11=\"\",$C11=$B$5),1,0))","v":0},{"$f":"IF($C11=$B$6,F11,0)","v":0},{"$f":"(IF(AND($E11=\"\",$C11=$B$6),1,0))","v":0},{"$f":"IF($C11=$B$7,F11,0)","v":0},{"$f":"(IF(AND($E11=\"\",$C11=$B$7),1,0))","v":0},{"$nulls":5},{"$f":"U11+V11+W11","v":{"v":0,"d":"0.0"}},{"$f":"IF(X11=D11,1,0)","v":0},{"$f":"IF(X11=0,0,1)","v":0},{"$f":"IF(Y11+Z11=2,\"Korrekt\",\"\")","v":""}]
[3,{"$f":"'Wettkampf 1'!B12","v":"Breyer Wilfried"},{"$f":"'Wettkampf 1'!C12","v":"Neuvrees I"},308.4,null,308.4,308.4,1,0,0,0,0,0,0,0,0,0,0,{"$nulls":5},{"v":0,"d":"0.0"},0,0,""]
[4,{"$f":"'Wettkampf 1'!B13","v":"Janßen Markus"},{"$f":"'Wettkampf 1'!C13","v":"Neuvrees I"},310.8,null,310.8,310.8,1,0,0,0,0,0,0,0,0,0,0,{"$nulls":5},{"v":0,"d":"0.0"},0,0,""]
[5,{"$f":"'Wettkampf 1'!B14","v":"Thyen Werner"},{"$f":"'Wettkampf 1'!C14","v":"Neuvrees I"},306.1,"x","0","0",0,0,0,0,0,0,0,0,0,0,0,{"$nulls":5},{"v":0,"d":"0.0"},0,0,""]
[6,{"$f":"'Wettkampf 1'!B15","v":"Peters Carsten"},{"$f":"'Wettkampf 1'!C15","v":"Neuvrees I"},{"v":0,"d":"0.0"},null,{"v":0,"d":"0.0"},0,1,0,0,0,0,0,0,0,0,0,0,{"$nulls":5},{"v":0,"d":"0.0"},1,0,""]
[7,{"$f":"'Wettkampf 1'!B16","v":"Wotte Robert"},{"$f":"'Wettkampf 1'!C16","v":"Rastdorf III"},310.9,null,310.9,0,0,310.9,1,0,0,0,0,0,0,0,0,{"$nulls":5},{"v":0,"d":"0.0"},0,0,""]
[8,{"$f":"'Wettkampf 1'!B17","v":"Müller Helmut"},{"$f":"'Wettkampf 1'!C17","v":"Rastdorf III"},310.1,null,310.1,0,0,310.1,1,0,0,0,0,0,0,0,0,{"$nulls":5},{"v":0,"d":"0.0"},0,0,""]
[9,{"$f":"'Wettkampf 1'!B18","v":"Bookjans Günther"},{"$f":"'Wettkampf 1'!C18","v":"Rastdorf III"},313.4,null,313.4,0,0,313.4,1,0,0,0,0,0,0,0,0,{"$nulls":5},{"v":0,"d":"0.0"},0,0,""]
[10,{"$f":"'Wettkampf 1'!B19","v":"Meer Michael"},{"$f":"'Wettkampf 1'!C19","v":"Rastdorf III"},304.9,null,304.9,0,0,304.9,1,0,0,0,0,0,0,0,0,{"$nulls":5},{"v":0,"d":"0.0"},0,0,""]
[11,{"$f":"'Wettkampf 1'!B20","v":"Lindemann Rita"},{"$f":"'Wettkampf 1'!C20","v":"Rastdorf III"},314.4,"x","0",0,0,"0",0,0,0,0,0,0,0,0,0,{"$nulls":5},{"v":0,"d":"0.0"},0,0,""]
[12,{"$f":"'Wettkampf 1'!B21","v":"Olliges Kai"},{"$f":"'Wettkampf 1'!C21","v":"Börgerwald II"},{"v":0,"d":"0.0"},"x","0",0,0,0,0,0,0,0,0,"0",0,0,0,{"$nulls":5},{"v":0,"d":"0.0"},1,0,""]
[13,{"$f":"'Wettkampf 1'!B22","v":"Zdralik Ingo"},{"$f":"'Wettkampf 1'!C22","v":"Börger II"},315.4,null,315.4,0,0,0,0,315.4,1,0,0,0,0,0,0,{"$nulls":5},{"v":0,"d":"0.0"},0,0,""]
[14,{"$f":"'Wettkampf 1'!B23","v":"Goldenstein Uwe"},{"$f":"'Wettkampf 1'!C23","v":"Börger II"},304.6,null,304.6,0,0,0,0,304.6,1,0,0,0,0,0,0,{"$nulls":5},{"v":0,"d":"0.0"},0,0,""]
[15,{"$f":"'Wettkampf 1'!B24","v":"Eckmann Mark"},{"$f":"'Wettkampf 1'!C24","v":"Börger II"},{"v":0,"d":"0.0"},"x","0",0,0,0,0,"0",0,0,0,0,0,0,0,{"$nulls":5},{"v":0,"d":"0.0"},1,0,""]
[16,{"$f":"'Wettkampf 1'!B25","v":"Schulz Simon"},{"$f":"'Wettkampf 1'!C25","v":"Börger II"},302.8,"x","0",0,0,0,0,"0",0,0,0,0,0,0,0,{"$nulls":5},{"v":0,"d":"0.0"},0,0,""]
[17,{"$f":"'Wettkampf 1'!B26","v":"Schwarte Hermann"},{"$f":"'Wettkampf 1'!C26","v":"Börger II"},304.9,null,304.9,0,0,0,0,304.9,1,0,0,0,0,0,0,{"$nulls":5},{"v":0,"d":"0.0"},0,0,""]
[18,{"$f":"'Wettkampf 1'!B27","v":"Jungsthoefel Markus"},{"$f":"'Wettkampf 1'!C27","v":"Börger II"},307.9,null,307.9,0,0,0,0,307.9,1,0,0,0,0,0,0,{"$nulls":5},{"v":0,"d":"0.0"},0,0,""]
[19,{"$f":"'Wettkampf 1'!B28","v":"Aldfeld Helmut"},{"$f":"'Wettkampf 1'!C28","v":"Esterwegen III"},{"v":0,"d":"0.0"},"x","0",0,0,0,0,0,0,"0",0,0,0,0,0,{"$nulls":5},{"v":0,"d":"0.0"},1,0,""]
[20,{"$f":"'Wettkampf 1'!B29","v":"Schulte Mathias"},{"$f":"'Wettkampf 1'!C29","v":"Esterwegen III"},308.6,null,308.6,0,0,0,0,0,0,308.6,1,0,0,0,0,{"$nulls":5},{"v":0,"d":"0.0"},0,0,""]
[21,{"$f":"'Wettkampf 1'!B30","v":"Middendorf Peter"},{"$f":"'Wettkampf 1'!C30","v":"Esterwegen III"},310.9,null,310.9,0,0,0,0,0,0,310.9,1,0,0,0,0,{"$nulls":5},{"v":0,"d":"0.0"},0,0,""]
[22,{"$f":"'Wettkampf 1'!B31","v":"Meibers Michael"},{"$f":"'Wettkampf 1'!C31","v":"Esterwegen III"},314.6,null,314.6,0,0,0,0,0,0,314.6,1,0,0,0,0,{"$nulls":5},{"v":0,"d":"0.0"},0,0,""]
[23,{"$f":"'Wettkampf 1'!B32","v":"Heidemann Jürgen"},{"$f":"'Wettkampf 1'!C32","v":"Esterwegen III"},{"v":0,"d":"0.0"},null,{"v":0,"d":"0.0"},0,0,0,0,0,0,0,1,0,0,0,0,{"$nulls":5},{"v":0,"d":"0.0"},1,0,""]
[24,{"$f":"'Wettkampf 1'!B33","v":"Lindemann Gerd"},{"$f":"'Wettkampf 1'!C33","v":"Esterwegen III"},{"v":0,"d":"0.0"},"x","0",0,0,0,0,0,0,"0",0,0,0,0,0,{"$nulls":5},{"v":0,"d":"0.0"},1,0,""]
[25,{"$f":"'Wettkampf 1'!B34","v":"Hanenkamp Andre"},{"$f":"'Wettkampf 1'!C34","v":"Börgerwald II"},310.2,null,310.2,0,0,0,0,0,0,0,0,310.2,1,0,0,{"$nulls":5},{"v":0,"d":"0.0"},0,0,""]
[26,{"$f":"'Wettkampf 1'!B35","v":"Antons Mathias"},{"$f":"'Wettkampf 1'!C35","v":"Börgerwald II"},{"v":310,"d":"310.0"},null,{"v":310,"d":"310.0"},0,0,0,0,0,0,0,0,310,1,0,0,{"$nulls":5},{"v":0,"d":"0.0"},0,0,""]
[27,{"$f":"'Wettkampf 1'!B36","v":"Schröer Friedhelm"},{"$f":"'Wettkampf 1'!C36","v":"Börgerwald II"},310.5,null,310.5,0,0,0,0,0,0,0,0,310.5,1,0,0,{"$nulls":5},{"v":0,"d":"0.0"},0,0,""]
[28,{"$f":"'Wettkampf 1'!B37","v":"Sebers Tobias"},{"$f":"'Wettkampf 1'!C37","v":"Börgerwald II"},301.2,"x","0",0,0,0,0,0,0,0,0,"0",0,0,0,{"$nulls":5},{"v":0,"d":"0.0"},0,0,""]
[29,{"$f":"'Wettkampf 1'!B38","v":"Hanneken Moritz"},{"$f":"'Wettkampf 1'!C38","v":"Börgerwald II"},309.2,null,309.2,0,0,0,0,0,0,0,0,309.2,1,0,0,{"$nulls":5},{"v":0,"d":"0.0"},0,0,""]
[30,{"$f":"'Wettkampf 1'!B39","v":"Speeker Dietmar"},{"$f":"'Wettkampf 1'!C39","v":"Börgerwald II"},{"v":0,"d":"0.0"},"x","0",0,0,0,0,0,0,0,0,"0",0,0,0,{"$nulls":5},{"v":0,"d":"0.0"},1,0,""]
[31,{"$f":"'Wettkampf 1'!B40","v":"Will Achim"},{"$f":"'Wettkampf 1'!C40","v":"Spahnharrenstätte II"},309.4,null,309.4,0,0,0,0,0,0,0,0,0,0,309.4,1,{"$nulls":5},{"v":0,"d":"0.0"},0,0,""]
[32,{"$f":"'Wettkampf 1'!B41","v":"Meyer Dirk"},{"$f":"'Wettkampf 1'!C41","v":"Spahnharrenstätte II"},{"v":314,"d":"314.0"},null,{"v":314,"d":"314.0"},0,0,0,0,0,0,0,0,0,0,314,1,{"$nulls":5},{"v":0,"d":"0.0"},0,0,""]
[33,{"$f":"'Wettkampf 1'!B42","v":"Micksch Heiko"},{"$f":"'Wettkampf 1'!C42","v":"Spahnharrenstätte II"},{"v":311,"d":"311.0"},null,{"v":311,"d":"311.0"},0,0,0,0,0,0,0,0,0,0,311,1,{"$nulls":5},{"v":0,"d":"0.0"},0,0,""]
[34,{"$f":"'Wettkampf 1'!B43","v":"Hahnenkamp Ulrich"},{"$f":"'Wettkampf 1'!C43","v":"Spahnharrenstätte II"},284.3,"x","0",0,0,0,0,0,0,0,0,0,0,"0",0,{"$nulls":5},{"v":0,"d":"0.0"},0,0,""]
[35,{"$f":"'Wettkampf 1'!B44","v":"Hahnenkamp Markus"},{"$f":"'Wettkampf 1'!C44","v":"Spahnharrenstätte II"},{"v":304,"d":"304.0"},null,{"v":304,"d":"304.0"},0,0,0,0,0,0,0,0,0,0,304,1,{"$nulls":5},{"v":0,"d":"0.0"},0,0,""]
[36,{"$f":"'Wettkampf 1'!B45","v":"Walker Stefan"},{"$f":"'Wettkampf 1'!C45","v":"Börgerwald II"},{"v":0,"d":"0.0"},"x","0",0,0,0,0,0,0,0,0,"0",0,0,0,{"$nulls":5},{"v":0,"d":"0.0"},1,0,""]
[{"$nulls":6},{"$f":"LARGE(G10:G45,1)+LARGE(G10:G45,2)+LARGE(G10:G45,3)","v":929.5},{"$f":"SUM(H10:H45)","v":4},{"$f":"LARGE(I10:I45,1)+LARGE(I10:I45,2)+LARGE(I10:I45,3)","v":934.4},{"$f":"SUM(J10:J45)","v":4},{"$f":"LARGE(K10:K45,1)+LARGE(K10:K45,2)+LARGE(K10:K45,3)","v":928.1999999999999},{"$f":"SUM(L10:L45)","v":4},{"$f":"LARGE(M10:M45,1)+LARGE(M10:M45,2)+LARGE(M10:M45,3)","v":934.1},{"$f":"SUM(N10:N45)","v":4},{"$f":"LARGE(O10:O45,1)+LARGE(O10:O45,2)+LARGE(O10:O45,3)","v":930.7},{"$f":"SUM(P10:P45)","v":4},{"$f":"LARGE(Q10:Q45,1)+LARGE(Q10:Q45,2)+LARGE(Q10:Q45,3)","v":934.4},{"$f":"SUM(R10:S45)","v":4}]
[null,null,"per Email an: sk-huemmling@gmx.de"]

{"sheet":"9","index":9,"n_rows":47,"n_cols":27,"rows_kept":47,"merged":[[0,22,0,23],[1,22,1,23],[4,22,4,23],[5,22,5,23],[6,22,6,23],[8,20,8,23]]}
[null,"Verein / Gruppe",null,"Ergebnisse",{"$nulls":17},"Austragungsort:",{"$f":"Übersicht!N4","v":"Börger"}]
[1,{"$f":"'Wettkampf 1'!B2","v":"Neuvrees I"},null,{"$f":"G46","v":931.7},{"$f":"IF(H46>4,\"Es sind zu viele Schützen in Wertung!\",\" \")","v":" "},{"$nulls":16},"Wettkampftag:",{"$f":"Übersicht!N3","v":"16.02."}]
[2,{"$f":"'Wettkampf 1'!B3","v":"Rastdorf III"},null,{"$f":"I46","v":{"v":936,"d":"936.0"}},{"$f":"IF(J46>4,\"Es sind zu viele Schützen in Wertung!\",\" \")","v":" "}]
[3,{"$f":"'Wettkampf 1'!B4","v":"Börger II"},null,{"$f":"K46","v":{"v":928.9000000000001,"d":"928.9"}},{"$f":"IF(L46>4,\"Es sind zu viele Schützen in Wertung!\",\" \")","v":" "},{"$nulls":18},"Ansprechpartner für Rückfragen:"]
[4,{"$f":"'Wettkampf 1'!B5","v":"Esterwegen III"},null,{"$f":"M46","v":{"v":932.5000000000001,"d":"932.5"}},{"$f":"IF(N46>4,\"Es sind zu viele Schützen in Wertung!\",\" \")","v":" "},{"$nulls":16},"Name:","Zdralik"]
[5,{"$f":"'Wettkampf 1'!B6","v":"Börgerwald II"},null,{"$f":"O46","v":933.5},{"$f":"IF(P46>4,\"Es sind zu viele Schützen in Wertung!\",\" \")","v":" "},{"$nulls":16},"Tel:","01713283862"]
[6,{"$f":"'Wettkampf 1'!B7","v":"Spahnharrenstätte II"},null,{"$f":"Q46","v":915.8},{"$f":"IF(R46>4,\"Es sind zu viele Schützen in Wertung!\",\" \")","v":" "},{"$nulls":16},"Standaufsicht:","eintragen"]
[]
[null,"Einzelergebnisse:","Verein / Gruppe","Ergebnisse (mindestens 0 eintragen)","AW? Dann x eintippen",null,"Verein 1",null,"Verein 2",null,"Verein 3",null,"Verein 4",null,"Verein 5",null,"Verein 6",{"$nulls":3},"Proberechnung bei Streifen:"]
[1,{"$f":"'Wettkampf 1'!B10","v":"Rolfes Wilhelm"},{"$f":"'Wettkampf 1'!C10","v":"Neuvrees I"},306.3,null,{"$f":"IF(E10=\"x\",\"0\",D10)","v":306.3},{"$f":"IF(C10=$B$2,F10,0)","v":306.3},{"$f":"(IF(AND($E10=\"\",$C10=$B$2),1,0))","v":1},{"$f":"IF($C10=$B$3,F10,0)","v":0},{"$f":"(IF(AND($E10=\"\",$C10=$B$3),1,0))","v":0},{"$f":"IF($C10=$B$4,F10,0)","v":0},{"$f":"(IF(AND($E10=\"\",$C10=$B$4),1,0))","v":0},{"$f":"IF($C10=$B$5,F10,0)","v":0},{"$f":"(IF(AND($E10=\"\",$C10=$B$5),1,0))","v":0},{"$f":"IF($C10=$B$6,F10,0)","v":0},{"$f":"(IF(AND($E10=\"\",$C10=$B$6),1,0))","v":0},{"$f":"IF($C10=$B$7,F10,0)","v":0},{"$f":"(IF(AND($E10=\"\",$C10=$B$7),1,0))","v":0},{"$nulls":5},{"$f":"U10+V10+W10","v":{"v":0,"d":"0.0"}},{"$f":"IF(X10=D10,1,0)","v":0},{"$f":"IF(X10=0,0,1)","v":0},{"$f":"IF(Y10+Z10=2,\"Korrekt\",\"\")","v":""}]
[2,{"$f":"'Wettkampf 1'!B11","v":"Steenken Klaus"},{"$f":"'Wettkampf 1'!C11","v":"Neuvrees I"},306.6,null,{"$f":"IF(E11=\"x\",\"0\",D11)","v":306.6},{"$f":"IF(C11=$B$2,F11,0)","v":306.6},{"$f":"(IF(AND($E11=\"\",$C11=$B$2),1,0))","v":1},{"$f":"IF($C11=$B$3,F11,0)","v":0},{"$f":"(IF(AND($E11=\"\",$C11=$B$3),1,0))","v":0},{"$f":"IF($C11=$B$4,F11,0)","v":0},{"$f":"(IF(AND($E11=\"\",$C11=$B$4),1,0))","v":0},{"$f":"IF($C11=$B$5,F11,0)","v":0},{"$f":"(IF(AND($E11=\"\",$C11=$B$5),1,0))","v":0},{"$f":"IF($C11=$B$6,F11,0)","v":0},{"$f":"(IF(AND($E11=\"\",$C11=$B$6),1,0))","v":0},{"$f":"IF($C11=$B$7,F11,0)","v":0},{"$f":"(IF(AND($E11=\"\",$C11=$B$7),1,0))","v":0},{"$nulls":5},{"$f":"U11+V11+W11","v":{"v":0,"d":"0.0"}},{"$f":"IF(X11=D11,1,0)","v":0},{"$f":"IF(X11=0,0,1)","v":0},{"$f":"IF(Y11+Z11=2,\"Korrekt\",\"\")","v":""}]
[3,{"$f":"'Wettkampf 1'!B12","v":"Breyer Wilfried"},{"$f":"'Wettkampf 1'!C12","v":"Neuvrees I"},{"v":313,"d":"313.0"},null,{"v":313,"d":"313.0"},313,1,0,0,0,0,0,0,0,0,0,0,{"$nulls":5},{"v":0,"d":"0.0"},0,0,""]
[4,{"$f":"'Wettkampf 1'!B13","v":"Janßen Markus"},{"$f":"'Wettkampf 1'!C13","v":"Neuvrees I"},312.1,null,312.1,312.1,1,0,0,0,0,0,0,0,0,0,0,{"$nulls":5},{"v":0,"d":"0.0"},0,0,""]
[5,{"$f":"'Wettkampf 1'!B14","v":"Thyen Werner"},{"$f":"'Wettkampf 1'!C14","v":"Neuvrees I"},301.5,"x","0","0",0,0,0,0,0,0,0,0,0,0,0,{"$nulls":5},{"v":0,"d":"0.0"},0,0,""]
[6,{"$f":"'Wettkampf 1'!B15","v":"Peters Carsten"},{"$f":"'Wettkampf 1'!C15","v":"Neuvrees I"},null,"x","0","0",0,0,0,0,0,0,0,0,0,0,0,{"$nulls":5},{"v":0,"d":"0.0"},1,0,""]
[7,{"$f":"'Wettkampf 1'!B16","v":"Wotte Robert"},{"$f":"'Wettkampf 1'!C16","v":"Rastdorf III"},314.4,null,314.4,0,0,314.4,1,0,0,0,0,0,0,0,0,{"$nulls":5},{"v":0,"d":"0.0"},0,0,""]
[8,{"$f":"'Wettkampf 1'!B17","v":"Müller Helmut"},{"$f":"'Wettkampf 1'!C17","v":"Rastdorf III"},312.4,null,312.4,0,0,312.4,1,0,0,0,0,0,0,0,0,{"$nulls":5},{"v":0,"d":"0.0"},0,0,""]
[9,{"$f":"'Wettkampf 1'!B18","v":"Bookjans Günther"},{"$f":"'Wettkampf 1'!C18","v":"Rastdorf III"},309.2,null,309.2,0,0,309.2,1,0,0,0,0,0,0,0,0,{"$nulls":5},{"v":0,"d":"0.0"},0,0,""]
[10,{"$f":"'Wettkampf 1'!B19","v":"Meer Michael"},{"$f":"'Wettkampf 1'!C19","v":"Rastdorf III"},305.6,null,305.6,0,0,305.6,1,0,0,0,0,0,0,0,0,{"$nulls":5},{"v":0,"d":"0.0"},0,0,""]
[11,{"$f":"'Wettkampf 1'!B20","v":"Lindemann Rita"},{"$f":"'Wettkampf 1'!C20","v":"Rastdorf III"},null,"x","0",0,0,"0",0,0,0,0,0,0,0,0,0,{"$nulls":5},{"v":0,"d":"0.0"},1,0,""]
[12,{"$f":"'Wettkampf 1'!B21","v":"Olliges Kai"},{"$f":"'Wettkampf 1'!C21","v":"Börgerwald II"},null,"x","0",0,0,0,0,0,0,0,0,"0",0,0,0,{"$nulls":5},{"v":0,"d":"0.0"},1,0,""]
[13,{"$f":"'Wettkampf 1'!B22","v":"Zdralik Ingo"},{"$f":"'Wettkampf 1'!C22","v":"Börger II"},312.8,null,312.8,0,0,0,0,312.8,1,0,0,0,0,0,0,{"$nulls":5},{"v":0,"d":"0.0"},0,0,""]
[14,{"$f":"'Wettkampf 1'!B23","v":"Goldenstein Uwe"},{"$f":"'Wettkampf 1'!C23","v":"Börger II"},301.7,null,301.7,0,0,0,0,301.7,1,0,0,0,0,0,0,{"$nulls":5},{"v":0,"d":"0.0"},0,0,""]
[15,{"$f":"'Wettkampf 1'!B24","v":"Eckmann Mark"},{"$f":"'Wettkampf 1'!C24","v":"Börger II"},{"v":304,"d":"304.0"},"x","0",0,0,0,0,"0",0,0,0,0,0,0,0,{"$nulls":5},{"v":0,"d":"0.0"},0,0,""]
[16,{"$f":"'Wettkampf 1'!B25","v":"Schulz Simon"},{"$f":"'Wettkampf 1'!C25","v":"Börger II"},296.8,"x","0",0,0,0,0,"0",0,0,0,0,0,0,0,{"$nulls":5},{"v":0,"d":"0.0"},0,0,""]
[17,{"$f":"'Wettkampf 1'!B26","v":"Schwarte Hermann"},{"$f":"'Wettkampf 1'!C26","v":"Börger II"},307.5,null,307.5,0,0,0,0,307.5,1,0,0,0,0,0,0,{"$nulls":5},{"v":0,"d":"0.0"},0,0,""]
[18,{"$f":"'Wettkampf 1'!B27","v":"Jungsthoefel Markus"},{"$f":"'Wettkampf 1'!C27","v":"Börger II"},308.6,null,308.6,0,0,0,0,308.6,1,0,0,0,0,0,0,{"$nulls":5},{"v":0,"d":"0.0"},0,0,""]
[19,{"$f":"'Wettkampf 1'!B28","v":"Aldfeld Helmut"},{"$f":"'Wettkampf 1'!C28","v":"Esterwegen III"},null,"x","0",0,0,0,0,0,0,"0",0,0,0,0,0,{"$nulls":5},{"v":0,"d":"0.0"},1,0,""]
[20,{"$f":"'Wettkampf 1'!B29","v":"Schulte Mathias"},{"$f":"'Wettkampf 1'!C29","v":"Esterwegen III"},308.3,null,308.3,0,0,0,0,0,0,308.3,1,0,0,0,0,{"$nulls":5},{"v":0,"d":"0.0"},0,0,""]
[21,{"$f":"'Wettkampf 1'!B30","v":"Middendorf Peter"},{"$f":"'Wettkampf 1'!C30","v":"Esterwegen III"},306.6,null,306.6,0,0,0,0,0,0,306.6,1,0,0,0,0,{"$nulls":5},{"v":0,"d":"0.0"},0,0,""]
[22,{"$f":"'Wettkampf 1'!B31","v":"Meibers Michael"},{"$f":"'Wettkampf 1'!C31","v":"Esterwegen III"},317.6,null,317.6,0,0,0,0,0,0,317.6,1,0,0,0,0,{"$nulls":5},{"v":0,"d":"0.0"},0,0,""]
[23,{"$f":"'Wettkampf 1'!B32","v":"Heidemann Jürgen"},{"$f":"'Wettkampf 1'!C32","v":"Esterwegen III"},null,"x","0",0,0,0,0,0,0,"0",0,0,0,0,0,{"$nulls":5},{"v":0,"d":"0.0"},1,0,""]
[24,{"$f":"'Wettkampf 1'!B33","v":"Lindemann Gerd"},{"$f":"'Wettkampf 1'!C33","v":"Esterwegen III"},303.3,null,303.3,0,0,0,0,0,0,303.3,1,0,0,0,0,{"$nulls":5},{"v":0,"d":"0.0"},0,0,""]
[25,{"$f":"'Wettkampf 1'!B34","v":"Hanenkamp Andre"},{"$f":"'Wettkampf 1'!C34","v":"Börgerwald II"},311.9,null,311.9,0,0,0,0,0,0,0,0,311.9,1,0,0,{"$nulls":5},{"v":0,"d":"0.0"},0,0,""]
[26,{"$f":"'Wettkampf 1'!B35","v":"Antons Mathias"},{"$f":"'Wettkampf 1'!C35","v":"Börgerwald II"},309.6,null,309.6,0,0,0,0,0,0,0,0,309.6,1,0,0,{"$nulls":5},{"v":0,"d":"0.0"},0,0,""]
[27,{"$f":"'Wettkampf 1'!B36","v":"Schröer Friedhelm"},{"$f":"'Wettkampf 1'!C36","v":"Börgerwald II"},{"v":312,"d":"312.0"},null,{"v":312,"d":"312.0"},0,0,0,0,0,0,0,0,312,1,0,0,{"$nulls":5},{"v":0,"d":"0.0"},0,0,""]
[28,{"$f":"'Wettkampf 1'!B37","v":"Sebers Tobias"},{"$f":"'Wettkampf 1'!C37","v":"Börgerwald II"},302.5,"x","0",0,0,0,0,0,0,0,0,"0",0,0,0,{"$nulls":5},{"v":0,"d":"0.0"},0,0,""]
[29,{"$f":"'Wettkampf 1'!B38","v":"Hanneken Moritz"},{"$f":"'Wettkampf 1'!C38","v":"Börgerwald II"},307.3,null,307.3,0,0,0,0,0,0,0,0,307.3,1,0,0,{"$nulls":5},{"v":0,"d":"0.0"},0,0,""]
[30,{"$f":"'Wettkampf 1'!B39","v":"Speeker Dietmar"},{"$f":"'Wettkampf 1'!C39","v":"Börgerwald II"},null,"x","0",0,0,0,0,0,0,0,0,"0",0,0,0,{"$nulls":5},{"v":0,"d":"0.0"},1,0,""]
[31,{"$f":"'Wettkampf 1'!B40","v":"Will Achim"},{"$f":"'Wettkampf 1'!C40","v":"Spahnharrenstätte II"},310.3,null,310.3,0,0,0,0,0,0,0,0,0,0,310.3,1,{"$nulls":5},{"v":0,"d":"0.0"},0,0,""]
[32,{"$f":"'Wettkampf 1'!B41","v":"Meyer Dirk"},{"$f":"'Wettkampf 1'!C41","v":"Spahnharrenstätte II"},null,"x","0",0,0,0,0,0,0,0,0,0,0,"0",0,{"$nulls":5},{"v":0,"d":"0.0"},1,0,""]
[33,{"$f":"'Wettkampf 1'!B42","v":"Micksch Heiko"},{"$f":"'Wettkampf 1'!C42","v":"Spahnharrenstätte II"},307.3,null,307.3,0,0,0,0,0,0,0,0,0,0,307.3,1,{"$nulls":5},{"v":0,"d":"0.0"},0,0,""]
[34,{"$f":"'Wettkampf 1'!B43","v":"Hahnenkamp Ulrich"},{"$f":"'Wettkampf 1'!C43","v":"Spahnharrenstätte II"},274.1,null,274.1,0,0,0,0,0,0,0,0,0,0,274.1,1,{"$nulls":5},{"v":0,"d":"0.0"},0,0,""]
[35,{"$f":"'Wettkampf 1'!B44","v":"Hahnenkamp Markus"},{"$f":"'Wettkampf 1'!C44","v":"Spahnharrenstätte II"},298.2,null,298.2,0,0,0,0,0,0,0,0,0,0,298.2,1,{"$nulls":5},{"v":0,"d":"0.0"},0,0,""]
[36,{"$f":"'Wettkampf 1'!B45","v":"Walker Stefan"},{"$f":"'Wettkampf 1'!C45","v":"Börgerwald II"},null,"x","0",0,0,0,0,0,0,0,0,"0",0,0,0,{"$nulls":5},{"v":0,"d":"0.0"},1,0,""]
[{"$nulls":6},{"$f":"LARGE(G10:G45,1)+LARGE(G10:G45,2)+LARGE(G10:G45,3)","v":931.7},{"$f":"SUM(H10:H45)","v":4},{"$f":"LARGE(I10:I45,1)+LARGE(I10:I45,2)+LARGE(I10:I45,3)","v":936},{"$f":"SUM(J10:J45)","v":4},{"$f":"LARGE(K10:K45,1)+LARGE(K10:K45,2)+LARGE(K10:K45,3)","v":928.9000000000001},{"$f":"SUM(L10:L45)","v":4},{"$f":"LARGE(M10:M45,1)+LARGE(M10:M45,2)+LARGE(M10:M45,3)","v":932.5000000000001},{"$f":"SUM(N10:N45)","v":4},{"$f":"LARGE(O10:O45,1)+LARGE(O10:O45,2)+LARGE(O10:O45,3)","v":933.5},{"$f":"SUM(P10:P45)","v":4},{"$f":"LARGE(Q10:Q45,1)+LARGE(Q10:Q45,2)+LARGE(Q10:Q45,3)","v":915.8},{"$f":"SUM(R10:S45)","v":4}]
[null,null,"per Email an: sk-huemmling@gmx.de"]

{"sheet":"10","index":10,"n_rows":47,"n_cols":27,"rows_kept":47,"merged":[[0,22,0,23],[1,22,1,23],[4,22,4,23],[5,22,5,23],[6,22,6,23],[8,20,8,23]]}
[null,"Verein / Gruppe",null,"Ergebnisse",{"$nulls":17},"Austragungsort:",{"$f":"Übersicht!O4","v":"Neuvrees"}]
[1,{"$f":"'Wettkampf 1'!B2","v":"Neuvrees I"},null,{"$f":"G46","v":{"v":923.1999999999999,"d":"923.2"}},{"$f":"IF(H46>4,\"Es sind zu viele Schützen in Wertung!\",\" \")","v":" "},{"$nulls":16},"Wettkampftag:",{"$f":"Übersicht!O3","v":"02.03."}]
[2,{"$f":"'Wettkampf 1'!B3","v":"Rastdorf III"},null,{"$f":"I46","v":923.3},{"$f":"IF(J46>4,\"Es sind zu viele Schützen in Wertung!\",\" \")","v":" "}]
[3,{"$f":"'Wettkampf 1'!B4","v":"Börger II"},null,{"$f":"K46","v":{"v":916.5999999999999,"d":"916.6"}},{"$f":"IF(L46>4,\"Es sind zu viele Schützen in Wertung!\",\" \")","v":" "},{"$nulls":18},"Ansprechpartner für Rückfragen:"]
[4,{"$f":"'Wettkampf 1'!B5","v":"Esterwegen III"},null,{"$f":"M46","v":{"v":938.9000000000001,"d":"938.9"}},{"$f":"IF(N46>4,\"Es sind zu viele Schützen in Wertung!\",\" \")","v":" "},{"$nulls":16},"Name:","Markus Janßen"]
[5,{"$f":"'Wettkampf 1'!B6","v":"Börgerwald II"},null,{"$f":"O46","v":931.6},{"$f":"IF(P46>4,\"Es sind zu viele Schützen in Wertung!\",\" \")","v":" "},{"$nulls":16},"Tel:"]
[6,{"$f":"'Wettkampf 1'!B7","v":"Spahnharrenstätte II"},null,{"$f":"Q46","v":924.5},{"$f":"IF(R46>4,\"Es sind zu viele Schützen in Wertung!\",\" \")","v":" "},{"$nulls":16},"Standaufsicht:","Markus Janßen"]
[]
[null,"Einzelergebnisse:","Verein / Gruppe","Ergebnisse (mindestens 0 eintragen)","AW? Dann x eintippen",null,"Verein 1",null,"Verein 2",null,"Verein 3",null,"Verein 4",null,"Verein 5",null,"Verein 6",{"$nulls":3},"Proberechnung bei Streifen:"]
[1,{"$f":"'Wettkampf 1'!B10","v":"Rolfes Wilhelm"},{"$f":"'Wettkampf 1'!C10","v":"Neuvrees I"},303.3,"x",{"$f":"IF(E10=\"x\",\"0\",D10)","v":"0"},{"$f":"IF(C10=$B$2,F10,0)","v":"0"},{"$f":"(IF(AND($E10=\"\",$C10=$B$2),1,0))","v":0},{"$f":"IF($C10=$B$3,F10,0)","v":0},{"$f":"(IF(AND($E10=\"\",$C10=$B$3),1,0))","v":0},{"$f":"IF($C10=$B$4,F10,0)","v":0},{"$f":"(IF(AND($E10=\"\",$C10=$B$4),1,0))","v":0},{"$f":"IF($C10=$B$5,F10,0)","v":0},{"$f":"(IF(AND($E10=\"\",$C10=$B$5),1,0))","v":0},{"$f":"IF($C10=$B$6,F10,0)","v":0},{"$f":"(IF(AND($E10=\"\",$C10=$B$6),1,0))","v":0},{"$f":"IF($C10=$B$7,F10,0)","v":0},{"$f":"(IF(AND($E10=\"\",$C10=$B$7),1,0))","v":0},null,null,99.4,102.5,101.4,{"$f":"U10+V10+W10","v":303.3},{"$f":"IF(X10=D10,1,0)","v":1},{"$f":"IF(X10=0,0,1)","v":1},{"$f":"IF(Y10+Z10=2,\"Korrekt\",\"\")","v":"Korrekt"}]
[2,{"$f":"'Wettkampf 1'!B11","v":"Steenken Klaus"},{"$f":"'Wettkampf 1'!C11","v":"Neuvrees I"},{"v":305,"d":"305.0"},null,{"$f":"IF(E11=\"x\",\"0\",D11)","v":{"v":305,"d":"305.0"}},{"$f":"IF(C11=$B$2,F11,0)","v":305},{"$f":"(IF(AND($E11=\"\",$C11=$B$2),1,0))","v":1},{"$f":"IF($C11=$B$3,F11,0)","v":0},{"$f":"(IF(AND($E11=\"\",$C11=$B$3),1,0))","v":0},{"$f":"IF($C11=$B$4,F11,0)","v":0},{"$f":"(IF(AND($E11=\"\",$C11=$B$4),1,0))","v":0},{"$f":"IF($C11=$B$5,F11,0)","v":0},{"$f":"(IF(AND($E11=\"\",$C11=$B$5),1,0))","v":0},{"$f":"IF($C11=$B$6,F11,0)","v":0},{"$f":"(IF(AND($E11=\"\",$C11=$B$6),1,0))","v":0},{"$f":"IF($C11=$B$7,F11,0)","v":0},{"$f":"(IF(AND($E11=\"\",$C11=$B$7),1,0))","v":0},null,null,101.1,101.4,102.5,{"$f":"U11+V11+W11","v":{"v":305,"d":"305.0"}},{"$f":"IF(X11=D11,1,0)","v":1},{"$f":"IF(X11=0,0,1)","v":1},{"$f":"IF(Y11+Z11=2,\"Korrekt\",\"\")","v":"Korrekt"}]
[3,{"$f":"'Wettkampf 1'!B12","v":"Breyer Wilfried"},{"$f":"'Wettkampf 1'!C12","v":"Neuvrees I"},{"v":310,"d":"310.0"},null,{"v":310,"d":"310.0"},310,1,0,0,0,0,0,0,0,0,0,0,null,null,103.2,102.6,104.2,{"v":310,"d":"310.0"},1,1,"Korrekt"]
[4,{"$f":"'Wettkampf 1'!B13","v":"Janßen Markus"},{"$f":"'Wettkampf 1'!C13","v":"Neuvrees I"},305.4,null,305.4,305.4,1,0,0,0,0,0,0,0,0,0,0,null,null,101.7,102.2,101.5,305.4,1,1,"Korrekt"]
[5,{"$f":"'Wettkampf 1'!B14","v":"Thyen Werner"},{"$f":"'Wettkampf 1'!C14","v":"Neuvrees I"},307.8,null,307.8,307.8,1,0,0,0,0,0,0,0,0,0,0,null,null,103.7,{"v":101,"d":"101.0"},103.1,{"v":307.79999999999995,"d":"307.8"},1,1,"Korrekt"]
[6,{"$f":"'Wettkampf 1'!B15","v":"Peters Carsten"},{"$f":"'Wettkampf 1'!C15","v":"Neuvrees I"},null,"x","0","0",0,0,0,0,0,0,0,0,0,0,0,{"$nulls":5},{"v":0,"d":"0.0"},1,0,""]
[7,{"$f":"'Wettkampf 1'!B16","v":"Wotte Robert"},{"$f":"'Wettkampf 1'!C16","v":"Rastdorf III"},308.4,null,308.4,0,0,308.4,1,0,0,0,0,0,0,0,0,null,null,102.2,103.7,102.5,308.4,1,1,"Korrekt"]
[8,{"$f":"'Wettkampf 1'!B17","v":"Müller Helmut"},{"$f":"'Wettkampf 1'!C17","v":"Rastdorf III"},302.8,null,302.8,0,0,302.8,1,0,0,0,0,0,0,0,0,null,null,101.8,99.8,101.2,302.8,1,1,"Korrekt"]
[9,{"$f":"'Wettkampf 1'!B18","v":"Bookjans Günther"},{"$f":"'Wettkampf 1'!C18","v":"Rastdorf III"},311.7,null,311.7,0,0,311.7,1,0,0,0,0,0,0,0,0,null,null,104.9,103.8,{"v":103,"d":"103.0"},311.7,1,1,"Korrekt"]
[10,{"$f":"'Wettkampf 1'!B19","v":"Meer Michael"},{"$f":"'Wettkampf 1'!C19","v":"Rastdorf III"},303.2,null,303.2,0,0,303.2,1,0,0,0,0,0,0,0,0,null,null,100.8,101.6,100.8,303.2,1,1,"Korrekt"]
[11,{"$f":"'Wettkampf 1'!B20","v":"Lindemann Rita"},{"$f":"'Wettkampf 1'!C20","v":"Rastdorf III"},316.6,"x","0",0,0,"0",0,0,0,0,0,0,0,0,0,{"$nulls":5},{"v":0,"d":"0.0"},0,0,""]
[12,{"$f":"'Wettkampf 1'!B21","v":"Olliges Kai"},{"$f":"'Wettkampf 1'!C21","v":"Börgerwald II"},null,"x","0",0,0,0,0,0,0,0,0,"0",0,0,0,{"$nulls":5},{"v":0,"d":"0.0"},1,0,""]
[13,{"$f":"'Wettkampf 1'!B22","v":"Zdralik Ingo"},{"$f":"'Wettkampf 1'!C22","v":"Börger II"},314.5,null,314.5,0,0,0,0,314.5,1,0,0,0,0,0,0,null,null,{"v":104,"d":"104.0"},104.9,105.6,314.5,1,1,"Korrekt"]
[14,{"$f":"'Wettkampf 1'!B23","v":"Goldenstein Uwe"},{"$f":"'Wettkampf 1'!C23","v":"Börger II"},302.3,null,302.3,0,0,0,0,302.3,1,0,0,0,0,0,0,null,null,102.2,98.6,101.5,302.3,1,1,"Korrekt"]
[15,{"$f":"'Wettkampf 1'!B24","v":"Eckmann Mark"},{"$f":"'Wettkampf 1'!C24","v":"Börger II"},299.8,null,299.8,0,0,0,0,299.8,1,0,0,0,0,0,0,null,null,101.5,98.2,100.1,{"v":299.79999999999995,"d":"299.8"},1,1,"Korrekt"]
[16,{"$f":"'Wettkampf 1'!B25","v":"Schulz Simon"},{"$f":"'Wettkampf 1'!C25","v":"Börger II"},null,"x","0",0,0,0,0,"0",0,0,0,0,0,0,0,{"$nulls":5},{"v":0,"d":"0.0"},1,0,""]
[17,{"$f":"'Wettkampf 1'!B26","v":"Schwarte Hermann"},{"$f":"'Wettkampf 1'!C26","v":"Börger II"},null,"x","0",0,0,0,0,"0",0,0,0,0,0,0,0,{"$nulls":5},{"v":0,"d":"0.0"},1,0,""]
[18,{"$f":"'Wettkampf 1'!B27","v":"Jungsthoefel Markus"},{"$f":"'Wettkampf 1'!C27","v":"Börger II"},287.8,null,287.8,0,0,0,0,287.8,1,0,0,0,0,0,0,null,null,100.6,{"v":99,"d":"99.0"},88.2,287.8,1,1,"Korrekt"]
[19,{"$f":"'Wettkampf 1'!B28","v":"Aldfeld Helmut"},{"$f":"'Wettkampf 1'!C28","v":"Esterwegen III"},null,"x","0",0,0,0,0,0,0,"0",0,0,0,0,0,{"$nulls":5},{"v":0,"d":"0.0"},1,0,""]
[20,{"$f":"'Wettkampf 1'!B29","v":"Schulte Mathias"},{"$f":"'Wettkampf 1'!C29","v":"Esterwegen III"},307.8,null,307.8,0,0,0,0,0,0,307.8,1,0,0,0,0,null,null,102.5,101.8,103.5,307.8,1,1,"Korrekt"]
[21,{"$f":"'Wettkampf 1'!B30","v":"Middendorf Peter"},{"$f":"'Wettkampf 1'!C30","v":"Esterwegen III"},315.5,null,315.5,0,0,0,0,0,0,315.5,1,0,0,0,0,null,null,{"v":106,"d":"106.0"},105.3,104.2,315.5,1,1,"Korrekt"]
[22,{"$f":"'Wettkampf 1'!B31","v":"Meibers Michael"},{"$f":"'Wettkampf 1'!C31","v":"Esterwegen III"},315.6,null,315.6,0,0,0,0,0,0,315.6,1,0,0,0,0,null,null,105.5,104.9,105.2,315.6,1,1,"Korrekt"]
[23,{"$f":"'Wettkampf 1'!B32","v":"Heidemann Jürgen"},{"$f":"'Wettkampf 1'!C32","v":"Esterwegen III"},null,"x","0",0,0,0,0,0,0,"0",0,0,0,0,0,{"$nulls":5},{"v":0,"d":"0.0"},1,0,""]
[24,{"$f":"'Wettkampf 1'!B33","v":"Lindemann Gerd"},{"$f":"'Wettkampf 1'!C33","v":"Esterwegen III"},301.3,null,301.3,0,0,0,0,0,0,301.3,1,0,0,0,0,null,null,100.7,97.7,102.9,301.3,1,1,"Korrekt"]
[25,{"$f":"'Wettkampf 1'!B34","v":"Hanenkamp Andre"},{"$f":"'Wettkampf 1'!C34","v":"Börgerwald II"},312.2,null,312.2,0,0,0,0,0,0,0,0,312.2,1,0,0,null,null,104.2,104.5,103.5,312.2,1,1,"Korrekt"]
[26,{"$f":"'Wettkampf 1'!B35","v":"Antons Mathias"},{"$f":"'Wettkampf 1'!C35","v":"Börgerwald II"},306.2,null,306.2,0,0,0,0,0,0,0,0,306.2,1,0,0,null,null,102.3,{"v":102,"d":"102.0"},101.9,{"v":306.20000000000005,"d":"306.2"},1,1,"Korrekt"]
[27,{"$f":"'Wettkampf 1'!B36","v":"Schröer Friedhelm"},{"$f":"'Wettkampf 1'!C36","v":"Börgerwald II"},311.3,null,311.3,0,0,0,0,0,0,0,0,311.3,1,0,0,null,null,103.4,104.5,103.4,311.3,1,1,"Korrekt"]
[28,{"$f":"'Wettkampf 1'!B37","v":"Sebers Tobias"},{"$f":"'Wettkampf 1'!C37","v":"Börgerwald II"},298.7,"x","0",0,0,0,0,0,0,0,0,"0",0,0,0,null,null,98.7,100.1,99.9,{"v":298.70000000000005,"d":"298.7"},1,1,"Korrekt"]
[29,{"$f":"'Wettkampf 1'!B38","v":"Hanneken Moritz"},{"$f":"'Wettkampf 1'!C38","v":"Börgerwald II"},308.1,null,308.1,0,0,0,0,0,0,0,0,308.1,1,0,0,null,null,103.5,101.3,103.3,308.1,1,1,"Korrekt"]
[30,{"$f":"'Wettkampf 1'!B39","v":"Speeker Dietmar"},{"$f":"'Wettkampf 1'!C39","v":"Börgerwald II"},null,"x","0",0,0,0,0,0,0,0,0,"0",0,0,0,{"$nulls":5},{"v":0,"d":"0.0"},1,0,""]
[31,{"$f":"'Wettkampf 1'!B40","v":"Will Achim"},{"$f":"'Wettkampf 1'!C40","v":"Spahnharrenstätte II"},305.9,null,305.9,0,0,0,0,0,0,0,0,0,0,305.9,1,null,null,103.6,101.9,100.4,305.9,1,1,"Korrekt"]
[32,{"$f":"'Wettkampf 1'!B41","v":"Meyer Dirk"},{"$f":"'Wettkampf 1'!C41","v":"Spahnharrenstätte II"},309.5,null,309.5,0,0,0,0,0,0,0,0,0,0,309.5,1,null,null,105.2,{"v":102,"d":"102.0"},102.3,309.5,1,1,"Korrekt"]
[33,{"$f":"'Wettkampf 1'!B42","v":"Micksch Heiko"},{"$f":"'Wettkampf 1'!C42","v":"Spahnharrenstätte II"},309.1,null,309.1,0,0,0,0,0,0,0,0,0,0,309.1,1,null,null,{"v":103,"d":"103.0"},102.9,103.2,309.1,1,1,"Korrekt"]
[34,{"$f":"'Wettkampf 1'!B43","v":"Hahnenkamp Ulrich"},{"$f":"'Wettkampf 1'!C43","v":"Spahnharrenstätte II"},301.2,null,301.2,0,0,0,0,0,0,0,0,0,0,301.2,1,null,null,100.5,99.6,101.1,301.2,1,1,"Korrekt"]
[35,{"$f":"'Wettkampf 1'!B44","v":"Hahnenkamp Markus"},{"$f":"'Wettkampf 1'!C44","v":"Spahnharrenstätte II"},null,"x","0",0,0,0,0,0,0,0,0,0,0,"0",0,{"$nulls":5},{"v":0,"d":"0.0"},1,0,""]
[36,{"$f":"'Wettkampf 1'!B45","v":"Walker Stefan"},{"$f":"'Wettkampf 1'!C45","v":"Börgerwald II"},null,"x","0",0,0,0,0,0,0,0,0,"0",0,0,0,{"$nulls":5},{"v":0,"d":"0.0"},1,0,""]
[{"$nulls":6},{"$f":"LARGE(G10:G45,1)+LARGE(G10:G45,2)+LARGE(G10:G45,3)","v":923.1999999999999},{"$f":"SUM(H10:H45)","v":4},{"$f":"LARGE(I10:I45,1)+LARGE(I10:I45,2)+LARGE(I10:I45,3)","v":923.3},{"$f":"SUM(J10:J45)","v":4},{"$f":"LARGE(K10:K45,1)+LARGE(K10:K45,2)+LARGE(K10:K45,3)","v":916.5999999999999},{"$f":"SUM(L10:L45)","v":4},{"$f":"LARGE(M10:M45,1)+LARGE(M10:M45,2)+LARGE(M10:M45,3)","v":938.9000000000001},{"$f":"SUM(N10:N45)","v":4},{"$f":"LARGE(O10:O45,1)+LARGE(O10:O45,2)+LARGE(O10:O45,3)","v":931.6},{"$f":"SUM(P10:P45)","v":4},{"$f":"LARGE(Q10:Q45,1)+LARGE(Q10:Q45,2)+LARGE(Q10:Q45,3)","v":924.5},{"$f":"SUM(R10:S45)","v":4}]
[null,null,"per Email an: sk-huemmling@gmx.de"]

{"sheet":"11","index":11,"n_rows":47,"n_cols":27,"rows_kept":47,"merged":[[0,22,0,23],[1,22,1,23],[4,22,4,23],[5,22,5,23],[6,22,6,23],[8,20,8,23]]}
[null,"Verein / Gruppe",null,"Ergebnisse",{"$nulls":17},"Austragungsort:",{"$f":"Übersicht!P4","v":"Börgerwald"}]
[1,{"$f":"'Wettkampf 1'!B2","v":"Neuvrees I"},null,{"$f":"G46","v":934.5},{"$f":"IF(H46>4,\"Es sind zu viele Schützen in Wertung!\",\" \")","v":" "},{"$nulls":16},"Wettkampftag:",{"$f":"Übersicht!P3","v":"16.03."}]
[2,{"$f":"'Wettkampf 1'!B3","v":"Rastdorf III"},null,{"$f":"I46","v":945.9},{"$f":"IF(J46>4,\"Es sind zu viele Schützen in Wertung!\",\" \")","v":" "}]
[3,{"$f":"'Wettkampf 1'!B4","v":"Börger II"},null,{"$f":"K46","v":{"v":935,"d":"935.0"}},{"$f":"IF(L46>4,\"Es sind zu viele Schützen in Wertung!\",\" \")","v":" "},{"$nulls":18},"Ansprechpartner für Rückfragen:"]
[4,{"$f":"'Wettkampf 1'!B5","v":"Esterwegen III"},null,{"$f":"M46","v":939.4},{"$f":"IF(N46>4,\"Es sind zu viele Schützen in Wertung!\",\" \")","v":" "},{"$nulls":16},"Name:","Mathis Antons"]
[5,{"$f":"'Wettkampf 1'!B6","v":"Börgerwald II"},null,{"$f":"O46","v":{"v":942.3000000000001,"d":"942.3"}},{"$f":"IF(P46>4,\"Es sind zu viele Schützen in Wertung!\",\" \")","v":" "},{"$nulls":16},"Tel:","015252103868"]
[6,{"$f":"'Wettkampf 1'!B7","v":"Spahnharrenstätte II"},null,{"$f":"Q46","v":933.6},{"$f":"IF(R46>4,\"Es sind zu viele Schützen in Wertung!\",\" \")","v":" "},{"$nulls":16},"Standaufsicht:","Mathis Antons"]
[]
[null,"Einzelergebnisse:","Verein / Gruppe","Ergebnisse (mindestens 0 eintragen)","AW? Dann x eintippen",null,"Verein 1",null,"Verein 2",null,"Verein 3",null,"Verein 4",null,"Verein 5",null,"Verein 6",{"$nulls":3},"Proberechnung bei Streifen:"]
[1,{"$f":"'Wettkampf 1'!B10","v":"Rolfes Wilhelm"},{"$f":"'Wettkampf 1'!C10","v":"Neuvrees I"},307.1,"x",{"$f":"IF(E10=\"x\",\"0\",D10)","v":"0"},{"$f":"IF(C10=$B$2,F10,0)","v":"0"},{"$f":"(IF(AND($E10=\"\",$C10=$B$2),1,0))","v":0},{"$f":"IF($C10=$B$3,F10,0)","v":0},{"$f":"(IF(AND($E10=\"\",$C10=$B$3),1,0))","v":0},{"$f":"IF($C10=$B$4,F10,0)","v":0},{"$f":"(IF(AND($E10=\"\",$C10=$B$4),1,0))","v":0},{"$f":"IF($C10=$B$5,F10,0)","v":0},{"$f":"(IF(AND($E10=\"\",$C10=$B$5),1,0))","v":0},{"$f":"IF($C10=$B$6,F10,0)","v":0},{"$f":"(IF(AND($E10=\"\",$C10=$B$6),1,0))","v":0},{"$f":"IF($C10=$B$7,F10,0)","v":0},{"$f":"(IF(AND($E10=\"\",$C10=$B$7),1,0))","v":0},null,null,102.4,103.5,101.2,{"$f":"U10+V10+W10","v":307.1},{"$f":"IF(X10=D10,1,0)","v":1},{"$f":"IF(X10=0,0,1)","v":1},{"$f":"IF(Y10+Z10=2,\"Korrekt\",\"\")","v":"Korrekt"}]
[2,{"$f":"'Wettkampf 1'!B11","v":"Steenken Klaus"},{"$f":"'Wettkampf 1'!C11","v":"Neuvrees I"},309.7,null,{"$f":"IF(E11=\"x\",\"0\",D11)","v":309.7},{"$f":"IF(C11=$B$2,F11,0)","v":309.7},{"$f":"(IF(AND($E11=\"\",$C11=$B$2),1,0))","v":1},{"$f":"IF($C11=$B$3,F11,0)","v":0},{"$f":"(IF(AND($E11=\"\",$C11=$B$3),1,0))","v":0},{"$f":"IF($C11=$B$4,F11,0)","v":0},{"$f":"(IF(AND($E11=\"\",$C11=$B$4),1,0))","v":0},{"$f":"IF($C11=$B$5,F11,0)","v":0},{"$f":"(IF(AND($E11=\"\",$C11=$B$5),1,0))","v":0},{"$f":"IF($C11=$B$6,F11,0)","v":0},{"$f":"(IF(AND($E11=\"\",$C11=$B$6),1,0))","v":0},{"$f":"IF($C11=$B$7,F11,0)","v":0},{"$f":"(IF(AND($E11=\"\",$C11=$B$7),1,0))","v":0},null,null,102.8,105.3,101.6,{"$f":"U11+V11+W11","v":309.7},{"$f":"IF(X11=D11,1,0)","v":1},{"$f":"IF(X11=0,0,1)","v":1},{"$f":"IF(Y11+Z11=2,\"Korrekt\",\"\")","v":"Korrekt"}]
[3,{"$f":"'Wettkampf 1'!B12","v":"Breyer Wilfried"},{"$f":"'Wettkampf 1'!C12","v":"Neuvrees I"},310.6,null,310.6,310.6,1,0,0,0,0,0,0,0,0,0,0,null,null,103.1,103.6,103.9,310.6,1,1,"Korrekt"]
[4,{"$f":"'Wettkampf 1'!B13","v":"Janßen Markus"},{"$f":"'Wettkampf 1'!C13","v":"Neuvrees I"},314.2,null,314.2,314.2,1,0,0,0,0,0,0,0,0,0,0,null,null,{"v":103,"d":"103.0"},105.5,105.7,314.2,1,1,"Korrekt"]
[5,{"$f":"'Wettkampf 1'!B14","v":"Thyen Werner"},{"$f":"'Wettkampf 1'!C14","v":"Neuvrees I"},{"v":309,"d":"309.0"},null,{"v":309,"d":"309.0"},309,1,0,0,0,0,0,0,0,0,0,0,null,null,101.4,105.3,102.3,{"v":309,"d":"309.0"},1,1,"Korrekt"]
[6,{"$f":"'Wettkampf 1'!B15","v":"Peters Carsten"},{"$f":"'Wettkampf 1'!C15","v":"Neuvrees I"},null,"x","0","0",0,0,0,0,0,0,0,0,0,0,0,{"$nulls":5},{"v":0,"d":"0.0"},1,0,""]
[7,{"$f":"'Wettkampf 1'!B16","v":"Wotte Robert"},{"$f":"'Wettkampf 1'!C16","v":"Rastdorf III"},{"v":315,"d":"315.0"},null,{"v":315,"d":"315.0"},0,0,315,1,0,0,0,0,0,0,0,0,null,null,105.2,103.6,106.2,{"v":315,"d":"315.0"},1,1,"Korrekt"]
[8,{"$f":"'Wettkampf 1'!B17","v":"Müller Helmut"},{"$f":"'Wettkampf 1'!C17","v":"Rastdorf III"},310.2,null,310.2,0,0,310.2,1,0,0,0,0,0,0,0,0,null,null,{"v":103,"d":"103.0"},102.6,104.6,310.2,1,1,"Korrekt"]
[9,{"$f":"'Wettkampf 1'!B18","v":"Bookjans Günther"},{"$f":"'Wettkampf 1'!C18","v":"Rastdorf III"},318.4,null,318.4,0,0,318.4,1,0,0,0,0,0,0,0,0,null,null,106.3,106.5,105.6,318.4,1,1,"Korrekt"]
[10,{"$f":"'Wettkampf 1'!B19","v":"Meer Michael"},{"$f":"'Wettkampf 1'!C19","v":"Rastdorf III"},312.5,null,312.5,0,0,312.5,1,0,0,0,0,0,0,0,0,null,null,105.1,{"v":103,"d":"103.0"},104.4,312.5,1,1,"Korrekt"]
[11,{"$f":"'Wettkampf 1'!B20","v":"Lindemann Rita"},{"$f":"'Wettkampf 1'!C20","v":"Rastdorf III"},null,"x","0",0,0,"0",0,0,0,0,0,0,0,0,0,{"$nulls":5},{"v":0,"d":"0.0"},1,0,""]
[12,{"$f":"'Wettkampf 1'!B21","v":"Olliges Kai"},{"$f":"'Wettkampf 1'!C21","v":"Börgerwald II"},null,"x","0",0,0,0,0,0,0,0,0,"0",0,0,0,{"$nulls":5},{"v":0,"d":"0.0"},1,0,""]
[13,{"$f":"'Wettkampf 1'!B22","v":"Zdralik Ingo"},{"$f":"'Wettkampf 1'!C22","v":"Börger II"},315.7,null,315.7,0,0,0,0,315.7,1,0,0,0,0,0,0,null,null,106.2,105.5,{"v":104,"d":"104.0"},315.7,1,1,"Korrekt"]
[14,{"$f":"'Wettkampf 1'!B23","v":"Goldenstein Uwe"},{"$f":"'Wettkampf 1'!C23","v":"Börger II"},308.8,null,308.8,0,0,0,0,308.8,1,0,0,0,0,0,0,null,null,{"v":102,"d":"102.0"},104.4,102.4,308.8,1,1,"Korrekt"]
[15,{"$f":"'Wettkampf 1'!B24","v":"Eckmann Mark"},{"$f":"'Wettkampf 1'!C24","v":"Börger II"},310.5,null,310.5,0,0,0,0,310.5,1,0,0,0,0,0,0,null,null,104.9,100.9,104.7,310.5,1,1,"Korrekt"]
[16,{"$f":"'Wettkampf 1'!B25","v":"Schulz Simon"},{"$f":"'Wettkampf 1'!C25","v":"Börger II"},299.8,"x","0",0,0,0,0,"0",0,0,0,0,0,0,0,null,null,{"v":98,"d":"98.0"},98.5,103.3,299.8,1,1,"Korrekt"]
[17,{"$f":"'Wettkampf 1'!B26","v":"Schwarte Hermann"},{"$f":"'Wettkampf 1'!C26","v":"Börger II"},305.1,"x","0",0,0,0,0,"0",0,0,0,0,0,0,0,null,null,101.9,{"v":102,"d":"102.0"},101.2,305.1,1,1,"Korrekt"]
[18,{"$f":"'Wettkampf 1'!B27","v":"Jungsthoefel Markus"},{"$f":"'Wettkampf 1'!C27","v":"Börger II"},301.6,null,301.6,0,0,0,0,301.6,1,0,0,0,0,0,0,null,null,102.7,101.1,97.8,301.6,1,1,"Korrekt"]
[19,{"$f":"'Wettkampf 1'!B28","v":"Aldfeld Helmut"},{"$f":"'Wettkampf 1'!C28","v":"Esterwegen III"},null,"x","0",0,0,0,0,0,0,"0",0,0,0,0,0,{"$nulls":5},{"v":0,"d":"0.0"},1,0,""]
[20,{"$f":"'Wettkampf 1'!B29","v":"Schulte Mathias"},{"$f":"'Wettkampf 1'!C29","v":"Esterwegen III"},312.5,null,312.5,0,0,0,0,0,0,312.5,1,0,0,0,0,null,null,103.7,104.9,103.9,312.5,1,1,"Korrekt"]
[21,{"$f":"'Wettkampf 1'!B30","v":"Middendorf Peter"},{"$f":"'Wettkampf 1'!C30","v":"Esterwegen III"},311.9,null,311.9,0,0,0,0,0,0,311.9,1,0,0,0,0,null,null,101.6,104.5,105.8,311.9,1,1,"Korrekt"]
[22,{"$f":"'Wettkampf 1'!B31","v":"Meibers Michael"},{"$f":"'Wettkampf 1'!C31","v":"Esterwegen III"},{"v":315,"d":"315.0"},null,{"v":315,"d":"315.0"},0,0,0,0,0,0,315,1,0,0,0,0,null,null,105.5,105.4,104.1,{"v":315,"d":"315.0"},1,1,"Korrekt"]
[23,{"$f":"'Wettkampf 1'!B32","v":"Heidemann Jürgen"},{"$f":"'Wettkampf 1'!C32","v":"Esterwegen III"},null,"x","0",0,0,0,0,0,0,"0",0,0,0,0,0,{"$nulls":5},{"v":0,"d":"0.0"},1,0,""]
[24,{"$f":"'Wettkampf 1'!B33","v":"Lindemann Gerd"},{"$f":"'Wettkampf 1'!C33","v":"Esterwegen III"},305.1,null,305.1,0,0,0,0,0,0,305.1,1,0,0,0,0,null,null,104.5,101.4,99.2,305.1,1,1,"Korrekt"]
[25,{"$f":"'Wettkampf 1'!B34","v":"Hanenkamp Andre"},{"$f":"'Wettkampf 1'!C34","v":"Börgerwald II"},312.6,null,312.6,0,0,0,0,0,0,0,0,312.6,1,0,0,null,null,104.2,103.4,{"v":105,"d":"105.0"},312.6,1,1,"Korrekt"]
[26,{"$f":"'Wettkampf 1'!B35","v":"Antons Mathias"},{"$f":"'Wettkampf 1'!C35","v":"Börgerwald II"},313.6,null,313.6,0,0,0,0,0,0,0,0,313.6,1,0,0,null,null,{"v":105,"d":"105.0"},104.6,{"v":104,"d":"104.0"},313.6,1,1,"Korrekt"]
[27,{"$f":"'Wettkampf 1'!B36","v":"Schröer Friedhelm"},{"$f":"'Wettkampf 1'!C36","v":"Börgerwald II"},{"v":312,"d":"312.0"},null,{"v":312,"d":"312.0"},0,0,0,0,0,0,0,0,312,1,0,0,null,null,104.3,103.2,104.5,{"v":312,"d":"312.0"},1,1,"Korrekt"]
[28,{"$f":"'Wettkampf 1'!B37","v":"Sebers Tobias"},{"$f":"'Wettkampf 1'!C37","v":"Börgerwald II"},301.7,"x","0",0,0,0,0,0,0,0,0,"0",0,0,0,null,null,101.7,100.7,99.3,301.7,1,1,"Korrekt"]
[29,{"$f":"'Wettkampf 1'!B38","v":"Hanneken Moritz"},{"$f":"'Wettkampf 1'!C38","v":"Börgerwald II"},316.1,null,316.1,0,0,0,0,0,0,0,0,316.1,1,0,0,null,null,104.4,{"v":105,"d":"105.0"},106.7,316.1,1,1,"Korrekt"]
[30,{"$f":"'Wettkampf 1'!B39","v":"Speeker Dietmar"},{"$f":"'Wettkampf 1'!C39","v":"Börgerwald II"},null,"x","0",0,0,0,0,0,0,0,0,"0",0,0,0,{"$nulls":5},{"v":0,"d":"0.0"},1,0,""]
[31,{"$f":"'Wettkampf 1'!B40","v":"Will Achim"},{"$f":"'Wettkampf 1'!C40","v":"Spahnharrenstätte II"},308.1,null,308.1,0,0,0,0,0,0,0,0,0,0,308.1,1,null,null,{"v":102,"d":"102.0"},{"v":102,"d":"102.0"},104.1,308.1,1,1,"Korrekt"]
[32,{"$f":"'Wettkampf 1'!B41","v":"Meyer Dirk"},{"$f":"'Wettkampf 1'!C41","v":"Spahnharrenstätte II"},311.3,null,311.3,0,0,0,0,0,0,0,0,0,0,311.3,1,null,null,103.3,103.2,104.8,311.3,1,1,"Korrekt"]
[33,{"$f":"'Wettkampf 1'!B42","v":"Micksch Heiko"},{"$f":"'Wettkampf 1'!C42","v":"Spahnharrenstätte II"},314.2,null,314.2,0,0,0,0,0,0,0,0,0,0,314.2,1,null,null,106.1,{"v":104,"d":"104.0"},104.1,314.2,1,1,"Korrekt"]
[34,{"$f":"'Wettkampf 1'!B43","v":"Hahnenkamp Ulrich"},{"$f":"'Wettkampf 1'!C43","v":"Spahnharrenstätte II"},299.7,"x","0",0,0,0,0,0,0,0,0,0,0,"0",0,null,null,98.1,99.8,101.8,299.7,1,1,"Korrekt"]
[35,{"$f":"'Wettkampf 1'!B44","v":"Hahnenkamp Markus"},{"$f":"'Wettkampf 1'!C44","v":"Spahnharrenstätte II"},295.9,null,295.9,0,0,0,0,0,0,0,0,0,0,295.9,1,null,null,101.2,{"v":95,"d":"95.0"},99.7,295.9,1,1,"Korrekt"]
[36,{"$f":"'Wettkampf 1'!B45","v":"Walker Stefan"},{"$f":"'Wettkampf 1'!C45","v":"Börgerwald II"},304.9,"x","0",0,0,0,0,0,0,0,0,"0",0,0,0,null,null,101.7,103.1,100.1,304.9,1,1,"Korrekt"]
[{"$nulls":6},{"$f":"LARGE(G10:G45,1)+LARGE(G10:G45,2)+LARGE(G10:G45,3)","v":934.5},{"$f":"SUM(H10:H45)","v":4},{"$f":"LARGE(I10:I45,1)+LARGE(I10:I45,2)+LARGE(I10:I45,3)","v":945.9},{"$f":"SUM(J10:J45)","v":4},{"$f":"LARGE(K10:K45,1)+LARGE(K10:K45,2)+LARGE(K10:K45,3)","v":935},{"$f":"SUM(L10:L45)","v":4},{"$f":"LARGE(M10:M45,1)+LARGE(M10:M45,2)+LARGE(M10:M45,3)","v":939.4},{"$f":"SUM(N10:N45)","v":4},{"$f":"LARGE(O10:O45,1)+LARGE(O10:O45,2)+LARGE(O10:O45,3)","v":942.3000000000001},{"$f":"SUM(P10:P45)","v":4},{"$f":"LARGE(Q10:Q45,1)+LARGE(Q10:Q45,2)+LARGE(Q10:Q45,3)","v":933.6},{"$f":"SUM(R10:S45)","v":4}]
[null,null,"per Email an: sk-huemmling@gmx.de"]

{"sheet":"12","index":12,"n_rows":47,"n_cols":27,"rows_kept":47,"merged":[[0,22,0,23],[1,22,1,23],[4,22,4,23],[5,22,5,23],[6,22,6,23],[8,20,8,23]]}
[null,"Verein / Gruppe",null,"Ergebnisse",{"$nulls":17},"Austragungsort:",{"$f":"Übersicht!Q4","v":"Spahnharrenstätte"}]
[1,{"$f":"'Wettkampf 1'!B2","v":"Neuvrees I"},null,{"$f":"G46","v":{"v":935,"d":"935.0"}},{"$f":"IF(H46>4,\"Es sind zu viele Schützen in Wertung!\",\" \")","v":" "},{"$nulls":16},"Wettkampftag:",{"$f":"Übersicht!Q3","v":"30.03."}]
[2,{"$f":"'Wettkampf 1'!B3","v":"Rastdorf III"},null,{"$f":"I46","v":935.5},{"$f":"IF(J46>4,\"Es sind zu viele Schützen in Wertung!\",\" \")","v":" "}]
[3,{"$f":"'Wettkampf 1'!B4","v":"Börger II"},null,{"$f":"K46","v":930.7},{"$f":"IF(L46>4,\"Es sind zu viele Schützen in Wertung!\",\" \")","v":" "},{"$nulls":18},"Ansprechpartner für Rückfragen:"]
[4,{"$f":"'Wettkampf 1'!B5","v":"Esterwegen III"},null,{"$f":"M46","v":{"v":941.9000000000001,"d":"941.9"}},{"$f":"IF(N46>4,\"Es sind zu viele Schützen in Wertung!\",\" \")","v":" "},{"$nulls":16},"Name:","Achim Will"]
[5,{"$f":"'Wettkampf 1'!B6","v":"Börgerwald II"},null,{"$f":"O46","v":{"v":939.5999999999999,"d":"939.6"}},{"$f":"IF(P46>4,\"Es sind zu viele Schützen in Wertung!\",\" \")","v":" "},{"$nulls":16},"Tel:"]
[6,{"$f":"'Wettkampf 1'!B7","v":"Spahnharrenstätte II"},null,{"$f":"Q46","v":931.4},{"$f":"IF(R46>4,\"Es sind zu viele Schützen in Wertung!\",\" \")","v":" "},{"$nulls":16},"Standaufsicht:","Achim Will"]
[]
[null,"Einzelergebnisse:","Verein / Gruppe","Ergebnisse (mindestens 0 eintragen)","AW? Dann x eintippen",null,"Verein 1",null,"Verein 2",null,"Verein 3",null,"Verein 4",null,"Verein 5",null,"Verein 6",{"$nulls":3},"Proberechnung bei Streifen:"]
[1,{"$f":"'Wettkampf 1'!B10","v":"Rolfes Wilhelm"},{"$f":"'Wettkampf 1'!C10","v":"Neuvrees I"},311.7,"X",{"$f":"IF(E10=\"x\",\"0\",D10)","v":"0"},{"$f":"IF(C10=$B$2,F10,0)","v":"0"},{"$f":"(IF(AND($E10=\"\",$C10=$B$2),1,0))","v":0},{"$f":"IF($C10=$B$3,F10,0)","v":0},{"$f":"(IF(AND($E10=\"\",$C10=$B$3),1,0))","v":0},{"$f":"IF($C10=$B$4,F10,0)","v":0},{"$f":"(IF(AND($E10=\"\",$C10=$B$4),1,0))","v":0},{"$f":"IF($C10=$B$5,F10,0)","v":0},{"$f":"(IF(AND($E10=\"\",$C10=$B$5),1,0))","v":0},{"$f":"IF($C10=$B$6,F10,0)","v":0},{"$f":"(IF(AND($E10=\"\",$C10=$B$6),1,0))","v":0},{"$f":"IF($C10=$B$7,F10,0)","v":0},{"$f":"(IF(AND($E10=\"\",$C10=$B$7),1,0))","v":0},{"$nulls":5},{"$f":"U10+V10+W10","v":{"v":0,"d":"0.0"}},{"$f":"IF(X10=D10,1,0)","v":0},{"$f":"IF(X10=0,0,1)","v":0},{"$f":"IF(Y10+Z10=2,\"Korrekt\",\"\")","v":""}]
[2,{"$f":"'Wettkampf 1'!B11","v":"Steenken Klaus"},{"$f":"'Wettkampf 1'!C11","v":"Neuvrees I"},309.6,null,{"$f":"IF(E11=\"x\",\"0\",D11)","v":309.6},{"$f":"IF(C11=$B$2,F11,0)","v":309.6},{"$f":"(IF(AND($E11=\"\",$C11=$B$2),1,0))","v":1},{"$f":"IF($C11=$B$3,F11,0)","v":0},{"$f":"(IF(AND($E11=\"\",$C11=$B$3),1,0))","v":0},{"$f":"IF($C11=$B$4,F11,0)","v":0},{"$f":"(IF(AND($E11=\"\",$C11=$B$4),1,0))","v":0},{"$f":"IF($C11=$B$5,F11,0)","v":0},{"$f":"(IF(AND($E11=\"\",$C11=$B$5),1,0))","v":0},{"$f":"IF($C11=$B$6,F11,0)","v":0},{"$f":"(IF(AND($E11=\"\",$C11=$B$6),1,0))","v":0},{"$f":"IF($C11=$B$7,F11,0)","v":0},{"$f":"(IF(AND($E11=\"\",$C11=$B$7),1,0))","v":0},{"$nulls":5},{"$f":"U11+V11+W11","v":{"v":0,"d":"0.0"}},{"$f":"IF(X11=D11,1,0)","v":0},{"$f":"IF(X11=0,0,1)","v":0},{"$f":"IF(Y11+Z11=2,\"Korrekt\",\"\")","v":""}]
[3,{"$f":"'Wettkampf 1'!B12","v":"Breyer Wilfried"},{"$f":"'Wettkampf 1'!C12","v":"Neuvrees I"},311.5,null,311.5,311.5,1,0,0,0,0,0,0,0,0,0,0,{"$nulls":5},{"v":0,"d":"0.0"},0,0,""]
[4,{"$f":"'Wettkampf 1'!B13","v":"Janßen Markus"},{"$f":"'Wettkampf 1'!C13","v":"Neuvrees I"},313.9,null,313.9,313.9,1,0,0,0,0,0,0,0,0,0,0,{"$nulls":5},{"v":0,"d":"0.0"},0,0,""]
[5,{"$f":"'Wettkampf 1'!B14","v":"Thyen Werner"},{"$f":"'Wettkampf 1'!C14","v":"Neuvrees I"},308.8,null,308.8,308.8,1,0,0,0,0,0,0,0,0,0,0,{"$nulls":5},{"v":0,"d":"0.0"},0,0,""]
[6,{"$f":"'Wettkampf 1'!B15","v":"Peters Carsten"},{"$f":"'Wettkampf 1'!C15","v":"Neuvrees I"},{"v":0,"d":"0.0"},"X","0","0",0,0,0,0,0,0,0,0,0,0,0,{"$nulls":5},{"v":0,"d":"0.0"},1,0,""]
[7,{"$f":"'Wettkampf 1'!B16","v":"Wotte Robert"},{"$f":"'Wettkampf 1'!C16","v":"Rastdorf III"},312.3,null,312.3,0,0,312.3,1,0,0,0,0,0,0,0,0,{"$nulls":5},{"v":0,"d":"0.0"},0,0,""]
[8,{"$f":"'Wettkampf 1'!B17","v":"Müller Helmut"},{"$f":"'Wettkampf 1'!C17","v":"Rastdorf III"},308.3,null,308.3,0,0,308.3,1,0,0,0,0,0,0,0,0,{"$nulls":5},{"v":0,"d":"0.0"},0,0,""]
[9,{"$f":"'Wettkampf 1'!B18","v":"Bookjans Günther"},{"$f":"'Wettkampf 1'!C18","v":"Rastdorf III"},309.5,null,309.5,0,0,309.5,1,0,0,0,0,0,0,0,0,{"$nulls":5},{"v":0,"d":"0.0"},0,0,""]
[10,{"$f":"'Wettkampf 1'!B19","v":"Meer Michael"},{"$f":"'Wettkampf 1'!C19","v":"Rastdorf III"},313.7,null,313.7,0,0,313.7,1,0,0,0,0,0,0,0,0,{"$nulls":5},{"v":0,"d":"0.0"},0,0,""]
[11,{"$f":"'Wettkampf 1'!B20","v":"Lindemann Rita"},{"$f":"'Wettkampf 1'!C20","v":"Rastdorf III"},{"v":0,"d":"0.0"},"X","0",0,0,"0",0,0,0,0,0,0,0,0,0,{"$nulls":5},{"v":0,"d":"0.0"},1,0,""]
[12,{"$f":"'Wettkampf 1'!B21","v":"Olliges Kai"},{"$f":"'Wettkampf 1'!C21","v":"Börgerwald II"},{"v":0,"d":"0.0"},"X","0",0,0,0,0,0,0,0,0,"0",0,0,0,{"$nulls":5},{"v":0,"d":"0.0"},1,0,""]
[13,{"$f":"'Wettkampf 1'!B22","v":"Zdralik Ingo"},{"$f":"'Wettkampf 1'!C22","v":"Börger II"},315.8,null,315.8,0,0,0,0,315.8,1,0,0,0,0,0,0,{"$nulls":5},{"v":0,"d":"0.0"},0,0,""]
[14,{"$f":"'Wettkampf 1'!B23","v":"Goldenstein Uwe"},{"$f":"'Wettkampf 1'!C23","v":"Börger II"},305.3,null,305.3,0,0,0,0,305.3,1,0,0,0,0,0,0,{"$nulls":5},{"v":0,"d":"0.0"},0,0,""]
[15,{"$f":"'Wettkampf 1'!B24","v":"Eckmann Mark"},{"$f":"'Wettkampf 1'!C24","v":"Börger II"},305.8,null,305.8,0,0,0,0,305.8,1,0,0,0,0,0,0,{"$nulls":5},{"v":0,"d":"0.0"},0,0,""]
[16,{"$f":"'Wettkampf 1'!B25","v":"Schulz Simon"},{"$f":"'Wettkampf 1'!C25","v":"Börger II"},307.8,"X","0",0,0,0,0,"0",0,0,0,0,0,0,0,{"$nulls":5},{"v":0,"d":"0.0"},0,0,""]
[17,{"$f":"'Wettkampf 1'!B26","v":"Schwarte Hermann"},{"$f":"'Wettkampf 1'!C26","v":"Börger II"},{"v":0,"d":"0.0"},"X","0",0,0,0,0,"0",0,0,0,0,0,0,0,{"$nulls":5},{"v":0,"d":"0.0"},1,0,""]
[18,{"$f":"'Wettkampf 1'!B27","v":"Jungsthoefel Markus"},{"$f":"'Wettkampf 1'!C27","v":"Börger II"},309.1,null,309.1,0,0,0,0,309.1,1,0,0,0,0,0,0,{"$nulls":5},{"v":0,"d":"0.0"},0,0,""]
[19,{"$f":"'Wettkampf 1'!B28","v":"Aldfeld Helmut"},{"$f":"'Wettkampf 1'!C28","v":"Esterwegen III"},{"v":0,"d":"0.0"},"X","0",0,0,0,0,0,0,"0",0,0,0,0,0,{"$nulls":5},{"v":0,"d":"0.0"},1,0,""]
[20,{"$f":"'Wettkampf 1'!B29","v":"Schulte Mathias"},{"$f":"'Wettkampf 1'!C29","v":"Esterwegen III"},{"v":310,"d":"310.0"},null,{"v":310,"d":"310.0"},0,0,0,0,0,0,310,1,0,0,0,0,{"$nulls":5},{"v":0,"d":"0.0"},0,0,""]
[21,{"$f":"'Wettkampf 1'!B30","v":"Middendorf Peter"},{"$f":"'Wettkampf 1'!C30","v":"Esterwegen III"},316.1,null,316.1,0,0,0,0,0,0,316.1,1,0,0,0,0,{"$nulls":5},{"v":0,"d":"0.0"},0,0,""]
[22,{"$f":"'Wettkampf 1'!B31","v":"Meibers Michael"},{"$f":"'Wettkampf 1'!C31","v":"Esterwegen III"},315.8,null,315.8,0,0,0,0,0,0,315.8,1,0,0,0,0,{"$nulls":5},{"v":0,"d":"0.0"},0,0,""]
[23,{"$f":"'Wettkampf 1'!B32","v":"Heidemann Jürgen"},{"$f":"'Wettkampf 1'!C32","v":"Esterwegen III"},{"v":0,"d":"0.0"},"X","0",0,0,0,0,0,0,"0",0,0,0,0,0,{"$nulls":5},{"v":0,"d":"0.0"},1,0,""]
[24,{"$f":"'Wettkampf 1'!B33","v":"Lindemann Gerd"},{"$f":"'Wettkampf 1'!C33","v":"Esterwegen III"},306.8,null,306.8,0,0,0,0,0,0,306.8,1,0,0,0,0,{"$nulls":5},{"v":0,"d":"0.0"},0,0,""]
[25,{"$f":"'Wettkampf 1'!B34","v":"Hanenkamp Andre"},{"$f":"'Wettkampf 1'!C34","v":"Börgerwald II"},308.9,null,308.9,0,0,0,0,0,0,0,0,308.9,1,0,0,{"$nulls":5},{"v":0,"d":"0.0"},0,0,""]
[26,{"$f":"'Wettkampf 1'!B35","v":"Antons Mathias"},{"$f":"'Wettkampf 1'!C35","v":"Börgerwald II"},312.1,null,312.1,0,0,0,0,0,0,0,0,312.1,1,0,0,{"$nulls":5},{"v":0,"d":"0.0"},0,0,""]
[27,{"$f":"'Wettkampf 1'!B36","v":"Schröer Friedhelm"},{"$f":"'Wettkampf 1'!C36","v":"Börgerwald II"},315.7,null,315.7,0,0,0,0,0,0,0,0,315.7,1,0,0,{"$nulls":5},{"v":0,"d":"0.0"},0,0,""]
[28,{"$f":"'Wettkampf 1'!B37","v":"Sebers Tobias"},{"$f":"'Wettkampf 1'!C37","v":"Börgerwald II"},305.1,"X","0",0,0,0,0,0,0,0,0,"0",0,0,0,{"$nulls":5},{"v":0,"d":"0.0"},0,0,""]
[29,{"$f":"'Wettkampf 1'!B38","v":"Hanneken Moritz"},{"$f":"'Wettkampf 1'!C38","v":"Börgerwald II"},311.8,null,311.8,0,0,0,0,0,0,0,0,311.8,1,0,0,{"$nulls":5},{"v":0,"d":"0.0"},0,0,""]
[30,{"$f":"'Wettkampf 1'!B39","v":"Speeker Dietmar"},{"$f":"'Wettkampf 1'!C39","v":"Börgerwald II"},{"v":0,"d":"0.0"},"X","0",0,0,0,0,0,0,0,0,"0",0,0,0,{"$nulls":5},{"v":0,"d":"0.0"},1,0,""]
[31,{"$f":"'Wettkampf 1'!B40","v":"Will Achim"},{"$f":"'Wettkampf 1'!C40","v":"Spahnharrenstätte II"},312.7,null,312.7,0,0,0,0,0,0,0,0,0,0,312.7,1,{"$nulls":5},{"v":0,"d":"0.0"},0,0,""]
[32,{"$f":"'Wettkampf 1'!B41","v":"Meyer Dirk"},{"$f":"'Wettkampf 1'!C41","v":"Spahnharrenstätte II"},307.9,null,307.9,0,0,0,0,0,0,0,0,0,0,307.9,1,{"$nulls":5},{"v":0,"d":"0.0"},0,0,""]
[33,{"$f":"'Wettkampf 1'!B42","v":"Micksch Heiko"},{"$f":"'Wettkampf 1'!C42","v":"Spahnharrenstätte II"},310.8,null,310.8,0,0,0,0,0,0,0,0,0,0,310.8,1,{"$nulls":5},{"v":0,"d":"0.0"},0,0,""]
[34,{"$f":"'Wettkampf 1'!B43","v":"Hahnenkamp Ulrich"},{"$f":"'Wettkampf 1'!C43","v":"Spahnharrenstätte II"},291.1,"X","0",0,0,0,0,0,0,0,0,0,0,"0",0,{"$nulls":5},{"v":0,"d":"0.0"},0,0,""]
[35,{"$f":"'Wettkampf 1'!B44","v":"Hahnenkamp Markus"},{"$f":"'Wettkampf 1'!C44","v":"Spahnharrenstätte II"},{"v":300,"d":"300.0"},null,{"v":300,"d":"300.0"},0,0,0,0,0,0,0,0,0,0,300,1,{"$nulls":5},{"v":0,"d":"0.0"},0,0,""]
[36,{"$f":"'Wettkampf 1'!B45","v":"Walker Stefan"},{"$f":"'Wettkampf 1'!C45","v":"Börgerwald II"},302.1,"X","0",0,0,0,0,0,0,0,0,"0",0,0,0,{"$nulls":5},{"v":0,"d":"0.0"},0,0,""]
[{"$nulls":6},{"$f":"LARGE(G10:G45,1)+LARGE(G10:G45,2)+LARGE(G10:G45,3)","v":935},{"$f":"SUM(H10:H45)","v":4},{"$f":"LARGE(I10:I45,1)+LARGE(I10:I45,2)+LARGE(I10:I45,3)","v":935.5},{"$f":"SUM(J10:J45)","v":4},{"$f":"LARGE(K10:K45,1)+LARGE(K10:K45,2)+LARGE(K10:K45,3)","v":930.7},{"$f":"SUM(L10:L45)","v":4},{"$f":"LARGE(M10:M45,1)+LARGE(M10:M45,2)+LARGE(M10:M45,3)","v":941.9000000000001},{"$f":"SUM(N10:N45)","v":4},{"$f":"LARGE(O10:O45,1)+LARGE(O10:O45,2)+LARGE(O10:O45,3)","v":939.5999999999999},{"$f":"SUM(P10:P45)","v":4},{"$f":"LARGE(Q10:Q45,1)+LARGE(Q10:Q45,2)+LARGE(Q10:Q45,3)","v":931.4},{"$f":"SUM(R10:S45)","v":4}]
[null,null,"per Email an: sk-huemmling@gmx.de"]

{"sheet":"Ausdruck","index":13,"n_rows":48,"n_cols":29,"rows_kept":48,"merged":[[0,3,0,19],[0,24,0,25],[1,3,1,19],[1,24,1,25],[2,3,2,19],[3,3,3,19],[4,24,4,25],[5,24,5,25],[6,24,6,25],[8,22,8,25]]}
[null,"Verein / Gruppe","Ergebnisse",{"$f":"Übersicht!K1","v":"2024/2025"},{"$nulls":19},"Austragungsort:"]
[1,{"$f":"'Wettkampf 1'!B2","v":"Neuvrees I"},null,"Klasse:",{"$nulls":19},"Wettkampftag:"]
[2,{"$f":"'Wettkampf 1'!B3","v":"Rastdorf III"},null,{"$f":"Übersicht!M1","v":"2. Kreisklasse"}]
[3,{"$f":"'Wettkampf 1'!B4","v":"Börger II"},null,{"$f":"Übersicht!P1","v":"Schützen"},{"$nulls":21},"Ansprechpartner für Rückfragen:"]
[4,{"$f":"'Wettkampf 1'!B5","v":"Esterwegen III"},{"$nulls":21},"Name:"]
[5,{"$f":"'Wettkampf 1'!B6","v":"Börgerwald II"},{"$nulls":21},"Tel:"]
[6,{"$f":"'Wettkampf 1'!B7","v":"Spahnharrenstätte II"},{"$nulls":21},"Standaufsicht:"]
[]
[null,"Name Schütze","Verein/Gruppe","Ergebnis","AW? ",null,"Verein 1",null,"Verein 2",null,"Verein 3",null,"Verein 4",null,"Verein 5",null,"Verein 6",{"$nulls":3},"Geburts-datum",null,"Proberechnung bei Streifen:"]
[1,{"$f":"'Wettkampf 1'!B10","v":"Rolfes Wilhelm"},{"$f":"'Wettkampf 1'!C10","v":"Neuvrees I"},null,null,{"$f":"IF(E10=\"x\",\"0\",D10)","v":0},{"$f":"IF(C10=$B$2,F10,0)","v":0},{"$f":"(IF(AND($E10=\"\",$C10=$B$2),1,0))","v":1},{"$f":"IF($C10=$B$3,F10,0)","v":0},{"$f":"(IF(AND($E10=\"\",$C10=$B$3),1,0))","v":0},{"$f":"IF($C10=$B$4,F10,0)","v":0},{"$f":"(IF(AND($E10=\"\",$C10=$B$4),1,0))","v":0},{"$f":"IF($C10=$B$5,F10,0)","v":0},{"$f":"(IF(AND($E10=\"\",$C10=$B$5),1,0))","v":0},{"$f":"IF($C10=$B$6,F10,0)","v":0},{"$f":"(IF(AND($E10=\"\",$C10=$B$6),1,0))","v":0},{"$f":"IF($C10=$B$7,F10,0)","v":0},{"$f":"(IF(AND($E10=\"\",$C10=$B$7),1,0))","v":0},{"$nulls":8},{"$f":"IF(Z10=D10,1,0)","v":1},{"$f":"IF(Z10=0,0,1)","v":0},{"$f":"IF(AA10+AB10=2,\"Korrekt\",\"\")","v":""}]
[2,{"$f":"'Wettkampf 1'!B11","v":"Steenken Klaus"},{"$f":"'Wettkampf 1'!C11","v":"Neuvrees I"},null,null,{"$f":"IF(E11=\"x\",\"0\",D11)","v":0},{"$f":"IF(C11=$B$2,F11,0)","v":0},{"$f":"(IF(AND($E11=\"\",$C11=$B$2),1,0))","v":1},{"$f":"IF($C11=$B$3,F11,0)","v":0},{"$f":"(IF(AND($E11=\"\",$C11=$B$3),1,0))","v":0},{"$f":"IF($C11=$B$4,F11,0)","v":0},{"$f":"(IF(AND($E11=\"\",$C11=$B$4),1,0))","v":0},{"$f":"IF($C11=$B$5,F11,0)","v":0},{"$f":"(IF(AND($E11=\"\",$C11=$B$5),1,0))","v":0},{"$f":"IF($C11=$B$6,F11,0)","v":0},{"$f":"(IF(AND($E11=\"\",$C11=$B$6),1,0))","v":0},{"$f":"IF($C11=$B$7,F11,0)","v":0},{"$f":"(IF(AND($E11=\"\",$C11=$B$7),1,0))","v":0},{"$nulls":8},{"$f":"IF(Z11=D11,1,0)","v":1},{"$f":"IF(Z11=0,0,1)","v":0},{"$f":"IF(AA11+AB11=2,\"Korrekt\",\"\")","v":""}]
[3,{"$f":"'Wettkampf 1'!B12","v":"Breyer Wilfried"},{"$f":"'Wettkampf 1'!C12","v":"Neuvrees I"},null,null,0,0,1,0,0,0,0,0,0,0,0,0,0,{"$nulls":8},1,0,""]
[4,{"$f":"'Wettkampf 1'!B13","v":"Janßen Markus"},{"$f":"'Wettkampf 1'!C13","v":"Neuvrees I"},null,null,0,0,1,0,0,0,0,0,0,0,0,0,0,{"$nulls":8},1,0,""]
[5,{"$f":"'Wettkampf 1'!B14","v":"Thyen Werner"},{"$f":"'Wettkampf 1'!C14","v":"Neuvrees I"},null,null,0,0,1,0,0,0,0,0,0,0,0,0,0,{"$nulls":8},1,0,""]
[6,{"$f":"'Wettkampf 1'!B15","v":"Peters Carsten"},{"$f":"'Wettkampf 1'!C15","v":"Neuvrees I"},null,null,0,0,1,0,0,0,0,0,0,0,0,0,0,{"$nulls":8},1,0,""]
[7,{"$f":"'Wettkampf 1'!B16","v":"Wotte Robert"},{"$f":"'Wettkampf 1'!C16","v":"Rastdorf III"},null,null,0,0,0,0,1,0,0,0,0,0,0,0,0,{"$nulls":8},1,0,""]
[8,{"$f":"'Wettkampf 1'!B17","v":"Müller Helmut"},{"$f":"'Wettkampf 1'!C17","v":"Rastdorf III"},null,null,0,0,0,0,1,0,0,0,0,0,0,0,0,{"$nulls":8},1,0,""]
[9,{"$f":"'Wettkampf 1'!B18","v":"Bookjans Günther"},{"$f":"'Wettkampf 1'!C18","v":"Rastdorf III"},null,null,0,0,0,0,1,0,0,0,0,0,0,0,0,{"$nulls":8},1,0,""]
[10,{"$f":"'Wettkampf 1'!B19","v":"Meer Michael"},{"$f":"'Wettkampf 1'!C19","v":"Rastdorf III"},null,null,0,0,0,0,1,0,0,0,0,0,0,0,0,{"$nulls":8},1,0,""]
[11,{"$f":"'Wettkampf 1'!B20","v":"Lindemann Rita"},{"$f":"'Wettkampf 1'!C20","v":"Rastdorf III"},null,null,0,0,0,0,1,0,0,0,0,0,0,0,0,{"$nulls":8},1,0,""]
[12,{"$f":"'Wettkampf 1'!B21","v":"Olliges Kai"},{"$f":"'Wettkampf 1'!C21","v":"Börgerwald II"},null,null,0,0,0,0,0,0,0,0,0,0,1,0,0,{"$nulls":8},1,0,""]
[13,{"$f":"'Wettkampf 1'!B22","v":"Zdralik Ingo"},{"$f":"'Wettkampf 1'!C22","v":"Börger II"},null,null,0,0,0,0,0,0,1,0,0,0,0,0,0,{"$nulls":8},1,0,""]
[14,{"$f":"'Wettkampf 1'!B23","v":"Goldenstein Uwe"},{"$f":"'Wettkampf 1'!C23","v":"Börger II"},null,null,0,0,0,0,0,0,1,0,0,0,0,0,0,{"$nulls":8},1,0,""]
[15,{"$f":"'Wettkampf 1'!B24","v":"Eckmann Mark"},{"$f":"'Wettkampf 1'!C24","v":"Börger II"},null,null,0,0,0,0,0,0,1,0,0,0,0,0,0,{"$nulls":8},1,0,""]
[16,{"$f":"'Wettkampf 1'!B25","v":"Schulz Simon"},{"$f":"'Wettkampf 1'!C25","v":"Börger II"},null,null,0,0,0,0,0,0,1,0,0,0,0,0,0,{"$nulls":8},1,0,""]
[17,{"$f":"'Wettkampf 1'!B26","v":"Schwarte Hermann"},{"$f":"'Wettkampf 1'!C26","v":"Börger II"},null,null,0,0,0,0,0,0,1,0,0,0,0,0,0,{"$nulls":8},1,0,""]
[18,{"$f":"'Wettkampf 1'!B27","v":"Jungsthoefel Markus"},{"$f":"'Wettkampf 1'!C27","v":"Börger II"},null,null,0,0,0,0,0,0,1,0,0,0,0,0,0,{"$nulls":8},1,0,""]
[19,{"$f":"'Wettkampf 1'!B28","v":"Aldfeld Helmut"},{"$f":"'Wettkampf 1'!C28","v":"Esterwegen III"},null,null,0,0,0,0,0,0,0,0,1,0,0,0,0,{"$nulls":8},1,0,""]
[20,{"$f":"'Wettkampf 1'!B29","v":"Schulte Mathias"},{"$f":"'Wettkampf 1'!C29","v":"Esterwegen III"},null,null,0,0,0,0,0,0,0,0,1,0,0,0,0,{"$nulls":8},1,0,""]
[21,{"$f":"'Wettkampf 1'!B30","v":"Middendorf Peter"},{"$f":"'Wettkampf 1'!C30","v":"Esterwegen III"},null,null,0,0,0,0,0,0,0,0,1,0,0,0,0,{"$nulls":8},1,0,""]
[22,{"$f":"'Wettkampf 1'!B31","v":"Meibers Michael"},{"$f":"'Wettkampf 1'!C31","v":"Esterwegen III"},null,null,0,0,0,0,0,0,0,0,1,0,0,0,0,{"$nulls":8},1,0,""]
[23,{"$f":"'Wettkampf 1'!B32","v":"Heidemann Jürgen"},{"$f":"'Wettkampf 1'!C32","v":"Esterwegen III"},null,null,0,0,0,0,0,0,0,0,1,0,0,0,0,{"$nulls":8},1,0,""]
[24,{"$f":"'Wettkampf 1'!B33","v":"Lindemann Gerd"},{"$f":"'Wettkampf 1'!C33","v":"Esterwegen III"},null,null,0,0,0,0,0,0,0,0,1,0,0,0,0,{"$nulls":8},1,0,""]
[25,{"$f":"'Wettkampf 1'!B34","v":"Hanenkamp Andre"},{"$f":"'Wettkampf 1'!C34","v":"Börgerwald II"},null,null,0,0,0,0,0,0,0,0,0,0,1,0,0,{"$nulls":8},1,0,""]
[26,{"$f":"'Wettkampf 1'!B35","v":"Antons Mathias"},{"$f":"'Wettkampf 1'!C35","v":"Börgerwald II"},null,null,0,0,0,0,0,0,0,0,0,0,1,0,0,{"$nulls":8},1,0,""]
[27,{"$f":"'Wettkampf 1'!B36","v":"Schröer Friedhelm"},{"$f":"'Wettkampf 1'!C36","v":"Börgerwald II"},null,null,0,0,0,0,0,0,0,0,0,0,1,0,0,{"$nulls":8},1,0,""]
[28,{"$f":"'Wettkampf 1'!B37","v":"Sebers Tobias"},{"$f":"'Wettkampf 1'!C37","v":"Börgerwald II"},null,null,0,0,0,0,0,0,0,0,0,0,1,0,0,{"$nulls":8},1,0,""]
[29,{"$f":"'Wettkampf 1'!B38","v":"Hanneken Moritz"},{"$f":"'Wettkampf 1'!C38","v":"Börgerwald II"},null,null,0,0,0,0,0,0,0,0,0,0,1,0,0,{"$nulls":8},1,0,""]
[30,{"$f":"'Wettkampf 1'!B39","v":"Speeker Dietmar"},{"$f":"'Wettkampf 1'!C39","v":"Börgerwald II"},null,null,0,0,0,0,0,0,0,0,0,0,1,0,0,{"$nulls":8},1,0,""]
[31,{"$f":"'Wettkampf 1'!B40","v":"Will Achim"},{"$f":"'Wettkampf 1'!C40","v":"Spahnharrenstätte II"},null,null,0,0,0,0,0,0,0,0,0,0,0,0,1,{"$nulls":8},1,0,""]
[32,{"$f":"'Wettkampf 1'!B41","v":"Meyer Dirk"},{"$f":"'Wettkampf 1'!C41","v":"Spahnharrenstätte II"},null,null,0,0,0,0,0,0,0,0,0,0,0,0,1,{"$nulls":8},1,0,""]
[33,{"$f":"'Wettkampf 1'!B42","v":"Micksch Heiko"},{"$f":"'Wettkampf 1'!C42","v":"Spahnharrenstätte II"},null,null,0,0,0,0,0,0,0,0,0,0,0,0,1,{"$nulls":8},1,0,""]
[34,{"$f":"'Wettkampf 1'!B43","v":"Hahnenkamp Ulrich"},{"$f":"'Wettkampf 1'!C43","v":"Spahnharrenstätte II"},null,null,0,0,0,0,0,0,0,0,0,0,0,0,1,{"$nulls":8},1,0,""]
[35,{"$f":"'Wettkampf 1'!B44","v":"Hahnenkamp Markus"},{"$f":"'Wettkampf 1'!C44","v":"Spahnharrenstätte II"},null,null,0,0,0,0,0,0,0,0,0,0,0,0,1,{"$nulls":8},1,0,""]
[36,{"$f":"'Wettkampf 1'!B45","v":"Walker Stefan"},{"$f":"'Wettkampf 1'!C45","v":"Börgerwald II"},null,null,0,0,0,0,0,0,0,0,0,0,1,0,0,{"$nulls":8},1,0,""]
[{"$nulls":6},{"$f":"LARGE(G10:G45,1)+LARGE(G10:G45,2)+LARGE(G10:G45,3)","v":0},{"$f":"SUM(H10:H45)","v":6},{"$f":"LARGE(I10:I45,1)+LARGE(I10:I45,2)+LARGE(I10:I45,3)","v":0},{"$f":"SUM(J10:J45)","v":5},{"$f":"LARGE(K10:K45,1)+LARGE(K10:K45,2)+LARGE(K10:K45,3)","v":0},{"$f":"SUM(L10:L45)","v":6},{"$f":"LARGE(M10:M45,1)+LARGE(M10:M45,2)+LARGE(M10:M45,3)","v":0},{"$f":"SUM(N10:N45)","v":6},{"$f":"LARGE(O10:O45,1)+LARGE(O10:O45,2)+LARGE(O10:O45,3)","v":0},{"$f":"SUM(P10:P45)","v":8},{"$f":"LARGE(Q10:Q45,1)+LARGE(Q10:Q45,2)+LARGE(Q10:Q45,3)","v":0},{"$f":"SUM(R10:S45)","v":5}]
[]
[null,"Bitte beachtet, dass die Standaufsicht benannt werden muss"]

{"sheet":"Ausdruck blank","index":14,"n_rows":48,"n_cols":29,"rows_kept":48,"merged":[[0,3,0,19],[0,24,0,25],[1,3,1,19],[1,24,1,25],[2,3,2,19],[3,3,3,19],[4,24,4,25],[5,24,5,25],[6,24,6,25],[8,22,8,25]]}
[null,"Verein / Gruppe","Ergebnisse",{"$f":"Übersicht!K1","v":"2024/2025"},{"$nulls":19},"Austragungsort:"]
[1,null,null,"Klasse:",{"$nulls":19},"Wettkampftag:"]
[2]
[3,{"$nulls":24},"Ansprechpartner für Rückfragen:"]
[4,{"$nulls":22},"Name:"]
[5,{"$nulls":22},"Tel:"]
[6,{"$nulls":22},"Standaufsicht:"]
[]
[null,"Name Schütze","Verein/Gruppe","Ergebnis","AW? ",null,"Verein 1",null,"Verein 2",null,"Verein 3",null,"Verein 4",null,"Verein 5",null,"Verein 6",{"$nulls":3},"Geburts-datum",null,"Proberechnung bei Streifen:"]
[1,{"$nulls":4},{"$f":"IF(E10=\"x\",\"0\",D10)","v":0},{"$f":"IF(C10=$B$2,F10,0)","v":0},{"$f":"(IF(AND($E10=\"\",$C10=$B$2),1,0))","v":1},{"$f":"IF($C10=$B$3,F10,0)","v":0},{"$f":"(IF(AND($E10=\"\",$C10=$B$3),1,0))","v":1},{"$f":"IF($C10=$B$4,F10,0)","v":0},{"$f":"(IF(AND($E10=\"\",$C10=$B$4),1,0))","v":1},{"$f":"IF($C10=$B$5,F10,0)","v":0},{"$f":"(IF(AND($E10=\"\",$C10=$B$5),1,0))","v":1},{"$f":"IF($C10=$B$6,F10,0)","v":0},{"$f":"(IF(AND($E10=\"\",$C10=$B$6),1,0))","v":1},{"$f":"IF($C10=$B$7,F10,0)","v":0},{"$f":"(IF(AND($E10=\"\",$C10=$B$7),1,0))","v":1},{"$nulls":8},{"$f":"IF(Z10=D10,1,0)","v":1},{"$f":"IF(Z10=0,0,1)","v":0},{"$f":"IF(AA10+AB10=2,\"Korrekt\",\"\")","v":""}]
[2,{"$nulls":4},{"$f":"IF(E11=\"x\",\"0\",D11)","v":0},{"$f":"IF(C11=$B$2,F11,0)","v":0},{"$f":"(IF(AND($E11=\"\",$C11=$B$2),1,0))","v":1},{"$f":"IF($C11=$B$3,F11,0)","v":0},{"$f":"(IF(AND($E11=\"\",$C11=$B$3),1,0))","v":1},{"$f":"IF($C11=$B$4,F11,0)","v":0},{"$f":"(IF(AND($E11=\"\",$C11=$B$4),1,0))","v":1},{"$f":"IF($C11=$B$5,F11,0)","v":0},{"$f":"(IF(AND($E11=\"\",$C11=$B$5),1,0))","v":1},{"$f":"IF($C11=$B$6,F11,0)","v":0},{"$f":"(IF(AND($E11=\"\",$C11=$B$6),1,0))","v":1},{"$f":"IF($C11=$B$7,F11,0)","v":0},{"$f":"(IF(AND($E11=\"\",$C11=$B$7),1,0))","v":1},{"$nulls":8},{"$f":"IF(Z11=D11,1,0)","v":1},{"$f":"IF(Z11=0,0,1)","v":0},{"$f":"IF(AA11+AB11=2,\"Korrekt\",\"\")","v":""}]
[3,{"$nulls":4},0,0,1,0,1,0,1,0,1,0,1,0,1,{"$nulls":8},1,0,""]
[4,{"$nulls":4},0,0,1,0,1,0,1,0,1,0,1,0,1,{"$nulls":8},1,0,""]
[5,{"$nulls":4},0,0,1,0,1,0,1,0,1,0,1,0,1,{"$nulls":8},1,0,""]
[6,{"$nulls":4},0,0,1,0,1,0,1,0,1,0,1,0,1,{"$nulls":8},1,0,""]
[7,{"$nulls":4},0,0,1,0,1,0,1,0,1,0,1,0,1,{"$nulls":8},1,0,""]
[8,{"$nulls":4},0,0,1,0,1,0,1,0,1,0,1,0,1,{"$nulls":8},1,0,""]
[9,{"$nulls":4},0,0,1,0,1,0,1,0,1,0,1,0,1,{"$nulls":8},1,0,""]
[10,{"$nulls":4},0,0,1,0,1,0,1,0,1,0,1,0,1,{"$nulls":8},1,0,""]
[11,{"$nulls":4},0,0,1,0,1,0,1,0,1,0,1,0,1,{"$nulls":8},1,0,""]
[12,{"$nulls":4},0,0,1,0,1,0,1,0,1,0,1,0,1,{"$nulls":8},1,0,""]
[13,{"$nulls":4},0,0,1,0,1,0,1,0,1,0,1,0,1,{"$nulls":8},1,0,""]
[14,{"$nulls":4},0,0,1,0,1,0,1,0,1,0,1,0,1,{"$nulls":8},1,0,""]
[15,{"$nulls":4},0,0,1,0,1,0,1,0,1,0,1,0,1,{"$nulls":8},1,0,""]
[16,{"$nulls":4},0,0,1,0,1,0,1,0,1,0,1,0,1,{"$nulls":8},1,0,""]
[17,{"$nulls":4},0,0,1,0,1,0,1,0,1,0,1,0,1,{"$nulls":8},1,0,""]
[18,{"$nulls":4},0,0,1,0,1,0,1,0,1,0,1,0,1,{"$nulls":8},1,0,""]
[19,{"$nulls":4},0,0,1,0,1,0,1,0,1,0,1,0,1,{"$nulls":8},1,0,""]
[20,{"$nulls":4},0,0,1,0,1,0,1,0,1,0,1,0,1,{"$nulls":8},1,0,""]
[21,{"$nulls":4},0,0,1,0,1,0,1,0,1,0,1,0,1,{"$nulls":8},1,0,""]
[22,{"$nulls":4},0,0,1,0,1,0,1,0,1,0,1,0,1,{"$nulls":8},1,0,""]
[23,{"$nulls":4},0,0,1,0,1,0,1,0,1,0,1,0,1,{"$nulls":8},1,0,""]
[24,{"$nulls":4},0,0,1,0,1,0,1,0,1,0,1,0,1,{"$nulls":8},1,0,""]
[25,{"$nulls":4},0,0,1,0,1,0,1,0,1,0,1,0,1,{"$nulls":8},1,0,""]
[26,{"$nulls":4},0,0,1,0,1,0,1,0,1,0,1,0,1,{"$nulls":8},1,0,""]
[27,{"$nulls":4},0,0,1,0,1,0,1,0,1,0,1,0,1,{"$nulls":8},1,0,""]
[28,{"$nulls":4},0,0,1,0,1,0,1,0,1,0,1,0,1,{"$nulls":8},1,0,""]
[29,{"$nulls":4},0,0,1,0,1,0,1,0,1,0,1,0,1,{"$nulls":8},1,0,""]
[30,{"$nulls":4},0,0,1,0,1,0,1,0,1,0,1,0,1,{"$nulls":8},1,0,""]
[31,{"$nulls":4},0,0,1,0,1,0,1,0,1,0,1,0,1,{"$nulls":8},1,0,""]
[32,{"$nulls":4},0,0,1,0,1,0,1,0,1,0,1,0,1,{"$nulls":8},1,0,""]
[33,{"$nulls":4},0,0,1,0,1,0,1,0,1,0,1,0,1,{"$nulls":8},1,0,""]
[34,{"$nulls":4},0,0,1,0,1,0,1,0,1,0,1,0,1,{"$nulls":8},1,0,""]
[35,{"$nulls":4},0,0,1,0,1,0,1,0,1,0,1,0,1,{"$nulls":8},1,0,""]
[36,{"$nulls":4},0,0,1,0,1,0,1,0,1,0,1,0,1,{"$nulls":8},1,0,""]
[{"$nulls":6},{"$f":"LARGE(G10:G45,1)+LARGE(G10:G45,2)+LARGE(G10:G45,3)","v":0},{"$f":"SUM(H10:H45)","v":36},{"$f":"LARGE(I10:I45,1)+LARGE(I10:I45,2)+LARGE(I10:I45,3)","v":0},{"$f":"SUM(J10:J45)","v":36},{"$f":"LARGE(K10:K45,1)+LARGE(K10:K45,2)+LARGE(K10:K45,3)","v":0},{"$f":"SUM(L10:L45)","v":36},{"$f":"LARGE(M10:M45,1)+LARGE(M10:M45,2)+LARGE(M10:M45,3)","v":0},{"$f":"SUM(N10:N45)","v":36},{"$f":"LARGE(O10:O45,1)+LARGE(O10:O45,2)+LARGE(O10:O45,3)","v":0},{"$f":"SUM(P10:P45)","v":36},{"$f":"LARGE(Q10:Q45,1)+LARGE(Q10:Q45,2)+LARGE(Q10:Q45,3)","v":0},{"$f":"SUM(R10:S45)","v":36}]
[]
[null,"Bitte beachtet, dass die Standaufsicht benannt werden muss"]

{"sheet":"Übersicht Schützen","index":15,"n_rows":37,"n_cols":23,"rows_kept":37,"hidden":true}
[null,null,{"v":1,"d":"1.0"},{"v":2,"d":"2.0"},{"v":3,"d":"3.0"},{"v":4,"d":"4.0"},{"v":5,"d":"5.0"},{"v":6,"d":"6.0"},{"$nulls":3},{"v":7,"d":"7.0"},{"v":8,"d":"8.0"},{"v":9,"d":"9.0"},{"v":10,"d":"10.0"},{"v":11,"d":"11.0"},{"v":12,"d":"12.0"}]
["Meibers Michael",{"$f":"VLOOKUP(A2,'Wettkampf 1'!$B$10:$C$45,2,FALSE)","v":"Esterwegen III"},{"$f":"VLOOKUP(A2,'Wettkampf 1'!$B$10:$D$45,3,FALSE)","v":310.3},{"$f":"VLOOKUP($A2,'2'!$B$10:$D$45,3,FALSE)","v":{"v":315,"d":"315.0"}},{"$f":"VLOOKUP($A2,'3'!$B$10:$D$45,3,FALSE)","v":315.8},{"$f":"VLOOKUP($A2,'4'!$B$10:$D$45,3,FALSE)","v":312.1},{"$f":"VLOOKUP($A2,'5'!$B$10:$D$45,3,FALSE)","v":316.4},{"$f":"VLOOKUP($A2,'6'!$B$10:$D$45,3,FALSE)","v":313.3},{"$f":"IF(J2 > 0,K2/J2,0)","v":{"v":313.81666666666666,"d":"313.8"}},{"$f":"VLOOKUP(A2,Formelhilfe!$A$9:$H$44,8,FALSE)","v":{"v":6,"d":"6.0"}},{"$f":"SUM(C2:H2)","v":{"v":1882.8999999999999,"d":"1,882.9"}},{"$f":"VLOOKUP($A2,'7'!$B$10:$D$45,3,FALSE)","v":317.9},{"$f":"VLOOKUP($A2,'8'!$B$10:$D$45,3,FALSE)","v":314.6},{"$f":"VLOOKUP($A2,'9'!$B$10:$D$45,3,FALSE)","v":317.6},{"$f":"VLOOKUP($A2,'10'!$B$10:$D$45,3,FALSE)","v":315.6},{"$f":"VLOOKUP($A2,'11'!$B$10:$D$45,3,FALSE)","v":{"v":315,"d":"315.0"}},{"$f":"VLOOKUP($A2,'12'!$B$10:$D$45,3,FALSE)","v":315.8},{"$f":"IF(S2 >0,T2/S2,0)","v":{"v":316.0833333333333,"d":"316.1"}},{"$f":"VLOOKUP(A2,Formelhilfe!$A$9:$O$44,15,FALSE)","v":{"v":6,"d":"6.0"}},{"$f":"SUM(L2:Q2)","v":{"v":1896.5,"d":"1,896.5"}},{"$f":"IF(V2>0,W2/V2,0)","v":{"v":314.95,"d":"315.0"}},{"$f":"VLOOKUP(A2,Formelhilfe!$A$9:$P$44,16,FALSE)","v":{"v":12,"d":"12.0"}},{"$f":"SUM(C2:H2,L2:Q2)","v":{"v":3779.3999999999996,"d":"3,779.4"}}]
["Zdralik Ingo",{"$f":"VLOOKUP(A3,'Wettkampf 1'!$B$10:$C$45,2,FALSE)","v":"Börger II"},{"$f":"VLOOKUP(A3,'Wettkampf 1'!$B$10:$D$45,3,FALSE)","v":315.8},{"$f":"VLOOKUP($A3,'2'!$B$10:$D$45,3,FALSE)","v":311.1},{"$f":"VLOOKUP($A3,'3'!$B$10:$D$45,3,FALSE)","v":310.9},{"$f":"VLOOKUP($A3,'4'!$B$10:$D$45,3,FALSE)","v":313.7},{"$f":"VLOOKUP($A3,'5'!$B$10:$D$45,3,FALSE)","v":318.8},{"$f":"VLOOKUP($A3,'6'!$B$10:$D$45,3,FALSE)","v":305.4},{"$f":"IF(J3 > 0,K3/J3,0)","v":{"v":312.6166666666666,"d":"312.6"}},{"$f":"VLOOKUP(A3,Formelhilfe!$A$9:$H$44,8,FALSE)","v":{"v":6,"d":"6.0"}},{"$f":"SUM(C3:H3)","v":{"v":1875.6999999999998,"d":"1,875.7"}},{"$f":"VLOOKUP($A3,'7'!$B$10:$D$45,3,FALSE)","v":{"v":314,"d":"314.0"}},{"$f":"VLOOKUP($A3,'8'!$B$10:$D$45,3,FALSE)","v":315.4},{"$f":"VLOOKUP($A3,'9'!$B$10:$D$45,3,FALSE)","v":312.8},{"$f":"VLOOKUP($A3,'10'!$B$10:$D$45,3,FALSE)","v":314.5},{"$f":"VLOOKUP($A3,'11'!$B$10:$D$45,3,FALSE)","v":315.7},{"$f":"VLOOKUP($A3,'12'!$B$10:$D$45,3,FALSE)","v":315.8},{"$f":"IF(S3 >0,T3/S3,0)","v":314.7},{"$f":"VLOOKUP(A3,Formelhilfe!$A$9:$O$44,15,FALSE)","v":{"v":6,"d":"6.0"}},{"$f":"SUM(L3:Q3)","v":{"v":1888.2,"d":"1,888.2"}},{"$f":"IF(V3>0,W3/V3,0)","v":{"v":313.65833333333336,"d":"313.7"}},{"$f":"VLOOKUP(A3,Formelhilfe!$A$9:$P$44,16,FALSE)","v":{"v":12,"d":"12.0"}},{"$f":"SUM(C3:H3,L3:Q3)","v":{"v":3763.9,"d":"3,763.9"}}]
["Bookjans Günther",{"$f":"VLOOKUP(A4,'Wettkampf 1'!$B$10:$C$45,2,FALSE)","v":"Rastdorf III"},{"$f":"VLOOKUP(A4,'Wettkampf 1'!$B$10:$D$45,3,FALSE)","v":311.7},{"$f":"VLOOKUP($A4,'2'!$B$10:$D$45,3,FALSE)","v":315.8},{"$f":"VLOOKUP($A4,'3'!$B$10:$D$45,3,FALSE)","v":311.5},{"$f":"VLOOKUP($A4,'4'!$B$10:$D$45,3,FALSE)","v":{"v":308,"d":"308.0"}},{"$f":"VLOOKUP($A4,'5'!$B$10:$D$45,3,FALSE)","v":316.7},{"$f":"VLOOKUP($A4,'6'!$B$10:$D$45,3,FALSE)","v":314.1},{"$f":"IF(J4 > 0,K4/J4,0)","v":{"v":312.9666666666667,"d":"313.0"}},{"$f":"VLOOKUP(A4,Formelhilfe!$A$9:$H$44,8,FALSE)","v":{"v":6,"d":"6.0"}},{"$f":"SUM(C4:H4)","v":{"v":1877.8000000000002,"d":"1,877.8"}},{"$f":"VLOOKUP($A4,'7'!$B$10:$D$45,3,FALSE)","v":314.2},{"$f":"VLOOKUP($A4,'8'!$B$10:$D$45,3,FALSE)","v":313.4},{"$f":"VLOOKUP($A4,'9'!$B$10:$D$45,3,FALSE)","v":309.2},{"$f":"VLOOKUP($A4,'10'!$B$10:$D$45,3,FALSE)","v":311.7},{"$f":"VLOOKUP($A4,'11'!$B$10:$D$45,3,FALSE)","v":318.4},{"$f":"VLOOKUP($A4,'12'!$B$10:$D$45,3,FALSE)","v":309.5},{"$f":"IF(S4 >0,T4/S4,0)","v":{"v":312.73333333333335,"d":"312.7"}},{"$f":"VLOOKUP(A4,Formelhilfe!$A$9:$O$44,15,FALSE)","v":{"v":6,"d":"6.0"}},{"$f":"SUM(L4:Q4)","v":{"v":1876.4,"d":"1,876.4"}},{"$f":"IF(V4>0,W4/V4,0)","v":{"v":312.84999999999997,"d":"312.9"}},{"$f":"VLOOKUP(A4,Formelhilfe!$A$9:$P$44,16,FALSE)","v":{"v":12,"d":"12.0"}},{"$f":"SUM(C4:H4,L4:Q4)","v":{"v":3754.2,"d":"3,754.2"}}]
["Wotte Robert",{"$f":"VLOOKUP(A5,'Wettkampf 1'!$B$10:$C$45,2,FALSE)","v":"Rastdorf III"},{"$f":"VLOOKUP(A5,'Wettkampf 1'!$B$10:$D$45,3,FALSE)","v":{"v":317.59999999999997,"d":"317.6"}},{"$f":"VLOOKUP($A5,'2'!$B$10:$D$45,3,FALSE)","v":309.4},{"$f":"VLOOKUP($A5,'3'!$B$10:$D$45,3,FALSE)","v":313.7},{"$f":"VLOOKUP($A5,'4'!$B$10:$D$45,3,FALSE)","v":308.4},{"$f":"VLOOKUP($A5,'5'!$B$10:$D$45,3,FALSE)","v":315.3},{"$f":"VLOOKUP($A5,'6'!$B$10:$D$45,3,FALSE)","v":313.1},{"$f":"IF(J5 > 0,K5/J5,0)","v":{"v":312.9166666666667,"d":"312.9"}},{"$f":"VLOOKUP(A5,Formelhilfe!$A$9:$H$44,8,FALSE)","v":{"v":6,"d":"6.0"}},{"$f":"SUM(C5:H5)","v":{"v":1877.5,"d":"1,877.5"}},{"$f":"VLOOKUP($A5,'7'!$B$10:$D$45,3,FALSE)","v":311.7},{"$f":"VLOOKUP($A5,'8'!$B$10:$D$45,3,FALSE)","v":310.9},{"$f":"VLOOKUP($A5,'9'!$B$10:$D$45,3,FALSE)","v":314.4},{"$f":"VLOOKUP($A5,'10'!$B$10:$D$45,3,FALSE)","v":308.4},{"$f":"VLOOKUP($A5,'11'!$B$10:$D$45,3,FALSE)","v":{"v":315,"d":"315.0"}},{"$f":"VLOOKUP($A5,'12'!$B$10:$D$45,3,FALSE)","v":312.3},{"$f":"IF(S5 >0,T5/S5,0)","v":{"v":312.1166666666666,"d":"312.1"}},{"$f":"VLOOKUP(A5,Formelhilfe!$A$9:$O$44,15,FALSE)","v":{"v":6,"d":"6.0"}},{"$f":"SUM(L5:Q5)","v":{"v":1872.6999999999998,"d":"1,872.7"}},{"$f":"IF(V5>0,W5/V5,0)","v":{"v":312.5166666666667,"d":"312.5"}},{"$f":"VLOOKUP(A5,Formelhilfe!$A$9:$P$44,16,FALSE)","v":{"v":12,"d":"12.0"}},{"$f":"SUM(C5:H5,L5:Q5)","v":{"v":3750.2000000000003,"d":"3,750.2"}}]
["Janßen Markus",{"$f":"VLOOKUP(A6,'Wettkampf 1'!$B$10:$C$45,2,FALSE)","v":"Neuvrees I"},{"$f":"VLOOKUP(A6,'Wettkampf 1'!$B$10:$D$45,3,FALSE)","v":{"v":314,"d":"314.0"}},{"$f":"VLOOKUP($A6,'2'!$B$10:$D$45,3,FALSE)","v":311.8},{"$f":"VLOOKUP($A6,'3'!$B$10:$D$45,3,FALSE)","v":310.5},{"$f":"VLOOKUP($A6,'4'!$B$10:$D$45,3,FALSE)","v":313.2},{"$f":"VLOOKUP($A6,'5'!$B$10:$D$45,3,FALSE)","v":315.6},{"$f":"VLOOKUP($A6,'6'!$B$10:$D$45,3,FALSE)","v":309.6},{"$f":"IF(J6 > 0,K6/J6,0)","v":{"v":312.45,"d":"312.5"}},{"$f":"VLOOKUP(A6,Formelhilfe!$A$9:$H$44,8,FALSE)","v":{"v":6,"d":"6.0"}},{"$f":"SUM(C6:H6)","v":{"v":1874.6999999999998,"d":"1,874.7"}},{"$f":"VLOOKUP($A6,'7'!$B$10:$D$45,3,FALSE)","v":312.3},{"$f":"VLOOKUP($A6,'8'!$B$10:$D$45,3,FALSE)","v":310.8},{"$f":"VLOOKUP($A6,'9'!$B$10:$D$45,3,FALSE)","v":312.1},{"$f":"VLOOKUP($A6,'10'!$B$10:$D$45,3,FALSE)","v":305.4},{"$f":"VLOOKUP($A6,'11'!$B$10:$D$45,3,FALSE)","v":314.2},{"$f":"VLOOKUP($A6,'12'!$B$10:$D$45,3,FALSE)","v":313.9},{"$f":"IF(S6 >0,T6/S6,0)","v":{"v":311.45,"d":"311.5"}},{"$f":"VLOOKUP(A6,Formelhilfe!$A$9:$O$44,15,FALSE)","v":{"v":6,"d":"6.0"}},{"$f":"SUM(L6:Q6)","v":{"v":1868.6999999999998,"d":"1,868.7"}},{"$f":"IF(V6>0,W6/V6,0)","v":{"v":311.95,"d":"312.0"}},{"$f":"VLOOKUP(A6,Formelhilfe!$A$9:$P$44,16,FALSE)","v":{"v":12,"d":"12.0"}},{"$f":"SUM(C6:H6,L6:Q6)","v":{"v":3743.4,"d":"3,743.4"}}]
["Middendorf Peter",{"$f":"VLOOKUP(A7,'Wettkampf 1'!$B$10:$C$45,2,FALSE)","v":"Esterwegen III"},{"$f":"VLOOKUP(A7,'Wettkampf 1'!$B$10:$D$45,3,FALSE)","v":312.2},{"$f":"VLOOKUP($A7,'2'!$B$10:$D$45,3,FALSE)","v":311.3},{"$f":"VLOOKUP($A7,'3'!$B$10:$D$45,3,FALSE)","v":303.2},{"$f":"VLOOKUP($A7,'4'!$B$10:$D$45,3,FALSE)","v":313.8},{"$f":"VLOOKUP($A7,'5'!$B$10:$D$45,3,FALSE)","v":313.4},{"$f":"VLOOKUP($A7,'6'!$B$10:$D$45,3,FALSE)","v":314.3},{"$f":"IF(J7 > 0,K7/J7,0)","v":{"v":311.3666666666667,"d":"311.4"}},{"$f":"VLOOKUP(A7,Formelhilfe!$A$9:$H$44,8,FALSE)","v":{"v":6,"d":"6.0"}},{"$f":"SUM(C7:H7)","v":{"v":1868.2,"d":"1,868.2"}},{"$f":"VLOOKUP($A7,'7'!$B$10:$D$45,3,FALSE)","v":{"v":313,"d":"313.0"}},{"$f":"VLOOKUP($A7,'8'!$B$10:$D$45,3,FALSE)","v":310.9},{"$f":"VLOOKUP($A7,'9'!$B$10:$D$45,3,FALSE)","v":306.6},{"$f":"VLOOKUP($A7,'10'!$B$10:$D$45,3,FALSE)","v":315.5},{"$f":"VLOOKUP($A7,'11'!$B$10:$D$45,3,FALSE)","v":311.9},{"$f":"VLOOKUP($A7,'12'!$B$10:$D$45,3,FALSE)","v":316.1},{"$f":"IF(S7 >0,T7/S7,0)","v":{"v":312.3333333333333,"d":"312.3"}},{"$f":"VLOOKUP(A7,Formelhilfe!$A$9:$O$44,15,FALSE)","v":{"v":6,"d":"6.0"}},{"$f":"SUM(L7:Q7)","v":{"v":1874,"d":"1,874.0"}},{"$f":"IF(V7>0,W7/V7,0)","v":{"v":311.84999999999997,"d":"311.9"}},{"$f":"VLOOKUP(A7,Formelhilfe!$A$9:$P$44,16,FALSE)","v":{"v":12,"d":"12.0"}},{"$f":"SUM(C7:H7,L7:Q7)","v":{"v":3742.2,"d":"3,742.2"}}]
["Breyer Wilfried",{"$f":"VLOOKUP(A8,'Wettkampf 1'!$B$10:$C$45,2,FALSE)","v":"Neuvrees I"},{"$f":"VLOOKUP(A8,'Wettkampf 1'!$B$10:$D$45,3,FALSE)","v":{"v":312,"d":"312.0"}},{"$f":"VLOOKUP($A8,'2'!$B$10:$D$45,3,FALSE)","v":312.4},{"$f":"VLOOKUP($A8,'3'!$B$10:$D$45,3,FALSE)","v":308.5},{"$f":"VLOOKUP($A8,'4'!$B$10:$D$45,3,FALSE)","v":311.3},{"$f":"VLOOKUP($A8,'5'!$B$10:$D$45,3,FALSE)","v":312.1},{"$f":"VLOOKUP($A8,'6'!$B$10:$D$45,3,FALSE)","v":312.9},{"$f":"IF(J8 > 0,K8/J8,0)","v":{"v":311.53333333333336,"d":"311.5"}},{"$f":"VLOOKUP(A8,Formelhilfe!$A$9:$H$44,8,FALSE)","v":{"v":6,"d":"6.0"}},{"$f":"SUM(C8:H8)","v":{"v":1869.2000000000003,"d":"1,869.2"}},{"$f":"VLOOKUP($A8,'7'!$B$10:$D$45,3,FALSE)","v":310.1},{"$f":"VLOOKUP($A8,'8'!$B$10:$D$45,3,FALSE)","v":308.4},{"$f":"VLOOKUP($A8,'9'!$B$10:$D$45,3,FALSE)","v":{"v":313,"d":"313.0"}},{"$f":"VLOOKUP($A8,'10'!$B$10:$D$45,3,FALSE)","v":{"v":310,"d":"310.0"}},{"$f":"VLOOKUP($A8,'11'!$B$10:$D$45,3,FALSE)","v":310.6},{"$f":"VLOOKUP($A8,'12'!$B$10:$D$45,3,FALSE)","v":311.5},{"$f":"IF(S8 >0,T8/S8,0)","v":{"v":310.59999999999997,"d":"310.6"}},{"$f":"VLOOKUP(A8,Formelhilfe!$A$9:$O$44,15,FALSE)","v":{"v":6,"d":"6.0"}},{"$f":"SUM(L8:Q8)","v":{"v":1863.6,"d":"1,863.6"}},{"$f":"IF(V8>0,W8/V8,0)","v":{"v":311.06666666666666,"d":"311.1"}},{"$f":"VLOOKUP(A8,Formelhilfe!$A$9:$P$44,16,FALSE)","v":{"v":12,"d":"12.0"}},{"$f":"SUM(C8:H8,L8:Q8)","v":{"v":3732.8,"d":"3,732.8"}}]
["Micksch Heiko",{"$f":"VLOOKUP(A9,'Wettkampf 1'!$B$10:$C$45,2,FALSE)","v":"Spahnharrenstätte II"},{"$f":"VLOOKUP(A9,'Wettkampf 1'!$B$10:$D$45,3,FALSE)","v":310.6},{"$f":"VLOOKUP($A9,'2'!$B$10:$D$45,3,FALSE)","v":308.4},{"$f":"VLOOKUP($A9,'3'!$B$10:$D$45,3,FALSE)","v":308.7},{"$f":"VLOOKUP($A9,'4'!$B$10:$D$45,3,FALSE)","v":312.8},{"$f":"VLOOKUP($A9,'5'!$B$10:$D$45,3,FALSE)","v":314.8},{"$f":"VLOOKUP($A9,'6'!$B$10:$D$45,3,FALSE)","v":312.6},{"$f":"IF(J9 > 0,K9/J9,0)","v":{"v":311.31666666666666,"d":"311.3"}},{"$f":"VLOOKUP(A9,Formelhilfe!$A$9:$H$44,8,FALSE)","v":{"v":6,"d":"6.0"}},{"$f":"SUM(C9:H9)","v":{"v":1867.9,"d":"1,867.9"}},{"$f":"VLOOKUP($A9,'7'!$B$10:$D$45,3,FALSE)","v":{"v":312,"d":"312.0"}},{"$f":"VLOOKUP($A9,'8'!$B$10:$D$45,3,FALSE)","v":{"v":311,"d":"311.0"}},{"$f":"VLOOKUP($A9,'9'!$B$10:$D$45,3,FALSE)","v":307.3},{"$f":"VLOOKUP($A9,'10'!$B$10:$D$45,3,FALSE)","v":309.1},{"$f":"VLOOKUP($A9,'11'!$B$10:$D$45,3,FALSE)","v":314.2},{"$f":"VLOOKUP($A9,'12'!$B$10:$D$45,3,FALSE)","v":310.8},{"$f":"IF(S9 >0,T9/S9,0)","v":{"v":310.73333333333335,"d":"310.7"}},{"$f":"VLOOKUP(A9,Formelhilfe!$A$9:$O$44,15,FALSE)","v":{"v":6,"d":"6.0"}},{"$f":"SUM(L9:Q9)","v":{"v":1864.4,"d":"1,864.4"}},{"$f":"IF(V9>0,W9/V9,0)","v":{"v":311.02500000000003,"d":"311.0"}},{"$f":"VLOOKUP(A9,Formelhilfe!$A$9:$P$44,16,FALSE)","v":{"v":12,"d":"12.0"}},{"$f":"SUM(C9:H9,L9:Q9)","v":{"v":3732.3,"d":"3,732.3"}}]
["Hanenkamp Andre",{"$f":"VLOOKUP(A10,'Wettkampf 1'!$B$10:$C$45,2,FALSE)","v":"Börgerwald II"},{"$f":"VLOOKUP(A10,'Wettkampf 1'!$B$10:$D$45,3,FALSE)","v":313.3},{"$f":"VLOOKUP($A10,'2'!$B$10:$D$45,3,FALSE)","v":304.4},{"$f":"VLOOKUP($A10,'3'!$B$10:$D$45,3,FALSE)","v":311.3},{"$f":"VLOOKUP($A10,'4'!$B$10:$D$45,3,FALSE)","v":{"v":313,"d":"313.0"}},{"$f":"VLOOKUP($A10,'5'!$B$10:$D$45,3,FALSE)","v":310.9},{"$f":"VLOOKUP($A10,'6'!$B$10:$D$45,3,FALSE)","v":313.1},{"$f":"IF(J10 > 0,K10/J10,0)","v":{"v":311,"d":"311.0"}},{"$f":"VLOOKUP(A10,Formelhilfe!$A$9:$H$44,8,FALSE)","v":{"v":6,"d":"6.0"}},{"$f":"SUM(C10:H10)","v":{"v":1866,"d":"1,866.0"}},{"$f":"VLOOKUP($A10,'7'!$B$10:$D$45,3,FALSE)","v":309.3},{"$f":"VLOOKUP($A10,'8'!$B$10:$D$45,3,FALSE)","v":310.2},{"$f":"VLOOKUP($A10,'9'!$B$10:$D$45,3,FALSE)","v":311.9},{"$f":"VLOOKUP($A10,'10'!$B$10:$D$45,3,FALSE)","v":312.2},{"$f":"VLOOKUP($A10,'11'!$B$10:$D$45,3,FALSE)","v":312.6},{"$f":"VLOOKUP($A10,'12'!$B$10:$D$45,3,FALSE)","v":308.9},{"$f":"IF(S10 >0,T10/S10,0)","v":{"v":310.84999999999997,"d":"310.9"}},{"$f":"VLOOKUP(A10,Formelhilfe!$A$9:$O$44,15,FALSE)","v":{"v":6,"d":"6.0"}},{"$f":"SUM(L10:Q10)","v":{"v":1865.1,"d":"1,865.1"}},{"$f":"IF(V10>0,W10/V10,0)","v":{"v":310.925,"d":"310.9"}},{"$f":"VLOOKUP(A10,Formelhilfe!$A$9:$P$44,16,FALSE)","v":{"v":12,"d":"12.0"}},{"$f":"SUM(C10:H10,L10:Q10)","v":{"v":3731.1,"d":"3,731.1"}}]
["Meer Michael",{"$f":"VLOOKUP(A11,'Wettkampf 1'!$B$10:$C$45,2,FALSE)","v":"Rastdorf III"},{"$f":"VLOOKUP(A11,'Wettkampf 1'!$B$10:$D$45,3,FALSE)","v":312.6},{"$f":"VLOOKUP($A11,'2'!$B$10:$D$45,3,FALSE)","v":313.5},{"$f":"VLOOKUP($A11,'3'!$B$10:$D$45,3,FALSE)","v":310.4},{"$f":"VLOOKUP($A11,'4'!$B$10:$D$45,3,FALSE)","v":313.4},{"$f":"VLOOKUP($A11,'5'!$B$10:$D$45,3,FALSE)","v":314.3},{"$f":"VLOOKUP($A11,'6'!$B$10:$D$45,3,FALSE)","v":311.8},{"$f":"IF(J11 > 0,K11/J11,0)","v":{"v":312.6666666666667,"d":"312.7"}},{"$f":"VLOOKUP(A11,Formelhilfe!$A$9:$H$44,8,FALSE)","v":{"v":6,"d":"6.0"}},{"$f":"SUM(C11:H11)","v":{"v":1876,"d":"1,876.0"}},{"$f":"VLOOKUP($A11,'7'!$B$10:$D$45,3,FALSE)","v":310.5},{"$f":"VLOOKUP($A11,'8'!$B$10:$D$45,3,FALSE)","v":304.9},{"$f":"VLOOKUP($A11,'9'!$B$10:$D$45,3,FALSE)","v":305.6},{"$f":"VLOOKUP($A11,'10'!$B$10:$D$45,3,FALSE)","v":303.2},{"$f":"VLOOKUP($A11,'11'!$B$10:$D$45,3,FALSE)","v":312.5},{"$f":"VLOOKUP($A11,'12'!$B$10:$D$45,3,FALSE)","v":313.7},{"$f":"IF(S11 >0,T11/S11,0)","v":{"v":308.40000000000003,"d":"308.4"}},{"$f":"VLOOKUP(A11,Formelhilfe!$A$9:$O$44,15,FALSE)","v":{"v":6,"d":"6.0"}},{"$f":"SUM(L11:Q11)","v":{"v":1850.4,"d":"1,850.4"}},{"$f":"IF(V11>0,W11/V11,0)","v":{"v":310.5333333333333,"d":"310.5"}},{"$f":"VLOOKUP(A11,Formelhilfe!$A$9:$P$44,16,FALSE)","v":{"v":12,"d":"12.0"}},{"$f":"SUM(C11:H11,L11:Q11)","v":{"v":3726.3999999999996,"d":"3,726.4"}}]
["Schröer Friedhelm",{"$f":"VLOOKUP(A12,'Wettkampf 1'!$B$10:$C$45,2,FALSE)","v":"Börgerwald II"},{"$f":"VLOOKUP(A12,'Wettkampf 1'!$B$10:$D$45,3,FALSE)","v":306.3},{"$f":"VLOOKUP($A12,'2'!$B$10:$D$45,3,FALSE)","v":309.3},{"$f":"VLOOKUP($A12,'3'!$B$10:$D$45,3,FALSE)","v":307.8},{"$f":"VLOOKUP($A12,'4'!$B$10:$D$45,3,FALSE)","v":310.5},{"$f":"VLOOKUP($A12,'5'!$B$10:$D$45,3,FALSE)","v":311.3},{"$f":"VLOOKUP($A12,'6'!$B$10:$D$45,3,FALSE)","v":311.1},{"$f":"IF(J12 > 0,K12/J12,0)","v":{"v":309.3833333333334,"d":"309.4"}},{"$f":"VLOOKUP(A12,Formelhilfe!$A$9:$H$44,8,FALSE)","v":{"v":6,"d":"6.0"}},{"$f":"SUM(C12:H12)","v":{"v":1856.3000000000002,"d":"1,856.3"}},{"$f":"VLOOKUP($A12,'7'!$B$10:$D$45,3,FALSE)","v":306.4},{"$f":"VLOOKUP($A12,'8'!$B$10:$D$45,3,FALSE)","v":310.5},{"$f":"VLOOKUP($A12,'9'!$B$10:$D$45,3,FALSE)","v":{"v":312,"d":"312.0"}},{"$f":"VLOOKUP($A12,'10'!$B$10:$D$45,3,FALSE)","v":311.3},{"$f":"VLOOKUP($A12,'11'!$B$10:$D$45,3,FALSE)","v":{"v":312,"d":"312.0"}},{"$f":"VLOOKUP($A12,'12'!$B$10:$D$45,3,FALSE)","v":315.7},{"$f":"IF(S12 >0,T12/S12,0)","v":{"v":311.31666666666666,"d":"311.3"}},{"$f":"VLOOKUP(A12,Formelhilfe!$A$9:$O$44,15,FALSE)","v":{"v":6,"d":"6.0"}},{"$f":"SUM(L12:Q12)","v":{"v":1867.9,"d":"1,867.9"}},{"$f":"IF(V12>0,W12/V12,0)","v":{"v":310.35,"d":"310.4"}},{"$f":"VLOOKUP(A12,Formelhilfe!$A$9:$P$44,16,FALSE)","v":{"v":12,"d":"12.0"}},{"$f":"SUM(C12:H12,L12:Q12)","v":{"v":3724.2000000000003,"d":"3,724.2"}}]
["Will Achim",{"$f":"VLOOKUP(A13,'Wettkampf 1'!$B$10:$C$45,2,FALSE)","v":"Spahnharrenstätte II"},{"$f":"VLOOKUP(A13,'Wettkampf 1'!$B$10:$D$45,3,FALSE)","v":{"v":307,"d":"307.0"}},{"$f":"VLOOKUP($A13,'2'!$B$10:$D$45,3,FALSE)","v":313.5},{"$f":"VLOOKUP($A13,'3'!$B$10:$D$45,3,FALSE)","v":309.9},{"$f":"VLOOKUP($A13,'4'!$B$10:$D$45,3,FALSE)","v":{"v":310,"d":"310.0"}},{"$f":"VLOOKUP($A13,'5'!$B$10:$D$45,3,FALSE)","v":{"v":312,"d":"312.0"}},{"$f":"VLOOKUP($A13,'6'!$B$10:$D$45,3,FALSE)","v":313.7},{"$f":"IF(J13 > 0,K13/J13,0)","v":{"v":311.0166666666667,"d":"311.0"}},{"$f":"VLOOKUP(A13,Formelhilfe!$A$9:$H$44,8,FALSE)","v":{"v":6,"d":"6.0"}},{"$f":"SUM(C13:H13)","v":{"v":1866.1000000000001,"d":"1,866.1"}},{"$f":"VLOOKUP($A13,'7'!$B$10:$D$45,3,FALSE)","v":308.6},{"$f":"VLOOKUP($A13,'8'!$B$10:$D$45,3,FALSE)","v":309.4},{"$f":"VLOOKUP($A13,'9'!$B$10:$D$45,3,FALSE)","v":310.3},{"$f":"VLOOKUP($A13,'10'!$B$10:$D$45,3,FALSE)","v":305.9},{"$f":"VLOOKUP($A13,'11'!$B$10:$D$45,3,FALSE)","v":308.1},{"$f":"VLOOKUP($A13,'12'!$B$10:$D$45,3,FALSE)","v":312.7},{"$f":"IF(S13 >0,T13/S13,0)","v":{"v":309.16666666666663,"d":"309.2"}},{"$f":"VLOOKUP(A13,Formelhilfe!$A$9:$O$44,15,FALSE)","v":{"v":6,"d":"6.0"}},{"$f":"SUM(L13:Q13)","v":{"v":1854.9999999999998,"d":"1,855.0"}},{"$f":"IF(V13>0,W13/V13,0)","v":{"v":310.0916666666667,"d":"310.1"}},{"$f":"VLOOKUP(A13,Formelhilfe!$A$9:$P$44,16,FALSE)","v":{"v":12,"d":"12.0"}},{"$f":"SUM(C13:H13,L13:Q13)","v":{"v":3721.1000000000004,"d":"3,721.1"}}]
["Schulte Mathias",{"$f":"VLOOKUP(A14,'Wettkampf 1'!$B$10:$C$45,2,FALSE)","v":"Esterwegen III"},{"$f":"VLOOKUP(A14,'Wettkampf 1'!$B$10:$D$45,3,FALSE)","v":{"v":310.79999999999995,"d":"310.8"}},{"$f":"VLOOKUP($A14,'2'!$B$10:$D$45,3,FALSE)","v":308.4},{"$f":"VLOOKUP($A14,'3'!$B$10:$D$45,3,FALSE)","v":310.6},{"$f":"VLOOKUP($A14,'4'!$B$10:$D$45,3,FALSE)","v":312.7},{"$f":"VLOOKUP($A14,'5'!$B$10:$D$45,3,FALSE)","v":311.9},{"$f":"VLOOKUP($A14,'6'!$B$10:$D$45,3,FALSE)","v":308.5},{"$f":"IF(J14 > 0,K14/J14,0)","v":{"v":310.48333333333335,"d":"310.5"}},{"$f":"VLOOKUP(A14,Formelhilfe!$A$9:$H$44,8,FALSE)","v":{"v":6,"d":"6.0"}},{"$f":"SUM(C14:H14)","v":{"v":1862.9,"d":"1,862.9"}},{"$f":"VLOOKUP($A14,'7'!$B$10:$D$45,3,FALSE)","v":306.2},{"$f":"VLOOKUP($A14,'8'!$B$10:$D$45,3,FALSE)","v":308.6},{"$f":"VLOOKUP($A14,'9'!$B$10:$D$45,3,FALSE)","v":308.3},{"$f":"VLOOKUP($A14,'10'!$B$10:$D$45,3,FALSE)","v":307.8},{"$f":"VLOOKUP($A14,'11'!$B$10:$D$45,3,FALSE)","v":312.5},{"$f":"VLOOKUP($A14,'12'!$B$10:$D$45,3,FALSE)","v":{"v":310,"d":"310.0"}},{"$f":"IF(S14 >0,T14/S14,0)","v":308.9},{"$f":"VLOOKUP(A14,Formelhilfe!$A$9:$O$44,15,FALSE)","v":{"v":6,"d":"6.0"}},{"$f":"SUM(L14:Q14)","v":{"v":1853.3999999999999,"d":"1,853.4"}},{"$f":"IF(V14>0,W14/V14,0)","v":{"v":309.69166666666666,"d":"309.7"}},{"$f":"VLOOKUP(A14,Formelhilfe!$A$9:$P$44,16,FALSE)","v":{"v":12,"d":"12.0"}},{"$f":"SUM(C14:H14,L14:Q14)","v":{"v":3716.3,"d":"3,716.3"}}]
["Müller Helmut",{"$f":"VLOOKUP(A15,'Wettkampf 1'!$B$10:$C$45,2,FALSE)","v":"Rastdorf III"},{"$f":"VLOOKUP(A15,'Wettkampf 1'!$B$10:$D$45,3,FALSE)","v":315.8},{"$f":"VLOOKUP($A15,'2'!$B$10:$D$45,3,FALSE)","v":{"v":309,"d":"309.0"}},{"$f":"VLOOKUP($A15,'3'!$B$10:$D$45,3,FALSE)","v":309.8},{"$f":"VLOOKUP($A15,'4'!$B$10:$D$45,3,FALSE)","v":306.9},{"$f":"VLOOKUP($A15,'5'!$B$10:$D$45,3,FALSE)","v":308.3},{"$f":"VLOOKUP($A15,'6'!$B$10:$D$45,3,FALSE)","v":{"v":312,"d":"312.0"}},{"$f":"IF(J15 > 0,K15/J15,0)","v":310.3},{"$f":"VLOOKUP(A15,Formelhilfe!$A$9:$H$44,8,FALSE)","v":{"v":6,"d":"6.0"}},{"$f":"SUM(C15:H15)","v":{"v":1861.8,"d":"1,861.8"}},{"$f":"VLOOKUP($A15,'7'!$B$10:$D$45,3,FALSE)","v":310.1},{"$f":"VLOOKUP($A15,'8'!$B$10:$D$45,3,FALSE)","v":310.1},{"$f":"VLOOKUP($A15,'9'!$B$10:$D$45,3,FALSE)","v":312.4},{"$f":"VLOOKUP($A15,'10'!$B$10:$D$45,3,FALSE)","v":302.8},{"$f":"VLOOKUP($A15,'11'!$B$10:$D$45,3,FALSE)","v":310.2},{"$f":"VLOOKUP($A15,'12'!$B$10:$D$45,3,FALSE)","v":308.3},{"$f":"IF(S15 >0,T15/S15,0)","v":{"v":308.98333333333335,"d":"309.0"}},{"$f":"VLOOKUP(A15,Formelhilfe!$A$9:$O$44,15,FALSE)","v":{"v":6,"d":"6.0"}},{"$f":"SUM(L15:Q15)","v":{"v":1853.9,"d":"1,853.9"}},{"$f":"IF(V15>0,W15/V15,0)","v":{"v":309.6416666666667,"d":"309.6"}},{"$f":"VLOOKUP(A15,Formelhilfe!$A$9:$P$44,16,FALSE)","v":{"v":12,"d":"12.0"}},{"$f":"SUM(C15:H15,L15:Q15)","v":{"v":3715.7000000000003,"d":"3,715.7"}}]
["Antons Mathias",{"$f":"VLOOKUP(A16,'Wettkampf 1'!$B$10:$C$45,2,FALSE)","v":"Börgerwald II"},{"$f":"VLOOKUP(A16,'Wettkampf 1'!$B$10:$D$45,3,FALSE)","v":308.9},{"$f":"VLOOKUP($A16,'2'!$B$10:$D$45,3,FALSE)","v":{"v":309,"d":"309.0"}},{"$f":"VLOOKUP($A16,'3'!$B$10:$D$45,3,FALSE)","v":308.3},{"$f":"VLOOKUP($A16,'4'!$B$10:$D$45,3,FALSE)","v":303.3},{"$f":"VLOOKUP($A16,'5'!$B$10:$D$45,3,FALSE)","v":309.1},{"$f":"VLOOKUP($A16,'6'!$B$10:$D$45,3,FALSE)","v":306.5},{"$f":"IF(J16 > 0,K16/J16,0)","v":{"v":307.51666666666665,"d":"307.5"}},{"$f":"VLOOKUP(A16,Formelhilfe!$A$9:$H$44,8,FALSE)","v":{"v":6,"d":"6.0"}},{"$f":"SUM(C16:H16)","v":{"v":1845.1,"d":"1,845.1"}},{"$f":"VLOOKUP($A16,'7'!$B$10:$D$45,3,FALSE)","v":308.8},{"$f":"VLOOKUP($A16,'8'!$B$10:$D$45,3,FALSE)","v":{"v":310,"d":"310.0"}},{"$f":"VLOOKUP($A16,'9'!$B$10:$D$45,3,FALSE)","v":309.6},{"$f":"VLOOKUP($A16,'10'!$B$10:$D$45,3,FALSE)","v":306.2},{"$f":"VLOOKUP($A16,'11'!$B$10:$D$45,3,FALSE)","v":313.6},{"$f":"VLOOKUP($A16,'12'!$B$10:$D$45,3,FALSE)","v":312.1},{"$f":"IF(S16 >0,T16/S16,0)","v":{"v":310.04999999999995,"d":"310.1"}},{"$f":"VLOOKUP(A16,Formelhilfe!$A$9:$O$44,15,FALSE)","v":{"v":6,"d":"6.0"}},{"$f":"SUM(L16:Q16)","v":{"v":1860.2999999999997,"d":"1,860.3"}},{"$f":"IF(V16>0,W16/V16,0)","v":{"v":308.7833333333333,"d":"308.8"}},{"$f":"VLOOKUP(A16,Formelhilfe!$A$9:$P$44,16,FALSE)","v":{"v":12,"d":"12.0"}},{"$f":"SUM(C16:H16,L16:Q16)","v":{"v":3705.3999999999996,"d":"3,705.4"}}]
["Hanneken Moritz",{"$f":"VLOOKUP(A17,'Wettkampf 1'!$B$10:$C$45,2,FALSE)","v":"Börgerwald II"},{"$f":"VLOOKUP(A17,'Wettkampf 1'!$B$10:$D$45,3,FALSE)","v":307.4},{"$f":"VLOOKUP($A17,'2'!$B$10:$D$45,3,FALSE)","v":304.1},{"$f":"VLOOKUP($A17,'3'!$B$10:$D$45,3,FALSE)","v":310.8},{"$f":"VLOOKUP($A17,'4'!$B$10:$D$45,3,FALSE)","v":307.8},{"$f":"VLOOKUP($A17,'5'!$B$10:$D$45,3,FALSE)","v":306.8},{"$f":"VLOOKUP($A17,'6'!$B$10:$D$45,3,FALSE)","v":305.6},{"$f":"IF(J17 > 0,K17/J17,0)","v":{"v":307.0833333333333,"d":"307.1"}},{"$f":"VLOOKUP(A17,Formelhilfe!$A$9:$H$44,8,FALSE)","v":{"v":6,"d":"6.0"}},{"$f":"SUM(C17:H17)","v":{"v":1842.5,"d":"1,842.5"}},{"$f":"VLOOKUP($A17,'7'!$B$10:$D$45,3,FALSE)","v":306.4},{"$f":"VLOOKUP($A17,'8'!$B$10:$D$45,3,FALSE)","v":309.2},{"$f":"VLOOKUP($A17,'9'!$B$10:$D$45,3,FALSE)","v":307.3},{"$f":"VLOOKUP($A17,'10'!$B$10:$D$45,3,FALSE)","v":308.1},{"$f":"VLOOKUP($A17,'11'!$B$10:$D$45,3,FALSE)","v":316.1},{"$f":"VLOOKUP($A17,'12'!$B$10:$D$45,3,FALSE)","v":311.8},{"$f":"IF(S17 >0,T17/S17,0)","v":{"v":309.81666666666666,"d":"309.8"}},{"$f":"VLOOKUP(A17,Formelhilfe!$A$9:$O$44,15,FALSE)","v":{"v":6,"d":"6.0"}},{"$f":"SUM(L17:Q17)","v":{"v":1858.8999999999999,"d":"1,858.9"}},{"$f":"IF(V17>0,W17/V17,0)","v":{"v":308.45,"d":"308.5"}},{"$f":"VLOOKUP(A17,Formelhilfe!$A$9:$P$44,16,FALSE)","v":{"v":12,"d":"12.0"}},{"$f":"SUM(C17:H17,L17:Q17)","v":{"v":3701.4,"d":"3,701.4"}}]
["Steenken Klaus",{"$f":"VLOOKUP(A18,'Wettkampf 1'!$B$10:$C$45,2,FALSE)","v":"Neuvrees I"},{"$f":"VLOOKUP(A18,'Wettkampf 1'!$B$10:$D$45,3,FALSE)","v":304.2},{"$f":"VLOOKUP($A18,'2'!$B$10:$D$45,3,FALSE)","v":{"v":307,"d":"307.0"}},{"$f":"VLOOKUP($A18,'3'!$B$10:$D$45,3,FALSE)","v":305.7},{"$f":"VLOOKUP($A18,'4'!$B$10:$D$45,3,FALSE)","v":305.2},{"$f":"VLOOKUP($A18,'5'!$B$10:$D$45,3,FALSE)","v":308.1},{"$f":"VLOOKUP($A18,'6'!$B$10:$D$45,3,FALSE)","v":309.2},{"$f":"IF(J18 > 0,K18/J18,0)","v":{"v":306.5666666666667,"d":"306.6"}},{"$f":"VLOOKUP(A18,Formelhilfe!$A$9:$H$44,8,FALSE)","v":{"v":6,"d":"6.0"}},{"$f":"SUM(C18:H18)","v":{"v":1839.4000000000003,"d":"1,839.4"}},{"$f":"VLOOKUP($A18,'7'!$B$10:$D$45,3,FALSE)","v":307.2},{"$f":"VLOOKUP($A18,'8'!$B$10:$D$45,3,FALSE)","v":310.3},{"$f":"VLOOKUP($A18,'9'!$B$10:$D$45,3,FALSE)","v":306.6},{"$f":"VLOOKUP($A18,'10'!$B$10:$D$45,3,FALSE)","v":{"v":305,"d":"305.0"}},{"$f":"VLOOKUP($A18,'11'!$B$10:$D$45,3,FALSE)","v":309.7},{"$f":"VLOOKUP($A18,'12'!$B$10:$D$45,3,FALSE)","v":309.6},{"$f":"IF(S18 >0,T18/S18,0)","v":{"v":308.06666666666666,"d":"308.1"}},{"$f":"VLOOKUP(A18,Formelhilfe!$A$9:$O$44,15,FALSE)","v":{"v":6,"d":"6.0"}},{"$f":"SUM(L18:Q18)","v":{"v":1848.4,"d":"1,848.4"}},{"$f":"IF(V18>0,W18/V18,0)","v":{"v":307.31666666666666,"d":"307.3"}},{"$f":"VLOOKUP(A18,Formelhilfe!$A$9:$P$44,16,FALSE)","v":{"v":12,"d":"12.0"}},{"$f":"SUM(C18:H18,L18:Q18)","v":{"v":3687.8,"d":"3,687.8"}}]
["Goldenstein Uwe",{"$f":"VLOOKUP(A19,'Wettkampf 1'!$B$10:$C$45,2,FALSE)","v":"Börger II"},{"$f":"VLOOKUP(A19,'Wettkampf 1'!$B$10:$D$45,3,FALSE)","v":307.4},{"$f":"VLOOKUP($A19,'2'!$B$10:$D$45,3,FALSE)","v":304.8},{"$f":"VLOOKUP($A19,'3'!$B$10:$D$45,3,FALSE)","v":304.1},{"$f":"VLOOKUP($A19,'4'!$B$10:$D$45,3,FALSE)","v":304.8},{"$f":"VLOOKUP($A19,'5'!$B$10:$D$45,3,FALSE)","v":307.9},{"$f":"VLOOKUP($A19,'6'!$B$10:$D$45,3,FALSE)","v":308.7},{"$f":"IF(J19 > 0,K19/J19,0)","v":{"v":306.28333333333336,"d":"306.3"}},{"$f":"VLOOKUP(A19,Formelhilfe!$A$9:$H$44,8,FALSE)","v":{"v":6,"d":"6.0"}},{"$f":"SUM(C19:H19)","v":{"v":1837.7,"d":"1,837.7"}},{"$f":"VLOOKUP($A19,'7'!$B$10:$D$45,3,FALSE)","v":305.1},{"$f":"VLOOKUP($A19,'8'!$B$10:$D$45,3,FALSE)","v":304.6},{"$f":"VLOOKUP($A19,'9'!$B$10:$D$45,3,FALSE)","v":301.7},{"$f":"VLOOKUP($A19,'10'!$B$10:$D$45,3,FALSE)","v":302.3},{"$f":"VLOOKUP($A19,'11'!$B$10:$D$45,3,FALSE)","v":308.8},{"$f":"VLOOKUP($A19,'12'!$B$10:$D$45,3,FALSE)","v":305.3},{"$f":"IF(S19 >0,T19/S19,0)","v":{"v":304.6333333333333,"d":"304.6"}},{"$f":"VLOOKUP(A19,Formelhilfe!$A$9:$O$44,15,FALSE)","v":{"v":6,"d":"6.0"}},{"$f":"SUM(L19:Q19)","v":{"v":1827.8,"d":"1,827.8"}},{"$f":"IF(V19>0,W19/V19,0)","v":{"v":305.45833333333337,"d":"305.5"}},{"$f":"VLOOKUP(A19,Formelhilfe!$A$9:$P$44,16,FALSE)","v":{"v":12,"d":"12.0"}},{"$f":"SUM(C19:H19,L19:Q19)","v":{"v":3665.5000000000005,"d":"3,665.5"}}]
["Rolfes Wilhelm",{"$f":"VLOOKUP(A20,'Wettkampf 1'!$B$10:$C$45,2,FALSE)","v":"Neuvrees I"},{"$f":"VLOOKUP(A20,'Wettkampf 1'!$B$10:$D$45,3,FALSE)","v":312.6},{"$f":"VLOOKUP($A20,'2'!$B$10:$D$45,3,FALSE)","v":304.2},{"$f":"VLOOKUP($A20,'3'!$B$10:$D$45,3,FALSE)","v":293.4},{"$f":"VLOOKUP($A20,'4'!$B$10:$D$45,3,FALSE)","v":301.6},{"$f":"VLOOKUP($A20,'5'!$B$10:$D$45,3,FALSE)","v":308.8},{"$f":"VLOOKUP($A20,'6'!$B$10:$D$45,3,FALSE)","v":311.6},{"$f":"IF(J20 > 0,K20/J20,0)","v":{"v":305.3666666666666,"d":"305.4"}},{"$f":"VLOOKUP(A20,Formelhilfe!$A$9:$H$44,8,FALSE)","v":{"v":6,"d":"6.0"}},{"$f":"SUM(C20:H20)","v":{"v":1832.1999999999998,"d":"1,832.2"}},{"$f":"VLOOKUP($A20,'7'!$B$10:$D$45,3,FALSE)","v":305.8},{"$f":"VLOOKUP($A20,'8'!$B$10:$D$45,3,FALSE)","v":295.8},{"$f":"VLOOKUP($A20,'9'!$B$10:$D$45,3,FALSE)","v":306.3},{"$f":"VLOOKUP($A20,'10'!$B$10:$D$45,3,FALSE)","v":303.3},{"$f":"VLOOKUP($A20,'11'!$B$10:$D$45,3,FALSE)","v":307.1},{"$f":"VLOOKUP($A20,'12'!$B$10:$D$45,3,FALSE)","v":311.7},{"$f":"IF(S20 >0,T20/S20,0)","v":{"v":305.00000000000006,"d":"305.0"}},{"$f":"VLOOKUP(A20,Formelhilfe!$A$9:$O$44,15,FALSE)","v":{"v":6,"d":"6.0"}},{"$f":"SUM(L20:Q20)","v":{"v":1830.0000000000002,"d":"1,830.0"}},{"$f":"IF(V20>0,W20/V20,0)","v":{"v":305.18333333333334,"d":"305.2"}},{"$f":"VLOOKUP(A20,Formelhilfe!$A$9:$P$44,16,FALSE)","v":{"v":12,"d":"12.0"}},{"$f":"SUM(C20:H20,L20:Q20)","v":{"v":3662.2000000000003,"d":"3,662.2"}}]
["Jungsthoefel Markus",{"$f":"VLOOKUP(A21,'Wettkampf 1'!$B$10:$C$45,2,FALSE)","v":"Börger II"},{"$f":"VLOOKUP(A21,'Wettkampf 1'!$B$10:$D$45,3,FALSE)","v":308.3},{"$f":"VLOOKUP($A21,'2'!$B$10:$D$45,3,FALSE)","v":303.5},{"$f":"VLOOKUP($A21,'3'!$B$10:$D$45,3,FALSE)","v":305.4},{"$f":"VLOOKUP($A21,'4'!$B$10:$D$45,3,FALSE)","v":306.1},{"$f":"VLOOKUP($A21,'5'!$B$10:$D$45,3,FALSE)","v":307.5},{"$f":"VLOOKUP($A21,'6'!$B$10:$D$45,3,FALSE)","v":309.1},{"$f":"IF(J21 > 0,K21/J21,0)","v":{"v":306.65000000000003,"d":"306.7"}},{"$f":"VLOOKUP(A21,Formelhilfe!$A$9:$H$44,8,FALSE)","v":{"v":6,"d":"6.0"}},{"$f":"SUM(C21:H21)","v":{"v":1839.9,"d":"1,839.9"}},{"$f":"VLOOKUP($A21,'7'!$B$10:$D$45,3,FALSE)","v":299.6},{"$f":"VLOOKUP($A21,'8'!$B$10:$D$45,3,FALSE)","v":307.9},{"$f":"VLOOKUP($A21,'9'!$B$10:$D$45,3,FALSE)","v":308.6},{"$f":"VLOOKUP($A21,'10'!$B$10:$D$45,3,FALSE)","v":287.8},{"$f":"VLOOKUP($A21,'11'!$B$10:$D$45,3,FALSE)","v":301.6},{"$f":"VLOOKUP($A21,'12'!$B$10:$D$45,3,FALSE)","v":309.1},{"$f":"IF(S21 >0,T21/S21,0)","v":{"v":302.43333333333334,"d":"302.4"}},{"$f":"VLOOKUP(A21,Formelhilfe!$A$9:$O$44,15,FALSE)","v":{"v":6,"d":"6.0"}},{"$f":"SUM(L21:Q21)","v":{"v":1814.6,"d":"1,814.6"}},{"$f":"IF(V21>0,W21/V21,0)","v":{"v":304.5416666666667,"d":"304.5"}},{"$f":"VLOOKUP(A21,Formelhilfe!$A$9:$P$44,16,FALSE)","v":{"v":12,"d":"12.0"}},{"$f":"SUM(C21:H21,L21:Q21)","v":{"v":3654.5,"d":"3,654.5"}}]
["Thyen Werner",{"$f":"VLOOKUP(A22,'Wettkampf 1'!$B$10:$C$45,2,FALSE)","v":"Neuvrees I"},{"$f":"VLOOKUP(A22,'Wettkampf 1'!$B$10:$D$45,3,FALSE)","v":304.5},{"$f":"VLOOKUP($A22,'2'!$B$10:$D$45,3,FALSE)","v":295.7},{"$f":"VLOOKUP($A22,'3'!$B$10:$D$45,3,FALSE)","v":302.9},{"$f":"VLOOKUP($A22,'4'!$B$10:$D$45,3,FALSE)","v":304.7},{"$f":"VLOOKUP($A22,'5'!$B$10:$D$45,3,FALSE)","v":{"v":303,"d":"303.0"}},{"$f":"VLOOKUP($A22,'6'!$B$10:$D$45,3,FALSE)","v":303.3},{"$f":"IF(J22 > 0,K22/J22,0)","v":{"v":302.34999999999997,"d":"302.4"}},{"$f":"VLOOKUP(A22,Formelhilfe!$A$9:$H$44,8,FALSE)","v":{"v":6,"d":"6.0"}},{"$f":"SUM(C22:H22)","v":{"v":1814.1,"d":"1,814.1"}},{"$f":"VLOOKUP($A22,'7'!$B$10:$D$45,3,FALSE)","v":302.3},{"$f":"VLOOKUP($A22,'8'!$B$10:$D$45,3,FALSE)","v":306.1},{"$f":"VLOOKUP($A22,'9'!$B$10:$D$45,3,FALSE)","v":301.5},{"$f":"VLOOKUP($A22,'10'!$B$10:$D$45,3,FALSE)","v":307.8},{"$f":"VLOOKUP($A22,'11'!$B$10:$D$45,3,FALSE)","v":{"v":309,"d":"309.0"}},{"$f":"VLOOKUP($A22,'12'!$B$10:$D$45,3,FALSE)","v":308.8},{"$f":"IF(S22 >0,T22/S22,0)","v":{"v":305.9166666666667,"d":"305.9"}},{"$f":"VLOOKUP(A22,Formelhilfe!$A$9:$O$44,15,FALSE)","v":{"v":6,"d":"6.0"}},{"$f":"SUM(L22:Q22)","v":{"v":1835.5,"d":"1,835.5"}},{"$f":"IF(V22>0,W22/V22,0)","v":{"v":304.1333333333334,"d":"304.1"}},{"$f":"VLOOKUP(A22,Formelhilfe!$A$9:$P$44,16,FALSE)","v":{"v":12,"d":"12.0"}},{"$f":"SUM(C22:H22,L22:Q22)","v":{"v":3649.6000000000004,"d":"3,649.6"}}]
["Sebers Tobias",{"$f":"VLOOKUP(A23,'Wettkampf 1'!$B$10:$C$45,2,FALSE)","v":"Börgerwald II"},{"$f":"VLOOKUP(A23,'Wettkampf 1'!$B$10:$D$45,3,FALSE)","v":305.8},{"$f":"VLOOKUP($A23,'2'!$B$10:$D$45,3,FALSE)","v":304.5},{"$f":"VLOOKUP($A23,'3'!$B$10:$D$45,3,FALSE)","v":300.3},{"$f":"VLOOKUP($A23,'4'!$B$10:$D$45,3,FALSE)","v":307.7},{"$f":"VLOOKUP($A23,'5'!$B$10:$D$45,3,FALSE)","v":302.3},{"$f":"VLOOKUP($A23,'6'!$B$10:$D$45,3,FALSE)","v":304.3},{"$f":"IF(J23 > 0,K23/J23,0)","v":{"v":304.15,"d":"304.2"}},{"$f":"VLOOKUP(A23,Formelhilfe!$A$9:$H$44,8,FALSE)","v":{"v":6,"d":"6.0"}},{"$f":"SUM(C23:H23)","v":{"v":1824.8999999999999,"d":"1,824.9"}},{"$f":"VLOOKUP($A23,'7'!$B$10:$D$45,3,FALSE)","v":{"v":297,"d":"297.0"}},{"$f":"VLOOKUP($A23,'8'!$B$10:$D$45,3,FALSE)","v":301.2},{"$f":"VLOOKUP($A23,'9'!$B$10:$D$45,3,FALSE)","v":302.5},{"$f":"VLOOKUP($A23,'10'!$B$10:$D$45,3,FALSE)","v":298.7},{"$f":"VLOOKUP($A23,'11'!$B$10:$D$45,3,FALSE)","v":301.7},{"$f":"VLOOKUP($A23,'12'!$B$10:$D$45,3,FALSE)","v":305.1},{"$f":"IF(S23 >0,T23/S23,0)","v":{"v":301.03333333333336,"d":"301.0"}},{"$f":"VLOOKUP(A23,Formelhilfe!$A$9:$O$44,15,FALSE)","v":{"v":6,"d":"6.0"}},{"$f":"SUM(L23:Q23)","v":{"v":1806.2000000000003,"d":"1,806.2"}},{"$f":"IF(V23>0,W23/V23,0)","v":{"v":302.5916666666666,"d":"302.6"}},{"$f":"VLOOKUP(A23,Formelhilfe!$A$9:$P$44,16,FALSE)","v":{"v":12,"d":"12.0"}},{"$f":"SUM(C23:H23,L23:Q23)","v":{"v":3631.099999999999,"d":"3,631.1"}}]
["Meyer Dirk",{"$f":"VLOOKUP(A24,'Wettkampf 1'!$B$10:$C$45,2,FALSE)","v":"Spahnharrenstätte II"},{"$f":"VLOOKUP(A24,'Wettkampf 1'!$B$10:$D$45,3,FALSE)","v":311.1},{"$f":"VLOOKUP($A24,'2'!$B$10:$D$45,3,FALSE)","v":312.6},{"$f":"VLOOKUP($A24,'3'!$B$10:$D$45,3,FALSE)","v":{"v":313,"d":"313.0"}},{"$f":"VLOOKUP($A24,'4'!$B$10:$D$45,3,FALSE)","v":312.9},{"$f":"VLOOKUP($A24,'5'!$B$10:$D$45,3,FALSE)","v":314.1},{"$f":"VLOOKUP($A24,'6'!$B$10:$D$45,3,FALSE)","v":310.7},{"$f":"IF(J24 > 0,K24/J24,0)","v":312.4},{"$f":"VLOOKUP(A24,Formelhilfe!$A$9:$H$44,8,FALSE)","v":{"v":6,"d":"6.0"}},{"$f":"SUM(C24:H24)","v":{"v":1874.3999999999999,"d":"1,874.4"}},{"$f":"VLOOKUP($A24,'7'!$B$10:$D$45,3,FALSE)","v":310.5},{"$f":"VLOOKUP($A24,'8'!$B$10:$D$45,3,FALSE)","v":{"v":314,"d":"314.0"}},{"$f":"VLOOKUP($A24,'9'!$B$10:$D$45,3,FALSE)","v":{"v":0,"d":"0.0"}},{"$f":"VLOOKUP($A24,'10'!$B$10:$D$45,3,FALSE)","v":309.5},{"$f":"VLOOKUP($A24,'11'!$B$10:$D$45,3,FALSE)","v":311.3},{"$f":"VLOOKUP($A24,'12'!$B$10:$D$45,3,FALSE)","v":307.9},{"$f":"IF(S24 >0,T24/S24,0)","v":{"v":310.64,"d":"310.6"}},{"$f":"VLOOKUP(A24,Formelhilfe!$A$9:$O$44,15,FALSE)","v":{"v":5,"d":"5.0"}},{"$f":"SUM(L24:Q24)","v":{"v":1553.1999999999998,"d":"1,553.2"}},{"$f":"IF(V24>0,W24/V24,0)","v":{"v":311.59999999999997,"d":"311.6"}},{"$f":"VLOOKUP(A24,Formelhilfe!$A$9:$P$44,16,FALSE)","v":{"v":11,"d":"11.0"}},{"$f":"SUM(C24:H24,L24:Q24)","v":{"v":3427.6,"d":"3,427.6"}}]
["Eckmann Mark",{"$f":"VLOOKUP(A25,'Wettkampf 1'!$B$10:$C$45,2,FALSE)","v":"Börger II"},{"$f":"VLOOKUP(A25,'Wettkampf 1'!$B$10:$D$45,3,FALSE)","v":310.3},{"$f":"VLOOKUP($A25,'2'!$B$10:$D$45,3,FALSE)","v":301.5},{"$f":"VLOOKUP($A25,'3'!$B$10:$D$45,3,FALSE)","v":304.1},{"$f":"VLOOKUP($A25,'4'!$B$10:$D$45,3,FALSE)","v":301.7},{"$f":"VLOOKUP($A25,'5'!$B$10:$D$45,3,FALSE)","v":311.3},{"$f":"VLOOKUP($A25,'6'!$B$10:$D$45,3,FALSE)","v":304.5},{"$f":"IF(J25 > 0,K25/J25,0)","v":{"v":305.56666666666666,"d":"305.6"}},{"$f":"VLOOKUP(A25,Formelhilfe!$A$9:$H$44,8,FALSE)","v":{"v":6,"d":"6.0"}},{"$f":"SUM(C25:H25)","v":{"v":1833.3999999999999,"d":"1,833.4"}},{"$f":"VLOOKUP($A25,'7'!$B$10:$D$45,3,FALSE)","v":303.7},{"$f":"VLOOKUP($A25,'8'!$B$10:$D$45,3,FALSE)","v":{"v":0,"d":"0.0"}},{"$f":"VLOOKUP($A25,'9'!$B$10:$D$45,3,FALSE)","v":{"v":304,"d":"304.0"}},{"$f":"VLOOKUP($A25,'10'!$B$10:$D$45,3,FALSE)","v":299.8},{"$f":"VLOOKUP($A25,'11'!$B$10:$D$45,3,FALSE)","v":310.5},{"$f":"VLOOKUP($A25,'12'!$B$10:$D$45,3,FALSE)","v":305.8},{"$f":"IF(S25 >0,T25/S25,0)","v":{"v":304.76,"d":"304.8"}},{"$f":"VLOOKUP(A25,Formelhilfe!$A$9:$O$44,15,FALSE)","v":{"v":5,"d":"5.0"}},{"$f":"SUM(L25:Q25)","v":{"v":1523.8,"d":"1,523.8"}},{"$f":"IF(V25>0,W25/V25,0)","v":{"v":305.20000000000005,"d":"305.2"}},{"$f":"VLOOKUP(A25,Formelhilfe!$A$9:$P$44,16,FALSE)","v":{"v":11,"d":"11.0"}},{"$f":"SUM(C25:H25,L25:Q25)","v":{"v":3357.2000000000003,"d":"3,357.2"}}]
["Schulz Simon",{"$f":"VLOOKUP(A26,'Wettkampf 1'!$B$10:$C$45,2,FALSE)","v":"Börger II"},{"$f":"VLOOKUP(A26,'Wettkampf 1'!$B$10:$D$45,3,FALSE)","v":305.7},{"$f":"VLOOKUP($A26,'2'!$B$10:$D$45,3,FALSE)","v":299.8},{"$f":"VLOOKUP($A26,'3'!$B$10:$D$45,3,FALSE)","v":308.7},{"$f":"VLOOKUP($A26,'4'!$B$10:$D$45,3,FALSE)","v":303.7},{"$f":"VLOOKUP($A26,'5'!$B$10:$D$45,3,FALSE)","v":304.8},{"$f":"VLOOKUP($A26,'6'!$B$10:$D$45,3,FALSE)","v":309.3},{"$f":"IF(J26 > 0,K26/J26,0)","v":{"v":305.3333333333333,"d":"305.3"}},{"$f":"VLOOKUP(A26,Formelhilfe!$A$9:$H$44,8,FALSE)","v":{"v":6,"d":"6.0"}},{"$f":"SUM(C26:H26)","v":{"v":1832,"d":"1,832.0"}},{"$f":"VLOOKUP($A26,'7'!$B$10:$D$45,3,FALSE)","v":298.2},{"$f":"VLOOKUP($A26,'8'!$B$10:$D$45,3,FALSE)","v":302.8},{"$f":"VLOOKUP($A26,'9'!$B$10:$D$45,3,FALSE)","v":296.8},{"$f":"VLOOKUP($A26,'10'!$B$10:$D$45,3,FALSE)","v":{"v":0,"d":"0.0"}},{"$f":"VLOOKUP($A26,'11'!$B$10:$D$45,3,FALSE)","v":299.8},{"$f":"VLOOKUP($A26,'12'!$B$10:$D$45,3,FALSE)","v":307.8},{"$f":"IF(S26 >0,T26/S26,0)","v":{"v":301.08,"d":"301.1"}},{"$f":"VLOOKUP(A26,Formelhilfe!$A$9:$O$44,15,FALSE)","v":{"v":5,"d":"5.0"}},{"$f":"SUM(L26:Q26)","v":{"v":1505.3999999999999,"d":"1,505.4"}},{"$f":"IF(V26>0,W26/V26,0)","v":{"v":303.40000000000003,"d":"303.4"}},{"$f":"VLOOKUP(A26,Formelhilfe!$A$9:$P$44,16,FALSE)","v":{"v":11,"d":"11.0"}},{"$f":"SUM(C26:H26,L26:Q26)","v":{"v":3337.4000000000005,"d":"3,337.4"}}]
["Schwarte Hermann",{"$f":"VLOOKUP(A27,'Wettkampf 1'!$B$10:$C$45,2,FALSE)","v":"Börger II"},{"$f":"VLOOKUP(A27,'Wettkampf 1'!$B$10:$D$45,3,FALSE)","v":309.6},{"$f":"VLOOKUP($A27,'2'!$B$10:$D$45,3,FALSE)","v":301.5},{"$f":"VLOOKUP($A27,'3'!$B$10:$D$45,3,FALSE)","v":307.3},{"$f":"VLOOKUP($A27,'4'!$B$10:$D$45,3,FALSE)","v":302.5},{"$f":"VLOOKUP($A27,'5'!$B$10:$D$45,3,FALSE)","v":304.7},{"$f":"VLOOKUP($A27,'6'!$B$10:$D$45,3,FALSE)","v":{"v":0,"d":"0.0"}},{"$f":"IF(J27 > 0,K27/J27,0)","v":{"v":305.12,"d":"305.1"}},{"$f":"VLOOKUP(A27,Formelhilfe!$A$9:$H$44,8,FALSE)","v":{"v":5,"d":"5.0"}},{"$f":"SUM(C27:H27)","v":{"v":1525.6000000000001,"d":"1,525.6"}},{"$f":"VLOOKUP($A27,'7'!$B$10:$D$45,3,FALSE)","v":303.1},{"$f":"VLOOKUP($A27,'8'!$B$10:$D$45,3,FALSE)","v":304.9},{"$f":"VLOOKUP($A27,'9'!$B$10:$D$45,3,FALSE)","v":307.5},{"$f":"VLOOKUP($A27,'10'!$B$10:$D$45,3,FALSE)","v":{"v":0,"d":"0.0"}},{"$f":"VLOOKUP($A27,'11'!$B$10:$D$45,3,FALSE)","v":305.1},{"$f":"VLOOKUP($A27,'12'!$B$10:$D$45,3,FALSE)","v":{"v":0,"d":"0.0"}},{"$f":"IF(S27 >0,T27/S27,0)","v":{"v":305.15,"d":"305.2"}},{"$f":"VLOOKUP(A27,Formelhilfe!$A$9:$O$44,15,FALSE)","v":{"v":4,"d":"4.0"}},{"$f":"SUM(L27:Q27)","v":{"v":1220.6,"d":"1,220.6"}},{"$f":"IF(V27>0,W27/V27,0)","v":{"v":305.1333333333334,"d":"305.1"}},{"$f":"VLOOKUP(A27,Formelhilfe!$A$9:$P$44,16,FALSE)","v":{"v":9,"d":"9.0"}},{"$f":"SUM(C27:H27,L27:Q27)","v":{"v":2746.2000000000003,"d":"2,746.2"}}]
["Hahnenkamp Ulrich",{"$f":"VLOOKUP(A28,'Wettkampf 1'!$B$10:$C$45,2,FALSE)","v":"Spahnharrenstätte II"},{"$f":"VLOOKUP(A28,'Wettkampf 1'!$B$10:$D$45,3,FALSE)","v":{"v":0,"d":"0.0"}},{"$f":"VLOOKUP($A28,'2'!$B$10:$D$45,3,FALSE)","v":286.5},{"$f":"VLOOKUP($A28,'3'!$B$10:$D$45,3,FALSE)","v":{"v":0,"d":"0.0"}},{"$f":"VLOOKUP($A28,'4'!$B$10:$D$45,3,FALSE)","v":291.8},{"$f":"VLOOKUP($A28,'5'!$B$10:$D$45,3,FALSE)","v":297.3},{"$f":"VLOOKUP($A28,'6'!$B$10:$D$45,3,FALSE)","v":{"v":0,"d":"0.0"}},{"$f":"IF(J28 > 0,K28/J28,0)","v":{"v":291.8666666666666,"d":"291.9"}},{"$f":"VLOOKUP(A28,Formelhilfe!$A$9:$H$44,8,FALSE)","v":{"v":3,"d":"3.0"}},{"$f":"SUM(C28:H28)","v":{"v":875.5999999999999,"d":"875.6"}},{"$f":"VLOOKUP($A28,'7'!$B$10:$D$45,3,FALSE)","v":295.1},{"$f":"VLOOKUP($A28,'8'!$B$10:$D$45,3,FALSE)","v":284.3},{"$f":"VLOOKUP($A28,'9'!$B$10:$D$45,3,FALSE)","v":274.1},{"$f":"VLOOKUP($A28,'10'!$B$10:$D$45,3,FALSE)","v":301.2},{"$f":"VLOOKUP($A28,'11'!$B$10:$D$45,3,FALSE)","v":299.7},{"$f":"VLOOKUP($A28,'12'!$B$10:$D$45,3,FALSE)","v":291.1},{"$f":"IF(S28 >0,T28/S28,0)","v":{"v":290.9166666666667,"d":"290.9"}},{"$f":"VLOOKUP(A28,Formelhilfe!$A$9:$O$44,15,FALSE)","v":{"v":6,"d":"6.0"}},{"$f":"SUM(L28:Q28)","v":{"v":1745.5,"d":"1,745.5"}},{"$f":"IF(V28>0,W28/V28,0)","v":{"v":291.23333333333335,"d":"291.2"}},{"$f":"VLOOKUP(A28,Formelhilfe!$A$9:$P$44,16,FALSE)","v":{"v":9,"d":"9.0"}},{"$f":"SUM(C28:H28,L28:Q28)","v":{"v":2621.1,"d":"2,621.1"}}]
["Lindemann Gerd",{"$f":"VLOOKUP(A29,'Wettkampf 1'!$B$10:$C$45,2,FALSE)","v":"Esterwegen III"},{"$f":"VLOOKUP(A29,'Wettkampf 1'!$B$10:$D$45,3,FALSE)","v":301.5},{"$f":"VLOOKUP($A29,'2'!$B$10:$D$45,3,FALSE)","v":310.4},{"$f":"VLOOKUP($A29,'3'!$B$10:$D$45,3,FALSE)","v":300.8},{"$f":"VLOOKUP($A29,'4'!$B$10:$D$45,3,FALSE)","v":304.3},{"$f":"VLOOKUP($A29,'5'!$B$10:$D$45,3,FALSE)","v":{"v":0,"d":"0.0"}},{"$f":"VLOOKUP($A29,'6'!$B$10:$D$45,3,FALSE)","v":{"v":0,"d":"0.0"}},{"$f":"IF(J29 > 0,K29/J29,0)","v":{"v":304.25,"d":"304.3"}},{"$f":"VLOOKUP(A29,Formelhilfe!$A$9:$H$44,8,FALSE)","v":{"v":4,"d":"4.0"}},{"$f":"SUM(C29:H29)","v":{"v":1217,"d":"1,217.0"}},{"$f":"VLOOKUP($A29,'7'!$B$10:$D$45,3,FALSE)","v":{"v":0,"d":"0.0"}},{"$f":"VLOOKUP($A29,'8'!$B$10:$D$45,3,FALSE)","v":{"v":0,"d":"0.0"}},{"$f":"VLOOKUP($A29,'9'!$B$10:$D$45,3,FALSE)","v":303.3},{"$f":"VLOOKUP($A29,'10'!$B$10:$D$45,3,FALSE)","v":301.3},{"$f":"VLOOKUP($A29,'11'!$B$10:$D$45,3,FALSE)","v":305.1},{"$f":"VLOOKUP($A29,'12'!$B$10:$D$45,3,FALSE)","v":306.8},{"$f":"IF(S29 >0,T29/S29,0)","v":{"v":304.125,"d":"304.1"}},{"$f":"VLOOKUP(A29,Formelhilfe!$A$9:$O$44,15,FALSE)","v":{"v":4,"d":"4.0"}},{"$f":"SUM(L29:Q29)","v":{"v":1216.5,"d":"1,216.5"}},{"$f":"IF(V29>0,W29/V29,0)","v":{"v":304.1875,"d":"304.2"}},{"$f":"VLOOKUP(A29,Formelhilfe!$A$9:$P$44,16,FALSE)","v":{"v":8,"d":"8.0"}},{"$f":"SUM(C29:H29,L29:Q29)","v":{"v":2433.5,"d":"2,433.5"}}]
["Hahnenkamp Markus",{"$f":"VLOOKUP(A30,'Wettkampf 1'!$B$10:$C$45,2,FALSE)","v":"Spahnharrenstätte II"},{"$f":"VLOOKUP(A30,'Wettkampf 1'!$B$10:$D$45,3,FALSE)","v":{"v":0,"d":"0.0"}},{"$f":"VLOOKUP($A30,'2'!$B$10:$D$45,3,FALSE)","v":{"v":0,"d":"0.0"}},{"$f":"VLOOKUP($A30,'3'!$B$10:$D$45,3,FALSE)","v":{"v":0,"d":"0.0"}},{"$f":"VLOOKUP($A30,'4'!$B$10:$D$45,3,FALSE)","v":{"v":0,"d":"0.0"}},{"$f":"VLOOKUP($A30,'5'!$B$10:$D$45,3,FALSE)","v":298.9},{"$f":"VLOOKUP($A30,'6'!$B$10:$D$45,3,FALSE)","v":295.3},{"$f":"IF(J30 > 0,K30/J30,0)","v":297.1},{"$f":"VLOOKUP(A30,Formelhilfe!$A$9:$H$44,8,FALSE)","v":{"v":2,"d":"2.0"}},{"$f":"SUM(C30:H30)","v":594.2},{"$f":"VLOOKUP($A30,'7'!$B$10:$D$45,3,FALSE)","v":299.6},{"$f":"VLOOKUP($A30,'8'!$B$10:$D$45,3,FALSE)","v":{"v":304,"d":"304.0"}},{"$f":"VLOOKUP($A30,'9'!$B$10:$D$45,3,FALSE)","v":298.2},{"$f":"VLOOKUP($A30,'10'!$B$10:$D$45,3,FALSE)","v":{"v":0,"d":"0.0"}},{"$f":"VLOOKUP($A30,'11'!$B$10:$D$45,3,FALSE)","v":295.9},{"$f":"VLOOKUP($A30,'12'!$B$10:$D$45,3,FALSE)","v":{"v":300,"d":"300.0"}},{"$f":"IF(S30 >0,T30/S30,0)","v":{"v":299.53999999999996,"d":"299.5"}},{"$f":"VLOOKUP(A30,Formelhilfe!$A$9:$O$44,15,FALSE)","v":{"v":5,"d":"5.0"}},{"$f":"SUM(L30:Q30)","v":{"v":1497.6999999999998,"d":"1,497.7"}},{"$f":"IF(V30>0,W30/V30,0)","v":{"v":298.84285714285716,"d":"298.8"}},{"$f":"VLOOKUP(A30,Formelhilfe!$A$9:$P$44,16,FALSE)","v":{"v":7,"d":"7.0"}},{"$f":"SUM(C30:H30,L30:Q30)","v":{"v":2091.9,"d":"2,091.9"}}]
["Walker Stefan",{"$f":"VLOOKUP(A31,'Wettkampf 1'!$B$10:$C$45,2,FALSE)","v":"Börgerwald II"},{"$f":"VLOOKUP(A31,'Wettkampf 1'!$B$10:$D$45,3,FALSE)","v":{"v":0,"d":"0.0"}},{"$f":"VLOOKUP($A31,'2'!$B$10:$D$45,3,FALSE)","v":{"v":0,"d":"0.0"}},{"$f":"VLOOKUP($A31,'3'!$B$10:$D$45,3,FALSE)","v":{"v":0,"d":"0.0"}},{"$f":"VLOOKUP($A31,'4'!$B$10:$D$45,3,FALSE)","v":290.3},{"$f":"VLOOKUP($A31,'5'!$B$10:$D$45,3,FALSE)","v":287.9},{"$f":"VLOOKUP($A31,'6'!$B$10:$D$45,3,FALSE)","v":{"v":287,"d":"287.0"}},{"$f":"IF(J31 > 0,K31/J31,0)","v":{"v":288.40000000000003,"d":"288.4"}},{"$f":"VLOOKUP(A31,Formelhilfe!$A$9:$H$44,8,FALSE)","v":{"v":3,"d":"3.0"}},{"$f":"SUM(C31:H31)","v":865.2},{"$f":"VLOOKUP($A31,'7'!$B$10:$D$45,3,FALSE)","v":{"v":0,"d":"0.0"}},{"$f":"VLOOKUP($A31,'8'!$B$10:$D$45,3,FALSE)","v":{"v":0,"d":"0.0"}},{"$f":"VLOOKUP($A31,'9'!$B$10:$D$45,3,FALSE)","v":{"v":0,"d":"0.0"}},{"$f":"VLOOKUP($A31,'10'!$B$10:$D$45,3,FALSE)","v":{"v":0,"d":"0.0"}},{"$f":"VLOOKUP($A31,'11'!$B$10:$D$45,3,FALSE)","v":304.9},{"$f":"VLOOKUP($A31,'12'!$B$10:$D$45,3,FALSE)","v":302.1},{"$f":"IF(S31 >0,T31/S31,0)","v":303.5},{"$f":"VLOOKUP(A31,Formelhilfe!$A$9:$O$44,15,FALSE)","v":{"v":2,"d":"2.0"}},{"$f":"SUM(L31:Q31)","v":{"v":607,"d":"607.0"}},{"$f":"IF(V31>0,W31/V31,0)","v":{"v":294.43999999999994,"d":"294.4"}},{"$f":"VLOOKUP(A31,Formelhilfe!$A$9:$P$44,16,FALSE)","v":{"v":5,"d":"5.0"}},{"$f":"SUM(C31:H31,L31:Q31)","v":{"v":1472.1999999999998,"d":"1,472.2"}}]
["Aldfeld Helmut",{"$f":"VLOOKUP(A32,'Wettkampf 1'!$B$10:$C$45,2,FALSE)","v":"Esterwegen III"},{"$f":"VLOOKUP(A32,'Wettkampf 1'!$B$10:$D$45,3,FALSE)","v":298.7},{"$f":"VLOOKUP($A32,'2'!$B$10:$D$45,3,FALSE)","v":296.4},{"$f":"VLOOKUP($A32,'3'!$B$10:$D$45,3,FALSE)","v":{"v":0,"d":"0.0"}},{"$f":"VLOOKUP($A32,'4'!$B$10:$D$45,3,FALSE)","v":{"v":0,"d":"0.0"}},{"$f":"VLOOKUP($A32,'5'!$B$10:$D$45,3,FALSE)","v":304.6},{"$f":"VLOOKUP($A32,'6'!$B$10:$D$45,3,FALSE)","v":298.9},{"$f":"IF(J32 > 0,K32/J32,0)","v":{"v":299.65,"d":"299.7"}},{"$f":"VLOOKUP(A32,Formelhilfe!$A$9:$H$44,8,FALSE)","v":{"v":4,"d":"4.0"}},{"$f":"SUM(C32:H32)","v":{"v":1198.6,"d":"1,198.6"}},{"$f":"VLOOKUP($A32,'7'!$B$10:$D$45,3,FALSE)","v":{"v":0,"d":"0.0"}},{"$f":"VLOOKUP($A32,'8'!$B$10:$D$45,3,FALSE)","v":{"v":0,"d":"0.0"}},{"$f":"VLOOKUP($A32,'9'!$B$10:$D$45,3,FALSE)","v":{"v":0,"d":"0.0"}},{"$f":"VLOOKUP($A32,'10'!$B$10:$D$45,3,FALSE)","v":{"v":0,"d":"0.0"}},{"$f":"VLOOKUP($A32,'11'!$B$10:$D$45,3,FALSE)","v":{"v":0,"d":"0.0"}},{"$f":"VLOOKUP($A32,'12'!$B$10:$D$45,3,FALSE)","v":{"v":0,"d":"0.0"}},{"$f":"IF(S32 >0,T32/S32,0)","v":{"v":0,"d":"0.0"}},{"$f":"VLOOKUP(A32,Formelhilfe!$A$9:$O$44,15,FALSE)","v":{"v":0,"d":"0.0"}},{"$f":"SUM(L32:Q32)","v":{"v":0,"d":"0.0"}},{"$f":"IF(V32>0,W32/V32,0)","v":{"v":299.65,"d":"299.7"}},{"$f":"VLOOKUP(A32,Formelhilfe!$A$9:$P$44,16,FALSE)","v":{"v":4,"d":"4.0"}},{"$f":"SUM(C32:H32,L32:Q32)","v":{"v":1198.6,"d":"1,198.6"}}]
["Lindemann Rita",{"$f":"VLOOKUP(A33,'Wettkampf 1'!$B$10:$C$45,2,FALSE)","v":"Rastdorf III"},{"$f":"VLOOKUP(A33,'Wettkampf 1'!$B$10:$D$45,3,FALSE)","v":{"v":0,"d":"0.0"}},{"$f":"VLOOKUP($A33,'2'!$B$10:$D$45,3,FALSE)","v":{"v":0,"d":"0.0"}},{"$f":"VLOOKUP($A33,'3'!$B$10:$D$45,3,FALSE)","v":{"v":0,"d":"0.0"}},{"$f":"VLOOKUP($A33,'4'!$B$10:$D$45,3,FALSE)","v":{"v":0,"d":"0.0"}},{"$f":"VLOOKUP($A33,'5'!$B$10:$D$45,3,FALSE)","v":{"v":0,"d":"0.0"}},{"$f":"VLOOKUP($A33,'6'!$B$10:$D$45,3,FALSE)","v":{"v":0,"d":"0.0"}},{"$f":"IF(J33 > 0,K33/J33,0)","v":{"v":0,"d":"0.0"}},{"$f":"VLOOKUP(A33,Formelhilfe!$A$9:$H$44,8,FALSE)","v":{"v":0,"d":"0.0"}},{"$f":"SUM(C33:H33)","v":{"v":0,"d":"0.0"}},{"$f":"VLOOKUP($A33,'7'!$B$10:$D$45,3,FALSE)","v":317.9},{"$f":"VLOOKUP($A33,'8'!$B$10:$D$45,3,FALSE)","v":314.4},{"$f":"VLOOKUP($A33,'9'!$B$10:$D$45,3,FALSE)","v":{"v":0,"d":"0.0"}},{"$f":"VLOOKUP($A33,'10'!$B$10:$D$45,3,FALSE)","v":316.6},{"$f":"VLOOKUP($A33,'11'!$B$10:$D$45,3,FALSE)","v":{"v":0,"d":"0.0"}},{"$f":"VLOOKUP($A33,'12'!$B$10:$D$45,3,FALSE)","v":{"v":0,"d":"0.0"}},{"$f":"IF(S33 >0,T33/S33,0)","v":316.3},{"$f":"VLOOKUP(A33,Formelhilfe!$A$9:$O$44,15,FALSE)","v":{"v":3,"d":"3.0"}},{"$f":"SUM(L33:Q33)","v":948.9},{"$f":"IF(V33>0,W33/V33,0)","v":316.3},{"$f":"VLOOKUP(A33,Formelhilfe!$A$9:$P$44,16,FALSE)","v":{"v":3,"d":"3.0"}},{"$f":"SUM(C33:H33,L33:Q33)","v":948.9}]
["Heidemann Jürgen",{"$f":"VLOOKUP(A34,'Wettkampf 1'!$B$10:$C$45,2,FALSE)","v":"Esterwegen III"},{"$f":"VLOOKUP(A34,'Wettkampf 1'!$B$10:$D$45,3,FALSE)","v":305.9},{"$f":"VLOOKUP($A34,'2'!$B$10:$D$45,3,FALSE)","v":305.1},{"$f":"VLOOKUP($A34,'3'!$B$10:$D$45,3,FALSE)","v":309.3},{"$f":"VLOOKUP($A34,'4'!$B$10:$D$45,3,FALSE)","v":{"v":0,"d":"0.0"}},{"$f":"VLOOKUP($A34,'5'!$B$10:$D$45,3,FALSE)","v":{"v":0,"d":"0.0"}},{"$f":"VLOOKUP($A34,'6'!$B$10:$D$45,3,FALSE)","v":{"v":0,"d":"0.0"}},{"$f":"IF(J34 > 0,K34/J34,0)","v":{"v":306.76666666666665,"d":"306.8"}},{"$f":"VLOOKUP(A34,Formelhilfe!$A$9:$H$44,8,FALSE)","v":{"v":3,"d":"3.0"}},{"$f":"SUM(C34:H34)","v":920.3},{"$f":"VLOOKUP($A34,'7'!$B$10:$D$45,3,FALSE)","v":{"v":0,"d":"0.0"}},{"$f":"VLOOKUP($A34,'8'!$B$10:$D$45,3,FALSE)","v":{"v":0,"d":"0.0"}},{"$f":"VLOOKUP($A34,'9'!$B$10:$D$45,3,FALSE)","v":{"v":0,"d":"0.0"}},{"$f":"VLOOKUP($A34,'10'!$B$10:$D$45,3,FALSE)","v":{"v":0,"d":"0.0"}},{"$f":"VLOOKUP($A34,'11'!$B$10:$D$45,3,FALSE)","v":{"v":0,"d":"0.0"}},{"$f":"VLOOKUP($A34,'12'!$B$10:$D$45,3,FALSE)","v":{"v":0,"d":"0.0"}},{"$f":"IF(S34 >0,T34/S34,0)","v":{"v":0,"d":"0.0"}},{"$f":"VLOOKUP(A34,Formelhilfe!$A$9:$O$44,15,FALSE)","v":{"v":0,"d":"0.0"}},{"$f":"SUM(L34:Q34)","v":{"v":0,"d":"0.0"}},{"$f":"IF(V34>0,W34/V34,0)","v":{"v":306.76666666666665,"d":"306.8"}},{"$f":"VLOOKUP(A34,Formelhilfe!$A$9:$P$44,16,FALSE)","v":{"v":3,"d":"3.0"}},{"$f":"SUM(C34:H34,L34:Q34)","v":920.3}]
["Speeker Dietmar",{"$f":"VLOOKUP(A35,'Wettkampf 1'!$B$10:$C$45,2,FALSE)","v":"Börgerwald II"},{"$f":"VLOOKUP(A35,'Wettkampf 1'!$B$10:$D$45,3,FALSE)","v":302.2},{"$f":"VLOOKUP($A35,'2'!$B$10:$D$45,3,FALSE)","v":{"v":0,"d":"0.0"}},{"$f":"VLOOKUP($A35,'3'!$B$10:$D$45,3,FALSE)","v":{"v":0,"d":"0.0"}},{"$f":"VLOOKUP($A35,'4'!$B$10:$D$45,3,FALSE)","v":{"v":0,"d":"0.0"}},{"$f":"VLOOKUP($A35,'5'!$B$10:$D$45,3,FALSE)","v":{"v":0,"d":"0.0"}},{"$f":"VLOOKUP($A35,'6'!$B$10:$D$45,3,FALSE)","v":{"v":0,"d":"0.0"}},{"$f":"IF(J35 > 0,K35/J35,0)","v":302.2},{"$f":"VLOOKUP(A35,Formelhilfe!$A$9:$H$44,8,FALSE)","v":{"v":1,"d":"1.0"}},{"$f":"SUM(C35:H35)","v":302.2},{"$f":"VLOOKUP($A35,'7'!$B$10:$D$45,3,FALSE)","v":{"v":0,"d":"0.0"}},{"$f":"VLOOKUP($A35,'8'!$B$10:$D$45,3,FALSE)","v":{"v":0,"d":"0.0"}},{"$f":"VLOOKUP($A35,'9'!$B$10:$D$45,3,FALSE)","v":{"v":0,"d":"0.0"}},{"$f":"VLOOKUP($A35,'10'!$B$10:$D$45,3,FALSE)","v":{"v":0,"d":"0.0"}},{"$f":"VLOOKUP($A35,'11'!$B$10:$D$45,3,FALSE)","v":{"v":0,"d":"0.0"}},{"$f":"VLOOKUP($A35,'12'!$B$10:$D$45,3,FALSE)","v":{"v":0,"d":"0.0"}},{"$f":"IF(S35 >0,T35/S35,0)","v":{"v":0,"d":"0.0"}},{"$f":"VLOOKUP(A35,Formelhilfe!$A$9:$O$44,15,FALSE)","v":{"v":0,"d":"0.0"}},{"$f":"SUM(L35:Q35)","v":{"v":0,"d":"0.0"}},{"$f":"IF(V35>0,W35/V35,0)","v":302.2},{"$f":"VLOOKUP(A35,Formelhilfe!$A$9:$P$44,16,FALSE)","v":{"v":1,"d":"1.0"}},{"$f":"SUM(C35:H35,L35:Q35)","v":302.2}]
["Olliges Kai",{"$f":"VLOOKUP(A36,'Wettkampf 1'!$B$10:$C$45,2,FALSE)","v":"Börgerwald II"},{"$f":"VLOOKUP(A36,'Wettkampf 1'!$B$10:$D$45,3,FALSE)","v":{"v":0,"d":"0.0"}},{"$f":"VLOOKUP($A36,'2'!$B$10:$D$45,3,FALSE)","v":{"v":0,"d":"0.0"}},{"$f":"VLOOKUP($A36,'3'!$B$10:$D$45,3,FALSE)","v":{"v":0,"d":"0.0"}},{"$f":"VLOOKUP($A36,'4'!$B$10:$D$45,3,FALSE)","v":{"v":0,"d":"0.0"}},{"$f":"VLOOKUP($A36,'5'!$B$10:$D$45,3,FALSE)","v":{"v":0,"d":"0.0"}},{"$f":"VLOOKUP($A36,'6'!$B$10:$D$45,3,FALSE)","v":{"v":0,"d":"0.0"}},{"$f":"IF(J36 > 0,K36/J36,0)","v":{"v":0,"d":"0.0"}},{"$f":"VLOOKUP(A36,Formelhilfe!$A$9:$H$44,8,FALSE)","v":{"v":0,"d":"0.0"}},{"$f":"SUM(C36:H36)","v":{"v":0,"d":"0.0"}},{"$f":"VLOOKUP($A36,'7'!$B$10:$D$45,3,FALSE)","v":259.6},{"$f":"VLOOKUP($A36,'8'!$B$10:$D$45,3,FALSE)","v":{"v":0,"d":"0.0"}},{"$f":"VLOOKUP($A36,'9'!$B$10:$D$45,3,FALSE)","v":{"v":0,"d":"0.0"}},{"$f":"VLOOKUP($A36,'10'!$B$10:$D$45,3,FALSE)","v":{"v":0,"d":"0.0"}},{"$f":"VLOOKUP($A36,'11'!$B$10:$D$45,3,FALSE)","v":{"v":0,"d":"0.0"}},{"$f":"VLOOKUP($A36,'12'!$B$10:$D$45,3,FALSE)","v":{"v":0,"d":"0.0"}},{"$f":"IF(S36 >0,T36/S36,0)","v":259.6},{"$f":"VLOOKUP(A36,Formelhilfe!$A$9:$O$44,15,FALSE)","v":{"v":1,"d":"1.0"}},{"$f":"SUM(L36:Q36)","v":259.6},{"$f":"IF(V36>0,W36/V36,0)","v":259.6},{"$f":"VLOOKUP(A36,Formelhilfe!$A$9:$P$44,16,FALSE)","v":{"v":1,"d":"1.0"}},{"$f":"SUM(C36:H36,L36:Q36)","v":259.6}]
["Peters Carsten",{"$f":"VLOOKUP(A37,'Wettkampf 1'!$B$10:$C$45,2,FALSE)","v":"Neuvrees I"},{"$f":"VLOOKUP(A37,'Wettkampf 1'!$B$10:$D$45,3,FALSE)","v":{"v":0,"d":"0.0"}},{"$f":"VLOOKUP($A37,'2'!$B$10:$D$45,3,FALSE)","v":{"v":0,"d":"0.0"}},{"$f":"VLOOKUP($A37,'3'!$B$10:$D$45,3,FALSE)","v":{"v":0,"d":"0.0"}},{"$f":"VLOOKUP($A37,'4'!$B$10:$D$45,3,FALSE)","v":{"v":0,"d":"0.0"}},{"$f":"VLOOKUP($A37,'5'!$B$10:$D$45,3,FALSE)","v":{"v":0,"d":"0.0"}},{"$f":"VLOOKUP($A37,'6'!$B$10:$D$45,3,FALSE)","v":{"v":0,"d":"0.0"}},{"$f":"IF(J37 > 0,K37/J37,0)","v":{"v":0,"d":"0.0"}},{"$f":"VLOOKUP(A37,Formelhilfe!$A$9:$H$44,8,FALSE)","v":{"v":0,"d":"0.0"}},{"$f":"SUM(C37:H37)","v":{"v":0,"d":"0.0"}},{"$f":"VLOOKUP($A37,'7'!$B$10:$D$45,3,FALSE)","v":{"v":0,"d":"0.0"}},{"$f":"VLOOKUP($A37,'8'!$B$10:$D$45,3,FALSE)","v":{"v":0,"d":"0.0"}},{"$f":"VLOOKUP($A37,'9'!$B$10:$D$45,3,FALSE)","v":{"v":0,"d":"0.0"}},{"$f":"VLOOKUP($A37,'10'!$B$10:$D$45,3,FALSE)","v":{"v":0,"d":"0.0"}},{"$f":"VLOOKUP($A37,'11'!$B$10:$D$45,3,FALSE)","v":{"v":0,"d":"0.0"}},{"$f":"VLOOKUP($A37,'12'!$B$10:$D$45,3,FALSE)","v":{"v":0,"d":"0.0"}},{"$f":"IF(S37 >0,T37/S37,0)","v":{"v":0,"d":"0.0"}},{"$f":"VLOOKUP(A37,Formelhilfe!$A$9:$O$44,15,FALSE)","v":{"v":0,"d":"0.0"}},{"$f":"SUM(L37:Q37)","v":{"v":0,"d":"0.0"}},{"$f":"IF(V37>0,W37/V37,0)","v":{"v":0,"d":"0.0"}},{"$f":"VLOOKUP(A37,Formelhilfe!$A$9:$P$44,16,FALSE)","v":{"v":0,"d":"0.0"}},{"$f":"SUM(C37:H37,L37:Q37)","v":{"v":0,"d":"0.0"}}]

{"sheet":"Formelhilfe","index":16,"n_rows":45,"n_cols":21,"rows_kept":45,"hidden":true}
[null,1,2,3,4,5,6,"Hinrunde Schnitt",7,8,9,10,11,12,"Rückrunde Schnitt","Gesamt Schnitt",null,null,"Kreisoberliga","Schützen","2023/2024"]
[{"$f":"'Wettkampf 1'!B2","v":"Neuvrees I"},{"$f":"IF('Wettkampf 1'!D2>0,1,0)","v":1},{"$f":"IF('2'!$D2>0,1,0)","v":1},{"$f":"IF('3'!$D2>0,1,0)","v":1},{"$f":"IF('4'!$D2>0,1,0)","v":1},{"$f":"IF('5'!$D2>0,1,0)","v":1},{"$f":"IF('6'!$D2>0,1,0)","v":1},{"$f":"SUM(B2:G2)","v":6},{"$f":"IF('7'!$D2>0,1,0)","v":1},{"$f":"IF('8'!$D2>0,1,0)","v":1},{"$f":"IF('9'!$D2>0,1,0)","v":1},{"$f":"IF('10'!$D2>0,1,0)","v":1},{"$f":"IF('11'!$D2>0,1,0)","v":1},{"$f":"IF('12'!$D2>0,1,0)","v":1},{"$f":"SUM(I2:N2)","v":6},{"$f":"O2+H2","v":12},null,null,"1. Kreisliga","Damen","2024/2025"]
[{"$f":"'Wettkampf 1'!B3","v":"Rastdorf III"},{"$f":"IF('Wettkampf 1'!D3>0,1,0)","v":1},{"$f":"IF('2'!$D3>0,1,0)","v":1},{"$f":"IF('3'!$D3>0,1,0)","v":1},{"$f":"IF('4'!$D3>0,1,0)","v":1},{"$f":"IF('5'!$D3>0,1,0)","v":1},{"$f":"IF('6'!$D3>0,1,0)","v":1},{"$f":"SUM(B3:G3)","v":6},{"$f":"IF('7'!$D3>0,1,0)","v":1},{"$f":"IF('8'!$D3>0,1,0)","v":1},{"$f":"IF('9'!$D3>0,1,0)","v":1},{"$f":"IF('10'!$D3>0,1,0)","v":1},{"$f":"IF('11'!$D3>0,1,0)","v":1},{"$f":"IF('12'!$D3>0,1,0)","v":1},{"$f":"SUM(I3:N3)","v":6},{"$f":"O3+H3","v":12},null,null,"2. Kreisliga","Altersgruppe","2025/2026"]
[{"$f":"'Wettkampf 1'!B4","v":"Börger II"},{"$f":"IF('Wettkampf 1'!D4>0,1,0)","v":1},{"$f":"IF('2'!$D4>0,1,0)","v":1},{"$f":"IF('3'!$D4>0,1,0)","v":1},{"$f":"IF('4'!$D4>0,1,0)","v":1},{"$f":"IF('5'!$D4>0,1,0)","v":1},{"$f":"IF('6'!$D4>0,1,0)","v":1},6,{"$f":"IF('7'!$D4>0,1,0)","v":1},{"$f":"IF('8'!$D4>0,1,0)","v":1},{"$f":"IF('9'!$D4>0,1,0)","v":1},{"$f":"IF('10'!$D4>0,1,0)","v":1},{"$f":"IF('11'!$D4>0,1,0)","v":1},{"$f":"IF('12'!$D4>0,1,0)","v":1},6,12,null,null,"1. Kreisklasse","Senioren","2026/2027"]
[{"$f":"'Wettkampf 1'!B5","v":"Esterwegen III"},{"$f":"IF('Wettkampf 1'!D5>0,1,0)","v":1},{"$f":"IF('2'!$D5>0,1,0)","v":1},{"$f":"IF('3'!$D5>0,1,0)","v":1},{"$f":"IF('4'!$D5>0,1,0)","v":1},{"$f":"IF('5'!$D5>0,1,0)","v":1},{"$f":"IF('6'!$D5>0,1,0)","v":1},6,{"$f":"IF('7'!$D5>0,1,0)","v":1},{"$f":"IF('8'!$D5>0,1,0)","v":1},{"$f":"IF('9'!$D5>0,1,0)","v":1},{"$f":"IF('10'!$D5>0,1,0)","v":1},{"$f":"IF('11'!$D5>0,1,0)","v":1},{"$f":"IF('12'!$D5>0,1,0)","v":1},6,12,null,null,"2. Kreisklasse","Jugend","2027/2028"]
[{"$f":"'Wettkampf 1'!B6","v":"Börgerwald II"},{"$f":"IF('Wettkampf 1'!D6>0,1,0)","v":1},{"$f":"IF('2'!$D6>0,1,0)","v":1},{"$f":"IF('3'!$D6>0,1,0)","v":1},{"$f":"IF('4'!$D6>0,1,0)","v":1},{"$f":"IF('5'!$D6>0,1,0)","v":1},{"$f":"IF('6'!$D6>0,1,0)","v":1},6,{"$f":"IF('7'!$D6>0,1,0)","v":1},{"$f":"IF('8'!$D6>0,1,0)","v":1},{"$f":"IF('9'!$D6>0,1,0)","v":1},{"$f":"IF('10'!$D6>0,1,0)","v":1},{"$f":"IF('11'!$D6>0,1,0)","v":1},{"$f":"IF('12'!$D6>0,1,0)","v":1},6,12,null,null,"3. Kreisklasse","Schüler","2028/2029"]
[{"$f":"'Wettkampf 1'!B7","v":"Spahnharrenstätte II"},{"$f":"IF('Wettkampf 1'!D7>0,1,0)","v":1},{"$f":"IF('2'!$D7>0,1,0)","v":1},{"$f":"IF('3'!$D7>0,1,0)","v":1},{"$f":"IF('4'!$D7>0,1,0)","v":1},{"$f":"IF('5'!$D7>0,1,0)","v":1},{"$f":"IF('6'!$D7>0,1,0)","v":1},6,{"$f":"IF('7'!$D7>0,1,0)","v":1},{"$f":"IF('8'!$D7>0,1,0)","v":1},{"$f":"IF('9'!$D7>0,1,0)","v":1},{"$f":"IF('10'!$D7>0,1,0)","v":1},{"$f":"IF('11'!$D7>0,1,0)","v":1},{"$f":"IF('12'!$D7>0,1,0)","v":1},6,12,null,null,"4. Kreisklasse","offene Klasse FHLG","2039/2030"]
[{"$nulls":18},"5. Kreisklasse","Luftpistole"]
["Rolfes Wilhelm",{"$f":"IF('Wettkampf 1'!D10>0,1,0)","v":1},{"$f":"IF('2'!$D10>0,1,0)","v":1},{"$f":"IF('3'!$D10>0,1,0)","v":1},{"$f":"IF('4'!$D10>0,1,0)","v":1},{"$f":"IF('5'!$D10>0,1,0)","v":1},{"$f":"IF('6'!$D10>0,1,0)","v":1},6,{"$f":"IF('7'!$D10>0,1,0)","v":1},{"$f":"IF('8'!$D10>0,1,0)","v":1},{"$f":"IF('9'!$D10>0,1,0)","v":1},{"$f":"IF('10'!$D10>0,1,0)","v":1},{"$f":"IF('11'!$D10>0,1,0)","v":1},{"$f":"IF('12'!$D10>0,1,0)","v":1},6,{"$f":"O9+H9","v":12},null,null,"6. Kreisklasse"]
["Steenken Klaus",{"$f":"IF('Wettkampf 1'!D11>0,1,0)","v":1},{"$f":"IF('2'!$D11>0,1,0)","v":1},{"$f":"IF('3'!$D11>0,1,0)","v":1},{"$f":"IF('4'!$D11>0,1,0)","v":1},{"$f":"IF('5'!$D11>0,1,0)","v":1},{"$f":"IF('6'!$D11>0,1,0)","v":1},6,{"$f":"IF('7'!$D11>0,1,0)","v":1},{"$f":"IF('8'!$D11>0,1,0)","v":1},{"$f":"IF('9'!$D11>0,1,0)","v":1},{"$f":"IF('10'!$D11>0,1,0)","v":1},{"$f":"IF('11'!$D11>0,1,0)","v":1},{"$f":"IF('12'!$D11>0,1,0)","v":1},6,{"$f":"O10+H10","v":12},null,null,"7. Kreisklasse"]
["Breyer Wilfried",{"$f":"IF('Wettkampf 1'!D12>0,1,0)","v":1},{"$f":"IF('2'!$D12>0,1,0)","v":1},{"$f":"IF('3'!$D12>0,1,0)","v":1},{"$f":"IF('4'!$D12>0,1,0)","v":1},{"$f":"IF('5'!$D12>0,1,0)","v":1},{"$f":"IF('6'!$D12>0,1,0)","v":1},6,{"$f":"IF('7'!$D12>0,1,0)","v":1},{"$f":"IF('8'!$D12>0,1,0)","v":1},{"$f":"IF('9'!$D12>0,1,0)","v":1},{"$f":"IF('10'!$D12>0,1,0)","v":1},{"$f":"IF('11'!$D12>0,1,0)","v":1},{"$f":"IF('12'!$D12>0,1,0)","v":1},6,12]
["Janßen Markus",{"$f":"IF('Wettkampf 1'!D13>0,1,0)","v":1},{"$f":"IF('2'!$D13>0,1,0)","v":1},{"$f":"IF('3'!$D13>0,1,0)","v":1},{"$f":"IF('4'!$D13>0,1,0)","v":1},{"$f":"IF('5'!$D13>0,1,0)","v":1},{"$f":"IF('6'!$D13>0,1,0)","v":1},6,{"$f":"IF('7'!$D13>0,1,0)","v":1},{"$f":"IF('8'!$D13>0,1,0)","v":1},{"$f":"IF('9'!$D13>0,1,0)","v":1},{"$f":"IF('10'!$D13>0,1,0)","v":1},{"$f":"IF('11'!$D13>0,1,0)","v":1},{"$f":"IF('12'!$D13>0,1,0)","v":1},6,12]
["Thyen Werner",{"$f":"IF('Wettkampf 1'!D14>0,1,0)","v":1},{"$f":"IF('2'!$D14>0,1,0)","v":1},{"$f":"IF('3'!$D14>0,1,0)","v":1},{"$f":"IF('4'!$D14>0,1,0)","v":1},{"$f":"IF('5'!$D14>0,1,0)","v":1},{"$f":"IF('6'!$D14>0,1,0)","v":1},6,{"$f":"IF('7'!$D14>0,1,0)","v":1},{"$f":"IF('8'!$D14>0,1,0)","v":1},{"$f":"IF('9'!$D14>0,1,0)","v":1},{"$f":"IF('10'!$D14>0,1,0)","v":1},{"$f":"IF('11'!$D14>0,1,0)","v":1},{"$f":"IF('12'!$D14>0,1,0)","v":1},6,12]
["Peters Carsten",{"$f":"IF('Wettkampf 1'!D15>0,1,0)","v":0},{"$f":"IF('2'!$D15>0,1,0)","v":0},{"$f":"IF('3'!$D15>0,1,0)","v":0},{"$f":"IF('4'!$D15>0,1,0)","v":0},{"$f":"IF('5'!$D15>0,1,0)","v":0},{"$f":"IF('6'!$D15>0,1,0)","v":0},0,{"$f":"IF('7'!$D15>0,1,0)","v":0},{"$f":"IF('8'!$D15>0,1,0)","v":0},{"$f":"IF('9'!$D15>0,1,0)","v":0},{"$f":"IF('10'!$D15>0,1,0)","v":0},{"$f":"IF('11'!$D15>0,1,0)","v":0},{"$f":"IF('12'!$D15>0,1,0)","v":0},0,0]
["Wotte Robert",{"$f":"IF('Wettkampf 1'!D16>0,1,0)","v":1},{"$f":"IF('2'!$D16>0,1,0)","v":1},{"$f":"IF('3'!$D16>0,1,0)","v":1},{"$f":"IF('4'!$D16>0,1,0)","v":1},{"$f":"IF('5'!$D16>0,1,0)","v":1},{"$f":"IF('6'!$D16>0,1,0)","v":1},6,{"$f":"IF('7'!$D16>0,1,0)","v":1},{"$f":"IF('8'!$D16>0,1,0)","v":1},{"$f":"IF('9'!$D16>0,1,0)","v":1},{"$f":"IF('10'!$D16>0,1,0)","v":1},{"$f":"IF('11'!$D16>0,1,0)","v":1},{"$f":"IF('12'!$D16>0,1,0)","v":1},6,12]
["Müller Helmut",{"$f":"IF('Wettkampf 1'!D17>0,1,0)","v":1},{"$f":"IF('2'!$D17>0,1,0)","v":1},{"$f":"IF('3'!$D17>0,1,0)","v":1},{"$f":"IF('4'!$D17>0,1,0)","v":1},{"$f":"IF('5'!$D17>0,1,0)","v":1},{"$f":"IF('6'!$D17>0,1,0)","v":1},6,{"$f":"IF('7'!$D17>0,1,0)","v":1},{"$f":"IF('8'!$D17>0,1,0)","v":1},{"$f":"IF('9'!$D17>0,1,0)","v":1},{"$f":"IF('10'!$D17>0,1,0)","v":1},{"$f":"IF('11'!$D17>0,1,0)","v":1},{"$f":"IF('12'!$D17>0,1,0)","v":1},6,12]
["Bookjans Günther",{"$f":"IF('Wettkampf 1'!D18>0,1,0)","v":1},{"$f":"IF('2'!$D18>0,1,0)","v":1},{"$f":"IF('3'!$D18>0,1,0)","v":1},{"$f":"IF('4'!$D18>0,1,0)","v":1},{"$f":"IF('5'!$D18>0,1,0)","v":1},{"$f":"IF('6'!$D18>0,1,0)","v":1},6,{"$f":"IF('7'!$D18>0,1,0)","v":1},{"$f":"IF('8'!$D18>0,1,0)","v":1},{"$f":"IF('9'!$D18>0,1,0)","v":1},{"$f":"IF('10'!$D18>0,1,0)","v":1},{"$f":"IF('11'!$D18>0,1,0)","v":1},{"$f":"IF('12'!$D18>0,1,0)","v":1},6,12]
["Meer Michael",{"$f":"IF('Wettkampf 1'!D19>0,1,0)","v":1},{"$f":"IF('2'!$D19>0,1,0)","v":1},{"$f":"IF('3'!$D19>0,1,0)","v":1},{"$f":"IF('4'!$D19>0,1,0)","v":1},{"$f":"IF('5'!$D19>0,1,0)","v":1},{"$f":"IF('6'!$D19>0,1,0)","v":1},6,{"$f":"IF('7'!$D19>0,1,0)","v":1},{"$f":"IF('8'!$D19>0,1,0)","v":1},{"$f":"IF('9'!$D19>0,1,0)","v":1},{"$f":"IF('10'!$D19>0,1,0)","v":1},{"$f":"IF('11'!$D19>0,1,0)","v":1},{"$f":"IF('12'!$D19>0,1,0)","v":1},6,12]
["Lindemann Rita",{"$f":"IF('Wettkampf 1'!D20>0,1,0)","v":0},{"$f":"IF('2'!$D20>0,1,0)","v":0},{"$f":"IF('3'!$D20>0,1,0)","v":0},{"$f":"IF('4'!$D20>0,1,0)","v":0},{"$f":"IF('5'!$D20>0,1,0)","v":0},{"$f":"IF('6'!$D20>0,1,0)","v":0},0,{"$f":"IF('7'!$D20>0,1,0)","v":1},{"$f":"IF('8'!$D20>0,1,0)","v":1},{"$f":"IF('9'!$D20>0,1,0)","v":0},{"$f":"IF('10'!$D20>0,1,0)","v":1},{"$f":"IF('11'!$D20>0,1,0)","v":0},{"$f":"IF('12'!$D20>0,1,0)","v":0},3,3]
["Olliges Kai",{"$f":"IF('Wettkampf 1'!D21>0,1,0)","v":0},{"$f":"IF('2'!$D21>0,1,0)","v":0},{"$f":"IF('3'!$D21>0,1,0)","v":0},{"$f":"IF('4'!$D21>0,1,0)","v":0},{"$f":"IF('5'!$D21>0,1,0)","v":0},{"$f":"IF('6'!$D21>0,1,0)","v":0},0,{"$f":"IF('7'!$D21>0,1,0)","v":1},{"$f":"IF('8'!$D21>0,1,0)","v":0},{"$f":"IF('9'!$D21>0,1,0)","v":0},{"$f":"IF('10'!$D21>0,1,0)","v":0},{"$f":"IF('11'!$D21>0,1,0)","v":0},{"$f":"IF('12'!$D21>0,1,0)","v":0},1,1]
["Zdralik Ingo",{"$f":"IF('Wettkampf 1'!D22>0,1,0)","v":1},{"$f":"IF('2'!$D22>0,1,0)","v":1},{"$f":"IF('3'!$D22>0,1,0)","v":1},{"$f":"IF('4'!$D22>0,1,0)","v":1},{"$f":"IF('5'!$D22>0,1,0)","v":1},{"$f":"IF('6'!$D22>0,1,0)","v":1},6,{"$f":"IF('7'!$D22>0,1,0)","v":1},{"$f":"IF('8'!$D22>0,1,0)","v":1},{"$f":"IF('9'!$D22>0,1,0)","v":1},{"$f":"IF('10'!$D22>0,1,0)","v":1},{"$f":"IF('11'!$D22>0,1,0)","v":1},{"$f":"IF('12'!$D22>0,1,0)","v":1},6,12]
["Goldenstein Uwe",{"$f":"IF('Wettkampf 1'!D23>0,1,0)","v":1},{"$f":"IF('2'!$D23>0,1,0)","v":1},{"$f":"IF('3'!$D23>0,1,0)","v":1},{"$f":"IF('4'!$D23>0,1,0)","v":1},{"$f":"IF('5'!$D23>0,1,0)","v":1},{"$f":"IF('6'!$D23>0,1,0)","v":1},6,{"$f":"IF('7'!$D23>0,1,0)","v":1},{"$f":"IF('8'!$D23>0,1,0)","v":1},{"$f":"IF('9'!$D23>0,1,0)","v":1},{"$f":"IF('10'!$D23>0,1,0)","v":1},{"$f":"IF('11'!$D23>0,1,0)","v":1},{"$f":"IF('12'!$D23>0,1,0)","v":1},6,12]
["Eckmann Mark",{"$f":"IF('Wettkampf 1'!D24>0,1,0)","v":1},{"$f":"IF('2'!$D24>0,1,0)","v":1},{"$f":"IF('3'!$D24>0,1,0)","v":1},{"$f":"IF('4'!$D24>0,1,0)","v":1},{"$f":"IF('5'!$D24>0,1,0)","v":1},{"$f":"IF('6'!$D24>0,1,0)","v":1},6,{"$f":"IF('7'!$D24>0,1,0)","v":1},{"$f":"IF('8'!$D24>0,1,0)","v":0},{"$f":"IF('9'!$D24>0,1,0)","v":1},{"$f":"IF('10'!$D24>0,1,0)","v":1},{"$f":"IF('11'!$D24>0,1,0)","v":1},{"$f":"IF('12'!$D24>0,1,0)","v":1},5,11]
["Schulz Simon",{"$f":"IF('Wettkampf 1'!D25>0,1,0)","v":1},{"$f":"IF('2'!$D25>0,1,0)","v":1},{"$f":"IF('3'!$D25>0,1,0)","v":1},{"$f":"IF('4'!$D25>0,1,0)","v":1},{"$f":"IF('5'!$D25>0,1,0)","v":1},{"$f":"IF('6'!$D25>0,1,0)","v":1},6,{"$f":"IF('7'!$D25>0,1,0)","v":1},{"$f":"IF('8'!$D25>0,1,0)","v":1},{"$f":"IF('9'!$D25>0,1,0)","v":1},{"$f":"IF('10'!$D25>0,1,0)","v":0},{"$f":"IF('11'!$D25>0,1,0)","v":1},{"$f":"IF('12'!$D25>0,1,0)","v":1},5,11]
["Schwarte Hermann",{"$f":"IF('Wettkampf 1'!D26>0,1,0)","v":1},{"$f":"IF('2'!$D26>0,1,0)","v":1},{"$f":"IF('3'!$D26>0,1,0)","v":1},{"$f":"IF('4'!$D26>0,1,0)","v":1},{"$f":"IF('5'!$D26>0,1,0)","v":1},{"$f":"IF('6'!$D26>0,1,0)","v":0},5,{"$f":"IF('7'!$D26>0,1,0)","v":1},{"$f":"IF('8'!$D26>0,1,0)","v":1},{"$f":"IF('9'!$D26>0,1,0)","v":1},{"$f":"IF('10'!$D26>0,1,0)","v":0},{"$f":"IF('11'!$D26>0,1,0)","v":1},{"$f":"IF('12'!$D26>0,1,0)","v":0},4,9]
["Jungsthoefel Markus",{"$f":"IF('Wettkampf 1'!D27>0,1,0)","v":1},{"$f":"IF('2'!$D27>0,1,0)","v":1},{"$f":"IF('3'!$D27>0,1,0)","v":1},{"$f":"IF('4'!$D27>0,1,0)","v":1},{"$f":"IF('5'!$D27>0,1,0)","v":1},{"$f":"IF('6'!$D27>0,1,0)","v":1},6,{"$f":"IF('7'!$D27>0,1,0)","v":1},{"$f":"IF('8'!$D27>0,1,0)","v":1},{"$f":"IF('9'!$D27>0,1,0)","v":1},{"$f":"IF('10'!$D27>0,1,0)","v":1},{"$f":"IF('11'!$D27>0,1,0)","v":1},{"$f":"IF('12'!$D27>0,1,0)","v":1},6,12]
["Aldfeld Helmut",{"$f":"IF('Wettkampf 1'!D28>0,1,0)","v":1},{"$f":"IF('2'!$D28>0,1,0)","v":1},{"$f":"IF('3'!$D28>0,1,0)","v":0},{"$f":"IF('4'!$D28>0,1,0)","v":0},{"$f":"IF('5'!$D28>0,1,0)","v":1},{"$f":"IF('6'!$D28>0,1,0)","v":1},4,{"$f":"IF('7'!$D28>0,1,0)","v":0},{"$f":"IF('8'!$D28>0,1,0)","v":0},{"$f":"IF('9'!$D28>0,1,0)","v":0},{"$f":"IF('10'!$D28>0,1,0)","v":0},{"$f":"IF('11'!$D28>0,1,0)","v":0},{"$f":"IF('12'!$D28>0,1,0)","v":0},0,4]
["Schulte Mathias",{"$f":"IF('Wettkampf 1'!D29>0,1,0)","v":1},{"$f":"IF('2'!$D29>0,1,0)","v":1},{"$f":"IF('3'!$D29>0,1,0)","v":1},{"$f":"IF('4'!$D29>0,1,0)","v":1},{"$f":"IF('5'!$D29>0,1,0)","v":1},{"$f":"IF('6'!$D29>0,1,0)","v":1},6,{"$f":"IF('7'!$D29>0,1,0)","v":1},{"$f":"IF('8'!$D29>0,1,0)","v":1},{"$f":"IF('9'!$D29>0,1,0)","v":1},{"$f":"IF('10'!$D29>0,1,0)","v":1},{"$f":"IF('11'!$D29>0,1,0)","v":1},{"$f":"IF('12'!$D29>0,1,0)","v":1},6,12]
["Middendorf Peter",{"$f":"IF('Wettkampf 1'!D30>0,1,0)","v":1},{"$f":"IF('2'!$D30>0,1,0)","v":1},{"$f":"IF('3'!$D30>0,1,0)","v":1},{"$f":"IF('4'!$D30>0,1,0)","v":1},{"$f":"IF('5'!$D30>0,1,0)","v":1},{"$f":"IF('6'!$D30>0,1,0)","v":1},6,{"$f":"IF('7'!$D30>0,1,0)","v":1},{"$f":"IF('8'!$D30>0,1,0)","v":1},{"$f":"IF('9'!$D30>0,1,0)","v":1},{"$f":"IF('10'!$D30>0,1,0)","v":1},{"$f":"IF('11'!$D30>0,1,0)","v":1},{"$f":"IF('12'!$D30>0,1,0)","v":1},6,12]
["Meibers Michael",{"$f":"IF('Wettkampf 1'!D31>0,1,0)","v":1},{"$f":"IF('2'!$D31>0,1,0)","v":1},{"$f":"IF('3'!$D31>0,1,0)","v":1},{"$f":"IF('4'!$D31>0,1,0)","v":1},{"$f":"IF('5'!$D31>0,1,0)","v":1},{"$f":"IF('6'!$D31>0,1,0)","v":1},6,{"$f":"IF('7'!$D31>0,1,0)","v":1},{"$f":"IF('8'!$D31>0,1,0)","v":1},{"$f":"IF('9'!$D31>0,1,0)","v":1},{"$f":"IF('10'!$D31>0,1,0)","v":1},{"$f":"IF('11'!$D31>0,1,0)","v":1},{"$f":"IF('12'!$D31>0,1,0)","v":1},6,12]
["Heidemann Jürgen",{"$f":"IF('Wettkampf 1'!D32>0,1,0)","v":1},{"$f":"IF('2'!$D32>0,1,0)","v":1},{"$f":"IF('3'!$D32>0,1,0)","v":1},{"$f":"IF('4'!$D32>0,1,0)","v":0},{"$f":"IF('5'!$D32>0,1,0)","v":0},{"$f":"IF('6'!$D32>0,1,0)","v":0},3,{"$f":"IF('7'!$D32>0,1,0)","v":0},{"$f":"IF('8'!$D32>0,1,0)","v":0},{"$f":"IF('9'!$D32>0,1,0)","v":0},{"$f":"IF('10'!$D32>0,1,0)","v":0},{"$f":"IF('11'!$D32>0,1,0)","v":0},{"$f":"IF('12'!$D32>0,1,0)","v":0},0,3]
["Lindemann Gerd",{"$f":"IF('Wettkampf 1'!D33>0,1,0)","v":1},{"$f":"IF('2'!$D33>0,1,0)","v":1},{"$f":"IF('3'!$D33>0,1,0)","v":1},{"$f":"IF('4'!$D33>0,1,0)","v":1},{"$f":"IF('5'!$D33>0,1,0)","v":0},{"$f":"IF('6'!$D33>0,1,0)","v":0},4,{"$f":"IF('7'!$D33>0,1,0)","v":0},{"$f":"IF('8'!$D33>0,1,0)","v":0},{"$f":"IF('9'!$D33>0,1,0)","v":1},{"$f":"IF('10'!$D33>0,1,0)","v":1},{"$f":"IF('11'!$D33>0,1,0)","v":1},{"$f":"IF('12'!$D33>0,1,0)","v":1},4,8]
["Hanenkamp Andre",{"$f":"IF('Wettkampf 1'!D34>0,1,0)","v":1},{"$f":"IF('2'!$D34>0,1,0)","v":1},{"$f":"IF('3'!$D34>0,1,0)","v":1},{"$f":"IF('4'!$D34>0,1,0)","v":1},{"$f":"IF('5'!$D34>0,1,0)","v":1},{"$f":"IF('6'!$D34>0,1,0)","v":1},6,{"$f":"IF('7'!$D34>0,1,0)","v":1},{"$f":"IF('8'!$D34>0,1,0)","v":1},{"$f":"IF('9'!$D34>0,1,0)","v":1},{"$f":"IF('10'!$D34>0,1,0)","v":1},{"$f":"IF('11'!$D34>0,1,0)","v":1},{"$f":"IF('12'!$D34>0,1,0)","v":1},6,12]
["Antons Mathias",{"$f":"IF('Wettkampf 1'!D35>0,1,0)","v":1},{"$f":"IF('2'!$D35>0,1,0)","v":1},{"$f":"IF('3'!$D35>0,1,0)","v":1},{"$f":"IF('4'!$D35>0,1,0)","v":1},{"$f":"IF('5'!$D35>0,1,0)","v":1},{"$f":"IF('6'!$D35>0,1,0)","v":1},6,{"$f":"IF('7'!$D35>0,1,0)","v":1},{"$f":"IF('8'!$D35>0,1,0)","v":1},{"$f":"IF('9'!$D35>0,1,0)","v":1},{"$f":"IF('10'!$D35>0,1,0)","v":1},{"$f":"IF('11'!$D35>0,1,0)","v":1},{"$f":"IF('12'!$D35>0,1,0)","v":1},6,12]
["Schröer Friedhelm",{"$f":"IF('Wettkampf 1'!D36>0,1,0)","v":1},{"$f":"IF('2'!$D36>0,1,0)","v":1},{"$f":"IF('3'!$D36>0,1,0)","v":1},{"$f":"IF('4'!$D36>0,1,0)","v":1},{"$f":"IF('5'!$D36>0,1,0)","v":1},{"$f":"IF('6'!$D36>0,1,0)","v":1},6,{"$f":"IF('7'!$D36>0,1,0)","v":1},{"$f":"IF('8'!$D36>0,1,0)","v":1},{"$f":"IF('9'!$D36>0,1,0)","v":1},{"$f":"IF('10'!$D36>0,1,0)","v":1},{"$f":"IF('11'!$D36>0,1,0)","v":1},{"$f":"IF('12'!$D36>0,1,0)","v":1},6,12]
["Sebers Tobias",{"$f":"IF('Wettkampf 1'!D37>0,1,0)","v":1},{"$f":"IF('2'!$D37>0,1,0)","v":1},{"$f":"IF('3'!$D37>0,1,0)","v":1},{"$f":"IF('4'!$D37>0,1,0)","v":1},{"$f":"IF('5'!$D37>0,1,0)","v":1},{"$f":"IF('6'!$D37>0,1,0)","v":1},6,{"$f":"IF('7'!$D37>0,1,0)","v":1},{"$f":"IF('8'!$D37>0,1,0)","v":1},{"$f":"IF('9'!$D37>0,1,0)","v":1},{"$f":"IF('10'!$D37>0,1,0)","v":1},{"$f":"IF('11'!$D37>0,1,0)","v":1},{"$f":"IF('12'!$D37>0,1,0)","v":1},6,12]
["Hanneken Moritz",{"$f":"IF('Wettkampf 1'!D38>0,1,0)","v":1},{"$f":"IF('2'!$D38>0,1,0)","v":1},{"$f":"IF('3'!$D38>0,1,0)","v":1},{"$f":"IF('4'!$D38>0,1,0)","v":1},{"$f":"IF('5'!$D38>0,1,0)","v":1},{"$f":"IF('6'!$D38>0,1,0)","v":1},6,{"$f":"IF('7'!$D38>0,1,0)","v":1},{"$f":"IF('8'!$D38>0,1,0)","v":1},{"$f":"IF('9'!$D38>0,1,0)","v":1},{"$f":"IF('10'!$D38>0,1,0)","v":1},{"$f":"IF('11'!$D38>0,1,0)","v":1},{"$f":"IF('12'!$D38>0,1,0)","v":1},6,12]
["Speeker Dietmar",{"$f":"IF('Wettkampf 1'!D39>0,1,0)","v":1},{"$f":"IF('2'!$D39>0,1,0)","v":0},{"$f":"IF('3'!$D39>0,1,0)","v":0},{"$f":"IF('4'!$D39>0,1,0)","v":0},{"$f":"IF('5'!$D39>0,1,0)","v":0},{"$f":"IF('6'!$D39>0,1,0)","v":0},1,{"$f":"IF('7'!$D39>0,1,0)","v":0},{"$f":"IF('8'!$D39>0,1,0)","v":0},{"$f":"IF('9'!$D39>0,1,0)","v":0},{"$f":"IF('10'!$D39>0,1,0)","v":0},{"$f":"IF('11'!$D39>0,1,0)","v":0},{"$f":"IF('12'!$D39>0,1,0)","v":0},0,1]
["Will Achim",{"$f":"IF('Wettkampf 1'!D40>0,1,0)","v":1},{"$f":"IF('2'!$D40>0,1,0)","v":1},{"$f":"IF('3'!$D40>0,1,0)","v":1},{"$f":"IF('4'!$D40>0,1,0)","v":1},{"$f":"IF('5'!$D40>0,1,0)","v":1},{"$f":"IF('6'!$D40>0,1,0)","v":1},6,{"$f":"IF('7'!$D40>0,1,0)","v":1},{"$f":"IF('8'!$D40>0,1,0)","v":1},{"$f":"IF('9'!$D40>0,1,0)","v":1},{"$f":"IF('10'!$D40>0,1,0)","v":1},{"$f":"IF('11'!$D40>0,1,0)","v":1},{"$f":"IF('12'!$D40>0,1,0)","v":1},6,{"$f":"O39+H39","v":12}]
["Meyer Dirk",{"$f":"IF('Wettkampf 1'!D41>0,1,0)","v":1},{"$f":"IF('2'!$D41>0,1,0)","v":1},{"$f":"IF('3'!$D41>0,1,0)","v":1},{"$f":"IF('4'!$D41>0,1,0)","v":1},{"$f":"IF('5'!$D41>0,1,0)","v":1},{"$f":"IF('6'!$D41>0,1,0)","v":1},6,{"$f":"IF('7'!$D41>0,1,0)","v":1},{"$f":"IF('8'!$D41>0,1,0)","v":1},{"$f":"IF('9'!$D41>0,1,0)","v":0},{"$f":"IF('10'!$D41>0,1,0)","v":1},{"$f":"IF('11'!$D41>0,1,0)","v":1},{"$f":"IF('12'!$D41>0,1,0)","v":1},5,11]
["Micksch Heiko",{"$f":"IF('Wettkampf 1'!D42>0,1,0)","v":1},{"$f":"IF('2'!$D42>0,1,0)","v":1},{"$f":"IF('3'!$D42>0,1,0)","v":1},{"$f":"IF('4'!$D42>0,1,0)","v":1},{"$f":"IF('5'!$D42>0,1,0)","v":1},{"$f":"IF('6'!$D42>0,1,0)","v":1},6,{"$f":"IF('7'!$D42>0,1,0)","v":1},{"$f":"IF('8'!$D42>0,1,0)","v":1},{"$f":"IF('9'!$D42>0,1,0)","v":1},{"$f":"IF('10'!$D42>0,1,0)","v":1},{"$f":"IF('11'!$D42>0,1,0)","v":1},{"$f":"IF('12'!$D42>0,1,0)","v":1},6,12]
["Hahnenkamp Ulrich",{"$f":"IF('Wettkampf 1'!D43>0,1,0)","v":0},{"$f":"IF('2'!$D43>0,1,0)","v":1},{"$f":"IF('3'!$D43>0,1,0)","v":0},{"$f":"IF('4'!$D43>0,1,0)","v":1},{"$f":"IF('5'!$D43>0,1,0)","v":1},{"$f":"IF('6'!$D43>0,1,0)","v":0},3,{"$f":"IF('7'!$D43>0,1,0)","v":1},{"$f":"IF('8'!$D43>0,1,0)","v":1},{"$f":"IF('9'!$D43>0,1,0)","v":1},{"$f":"IF('10'!$D43>0,1,0)","v":1},{"$f":"IF('11'!$D43>0,1,0)","v":1},{"$f":"IF('12'!$D43>0,1,0)","v":1},6,9]
["Hahnenkamp Markus",{"$f":"IF('Wettkampf 1'!D44>0,1,0)","v":0},{"$f":"IF('2'!$D44>0,1,0)","v":0},{"$f":"IF('3'!$D44>0,1,0)","v":0},{"$f":"IF('4'!$D44>0,1,0)","v":0},{"$f":"IF('5'!$D44>0,1,0)","v":1},{"$f":"IF('6'!$D44>0,1,0)","v":1},2,{"$f":"IF('7'!$D44>0,1,0)","v":1},{"$f":"IF('8'!$D44>0,1,0)","v":1},{"$f":"IF('9'!$D44>0,1,0)","v":1},{"$f":"IF('10'!$D44>0,1,0)","v":0},{"$f":"IF('11'!$D44>0,1,0)","v":1},{"$f":"IF('12'!$D44>0,1,0)","v":1},5,7]
["Walker Stefan",{"$f":"IF('Wettkampf 1'!D45>0,1,0)","v":0},{"$f":"IF('2'!$D45>0,1,0)","v":0},{"$f":"IF('3'!$D45>0,1,0)","v":0},{"$f":"IF('4'!$D45>0,1,0)","v":1},{"$f":"IF('5'!$D45>0,1,0)","v":1},{"$f":"IF('6'!$D45>0,1,0)","v":1},3,{"$f":"IF('7'!$D45>0,1,0)","v":0},{"$f":"IF('8'!$D45>0,1,0)","v":0},{"$f":"IF('9'!$D45>0,1,0)","v":0},{"$f":"IF('10'!$D45>0,1,0)","v":0},{"$f":"IF('11'!$D45>0,1,0)","v":1},{"$f":"IF('12'!$D45>0,1,0)","v":1},2,5]
[null,{"$f":"SUM(B9:B44)","v":{"v":30,"d":"30.00"}},{"$f":"SUM(C9:C44)","v":{"v":30,"d":"30.00"}},{"v":28,"d":"28.00"},{"v":29,"d":"29.00"},{"v":30,"d":"30.00"},{"v":28,"d":"28.00"},{"$f":"SUM(H9:H44)","v":{"v":175,"d":"175.00"}},{"$f":"SUM(I9:I44)","v":{"v":30,"d":"30.00"}},{"$f":"SUM(J9:J44)","v":{"v":28,"d":"28.00"}},{"v":28,"d":"28.00"},{"v":27,"d":"27.00"},{"v":30,"d":"30.00"},{"v":29,"d":"29.00"},{"$f":"SUM(O9:O44)","v":{"v":172,"d":"172.00"}},{"$f":"SUM(P9:P44)","v":{"v":347,"d":"347.00"}}]

{"sheet":"Übersicht Gruppen","index":17,"n_rows":7,"n_cols":20,"rows_kept":7,"hidden":true}
[]
[null,"Rastdorf III",{"$f":"VLOOKUP($B$2:$B$7,'Wettkampf 1'!$B$2:$D$7,3,FALSE)","v":{"v":946,"d":"946.0"}},{"$f":"VLOOKUP($B$2:$B$7,'2'!$B$2:$D$7,3,FALSE)","v":{"v":938.6999999999999,"d":"938.7"}},{"$f":"VLOOKUP($B$2:$B$7,'3'!$B$2:$D$7,3,FALSE)","v":935.6},{"$f":"VLOOKUP($B$2:$B$7,'4'!$B$2:$D$7,3,FALSE)","v":929.8},{"$f":"VLOOKUP($B$2:$B$7,'5'!$B$2:$D$7,3,FALSE)","v":946.3},{"$f":"VLOOKUP($B$2:$B$7,'6'!$B$2:$D$7,3,FALSE)","v":939.2},{"$f":"IF(Formelhilfe!H3 > 0,J2/Formelhilfe!H3,0)","v":{"v":939.2666666666665,"d":"939.3"}},{"$f":"SUM(C2:H2)","v":{"v":5635.599999999999,"d":"5,635.6"}},{"$f":"VLOOKUP($B$2:$B$7,'7'!$B$2:$D$7,3,FALSE)","v":936.4},{"$f":"VLOOKUP($B$2:$B$7,'8'!$B$2:$D$7,3,FALSE)","v":934.4},{"$f":"VLOOKUP($B$2:$B$7,'9'!$B$2:$D$7,3,FALSE)","v":{"v":936,"d":"936.0"}},{"$f":"VLOOKUP($B$2:$B$7,'10'!$B$2:$D$7,3,FALSE)","v":923.3},{"$f":"VLOOKUP($B$2:$B$7,'11'!$B$2:$D$7,3,FALSE)","v":945.9},{"$f":"VLOOKUP($B$2:$B$7,'12'!$B$2:$D$7,3,FALSE)","v":935.5},{"$f":"IF(Formelhilfe!O3>0,R2/Formelhilfe!O3,0)","v":{"v":935.25,"d":"935.3"}},{"$f":"SUM(K2:P2)","v":{"v":5611.5,"d":"5,611.5"}},{"$f":"IF(Formelhilfe!P3>0,T2/Formelhilfe!P3,0)","v":{"v":937.2583333333331,"d":"937.3"}},{"$f":"SUM(C2:H2,K2:P2)","v":{"v":11247.099999999997,"d":"11,247.1"}}]
[null,"Esterwegen III",{"$f":"VLOOKUP($B$2:$B$7,'Wettkampf 1'!$B$2:$D$7,3,FALSE)","v":933.3},{"$f":"VLOOKUP($B$2:$B$7,'2'!$B$2:$D$7,3,FALSE)","v":{"v":936.6999999999999,"d":"936.7"}},{"$f":"VLOOKUP($B$2:$B$7,'3'!$B$2:$D$7,3,FALSE)","v":935.7},{"$f":"VLOOKUP($B$2:$B$7,'4'!$B$2:$D$7,3,FALSE)","v":938.6},{"$f":"VLOOKUP($B$2:$B$7,'5'!$B$2:$D$7,3,FALSE)","v":{"v":941.6999999999999,"d":"941.7"}},{"$f":"VLOOKUP($B$2:$B$7,'6'!$B$2:$D$7,3,FALSE)","v":936.1},{"$f":"IF(Formelhilfe!H2 > 0,J3/Formelhilfe!H2,0)","v":{"v":937.0166666666668,"d":"937.0"}},{"$f":"SUM(C3:H3)","v":{"v":5622.1,"d":"5,622.1"}},{"$f":"VLOOKUP($B$2:$B$7,'7'!$B$2:$D$7,3,FALSE)","v":{"v":937.0999999999999,"d":"937.1"}},{"$f":"VLOOKUP($B$2:$B$7,'8'!$B$2:$D$7,3,FALSE)","v":934.1},{"$f":"VLOOKUP($B$2:$B$7,'9'!$B$2:$D$7,3,FALSE)","v":{"v":932.5000000000001,"d":"932.5"}},{"$f":"VLOOKUP($B$2:$B$7,'10'!$B$2:$D$7,3,FALSE)","v":{"v":938.9000000000001,"d":"938.9"}},{"$f":"VLOOKUP($B$2:$B$7,'11'!$B$2:$D$7,3,FALSE)","v":939.4},{"$f":"VLOOKUP($B$2:$B$7,'12'!$B$2:$D$7,3,FALSE)","v":{"v":941.9000000000001,"d":"941.9"}},{"$f":"IF(Formelhilfe!O2>0,R3/Formelhilfe!O2,0)","v":{"v":937.3166666666666,"d":"937.3"}},{"$f":"SUM(K3:P3)","v":{"v":5623.9,"d":"5,623.9"}},{"$f":"IF(Formelhilfe!P2>0,T3/Formelhilfe!P2,0)","v":{"v":937.1666666666666,"d":"937.2"}},{"$f":"SUM(C3:H3,K3:P3)","v":{"v":11246,"d":"11,246.0"}}]
[null,"Spahnharrenstätte II",{"$f":"VLOOKUP($B$2:$B$7,'Wettkampf 1'!$B$2:$D$7,3,FALSE)","v":928.7},{"$f":"VLOOKUP($B$2:$B$7,'2'!$B$2:$D$7,3,FALSE)","v":934.5},{"$f":"VLOOKUP($B$2:$B$7,'3'!$B$2:$D$7,3,FALSE)","v":{"v":931.5999999999999,"d":"931.6"}},{"$f":"VLOOKUP($B$2:$B$7,'4'!$B$2:$D$7,3,FALSE)","v":935.7},{"$f":"VLOOKUP($B$2:$B$7,'5'!$B$2:$D$7,3,FALSE)","v":{"v":940.9000000000001,"d":"940.9"}},{"$f":"VLOOKUP($B$2:$B$7,'6'!$B$2:$D$7,3,FALSE)","v":{"v":937,"d":"937.0"}},{"$f":"IF(Formelhilfe!H6 > 0,J4/Formelhilfe!H6,0)","v":{"v":934.7333333333332,"d":"934.7"}},{"$f":"SUM(C4:H4)","v":{"v":5608.4,"d":"5,608.4"}},{"$f":"VLOOKUP($B$2:$B$7,'7'!$B$2:$D$7,3,FALSE)","v":931.1},{"$f":"VLOOKUP($B$2:$B$7,'8'!$B$2:$D$7,3,FALSE)","v":934.4},{"$f":"VLOOKUP($B$2:$B$7,'9'!$B$2:$D$7,3,FALSE)","v":915.8},{"$f":"VLOOKUP($B$2:$B$7,'10'!$B$2:$D$7,3,FALSE)","v":924.5},{"$f":"VLOOKUP($B$2:$B$7,'11'!$B$2:$D$7,3,FALSE)","v":933.6},{"$f":"VLOOKUP($B$2:$B$7,'12'!$B$2:$D$7,3,FALSE)","v":931.4},{"$f":"IF(Formelhilfe!O6>0,R4/Formelhilfe!O6,0)","v":{"v":928.4666666666667,"d":"928.5"}},{"$f":"SUM(K4:P4)","v":{"v":5570.8,"d":"5,570.8"}},{"$f":"IF(Formelhilfe!P6>0,T4/Formelhilfe!P6,0)","v":{"v":931.5999999999999,"d":"931.6"}},{"$f":"SUM(C4:H4,K4:P4)","v":{"v":11179.199999999999,"d":"11,179.2"}}]
[null,"Neuvrees I",{"$f":"VLOOKUP($B$2:$B$7,'Wettkampf 1'!$B$2:$D$7,3,FALSE)","v":938.6},{"$f":"VLOOKUP($B$2:$B$7,'2'!$B$2:$D$7,3,FALSE)","v":931.2},{"$f":"VLOOKUP($B$2:$B$7,'3'!$B$2:$D$7,3,FALSE)","v":924.7},{"$f":"VLOOKUP($B$2:$B$7,'4'!$B$2:$D$7,3,FALSE)","v":929.7},{"$f":"VLOOKUP($B$2:$B$7,'5'!$B$2:$D$7,3,FALSE)","v":936.5},{"$f":"VLOOKUP($B$2:$B$7,'6'!$B$2:$D$7,3,FALSE)","v":934.1},{"$f":"IF(Formelhilfe!H4 > 0,J5/Formelhilfe!H4,0)","v":{"v":932.4666666666667,"d":"932.5"}},{"$f":"SUM(C5:H5)","v":{"v":5594.8,"d":"5,594.8"}},{"$f":"VLOOKUP($B$2:$B$7,'7'!$B$2:$D$7,3,FALSE)","v":{"v":929.6000000000001,"d":"929.6"}},{"$f":"VLOOKUP($B$2:$B$7,'8'!$B$2:$D$7,3,FALSE)","v":929.5},{"$f":"VLOOKUP($B$2:$B$7,'9'!$B$2:$D$7,3,FALSE)","v":931.7},{"$f":"VLOOKUP($B$2:$B$7,'10'!$B$2:$D$7,3,FALSE)","v":{"v":923.1999999999999,"d":"923.2"}},{"$f":"VLOOKUP($B$2:$B$7,'11'!$B$2:$D$7,3,FALSE)","v":934.5},{"$f":"VLOOKUP($B$2:$B$7,'12'!$B$2:$D$7,3,FALSE)","v":{"v":935,"d":"935.0"}},{"$f":"IF(Formelhilfe!O4>0,R5/Formelhilfe!O4,0)","v":{"v":930.5833333333334,"d":"930.6"}},{"$f":"SUM(K5:P5)","v":{"v":5583.5,"d":"5,583.5"}},{"$f":"IF(Formelhilfe!P4>0,T5/Formelhilfe!P4,0)","v":{"v":931.5250000000001,"d":"931.5"}},{"$f":"SUM(C5:H5,K5:P5)","v":{"v":11178.300000000001,"d":"11,178.3"}}]
[null,"Börgerwald II",{"$f":"VLOOKUP($B$2:$B$7,'Wettkampf 1'!$B$2:$D$7,3,FALSE)","v":929.6},{"$f":"VLOOKUP($B$2:$B$7,'2'!$B$2:$D$7,3,FALSE)","v":922.8},{"$f":"VLOOKUP($B$2:$B$7,'3'!$B$2:$D$7,3,FALSE)","v":{"v":930.4000000000001,"d":"930.4"}},{"$f":"VLOOKUP($B$2:$B$7,'4'!$B$2:$D$7,3,FALSE)","v":931.3},{"$f":"VLOOKUP($B$2:$B$7,'5'!$B$2:$D$7,3,FALSE)","v":{"v":931.3000000000001,"d":"931.3"}},{"$f":"VLOOKUP($B$2:$B$7,'6'!$B$2:$D$7,3,FALSE)","v":930.7},{"$f":"IF(Formelhilfe!H7 > 0,J6/Formelhilfe!H7,0)","v":{"v":929.35,"d":"929.4"}},{"$f":"SUM(C6:H6)","v":{"v":5576.1,"d":"5,576.1"}},{"$f":"VLOOKUP($B$2:$B$7,'7'!$B$2:$D$7,3,FALSE)","v":924.5},{"$f":"VLOOKUP($B$2:$B$7,'8'!$B$2:$D$7,3,FALSE)","v":930.7},{"$f":"VLOOKUP($B$2:$B$7,'9'!$B$2:$D$7,3,FALSE)","v":933.5},{"$f":"VLOOKUP($B$2:$B$7,'10'!$B$2:$D$7,3,FALSE)","v":931.6},{"$f":"VLOOKUP($B$2:$B$7,'11'!$B$2:$D$7,3,FALSE)","v":{"v":942.3000000000001,"d":"942.3"}},{"$f":"VLOOKUP($B$2:$B$7,'12'!$B$2:$D$7,3,FALSE)","v":{"v":939.5999999999999,"d":"939.6"}},{"$f":"IF(Formelhilfe!O7>0,R6/Formelhilfe!O7,0)","v":{"v":933.6999999999998,"d":"933.7"}},{"$f":"SUM(K6:P6)","v":{"v":5602.199999999999,"d":"5,602.2"}},{"$f":"IF(Formelhilfe!P7>0,T6/Formelhilfe!P7,0)","v":{"v":931.525,"d":"931.5"}},{"$f":"SUM(C6:H6,K6:P6)","v":{"v":11178.3,"d":"11,178.3"}}]
[null,"Börger II",{"$f":"VLOOKUP($B$2:$B$7,'Wettkampf 1'!$B$2:$D$7,3,FALSE)","v":935.7},{"$f":"VLOOKUP($B$2:$B$7,'2'!$B$2:$D$7,3,FALSE)","v":916.1},{"$f":"VLOOKUP($B$2:$B$7,'3'!$B$2:$D$7,3,FALSE)","v":923.6},{"$f":"VLOOKUP($B$2:$B$7,'4'!$B$2:$D$7,3,FALSE)","v":923.5},{"$f":"VLOOKUP($B$2:$B$7,'5'!$B$2:$D$7,3,FALSE)","v":934.2},{"$f":"VLOOKUP($B$2:$B$7,'6'!$B$2:$D$7,3,FALSE)","v":{"v":923.1999999999999,"d":"923.2"}},{"$f":"IF(Formelhilfe!H5 > 0,J7/Formelhilfe!H5,0)","v":{"v":926.0500000000001,"d":"926.1"}},{"$f":"SUM(C7:H7)","v":{"v":5556.3,"d":"5,556.3"}},{"$f":"VLOOKUP($B$2:$B$7,'7'!$B$2:$D$7,3,FALSE)","v":918.7},{"$f":"VLOOKUP($B$2:$B$7,'8'!$B$2:$D$7,3,FALSE)","v":{"v":928.1999999999999,"d":"928.2"}},{"$f":"VLOOKUP($B$2:$B$7,'9'!$B$2:$D$7,3,FALSE)","v":{"v":928.9000000000001,"d":"928.9"}},{"$f":"VLOOKUP($B$2:$B$7,'10'!$B$2:$D$7,3,FALSE)","v":{"v":916.5999999999999,"d":"916.6"}},{"$f":"VLOOKUP($B$2:$B$7,'11'!$B$2:$D$7,3,FALSE)","v":{"v":935,"d":"935.0"}},{"$f":"VLOOKUP($B$2:$B$7,'12'!$B$2:$D$7,3,FALSE)","v":930.7},{"$f":"IF(Formelhilfe!O5>0,R7/Formelhilfe!O5,0)","v":{"v":926.3499999999999,"d":"926.4"}},{"$f":"SUM(K7:P7)","v":{"v":5558.099999999999,"d":"5,558.1"}},{"$f":"IF(Formelhilfe!P5>0,T7/Formelhilfe!P5,0)","v":{"v":926.2000000000002,"d":"926.2"}},{"$f":"SUM(C7:H7,K7:P7)","v":{"v":11114.400000000001,"d":"11,114.4"}}]