{"text_format":"3","workbook":"xlsx","n_sheets":18,"sheets":["Übersicht","Wettkampf 1","Börgermoor","3","4","5","6","7","8","9","10","11","12","Ausdruck","Ausdruck blank","Übersicht Schützen","Formelhilfe","Übersicht Gruppen"],"not_rendered":{"images":2,"macros":1,"defined_names":12},"read":"whole","date_system":"1900"}

{"sheet":"Übersicht","index":0,"n_rows":84,"n_cols":22,"rows_kept":84,"merged":[[0,10,0,11],[0,12,0,14],[0,15,0,16],[2,9,2,10],[2,17,2,18],[2,19,2,20],[3,1,3,2],[3,21,5,21],[5,1,5,2],[6,1,6,2],[7,1,7,2],[8,1,8,2],[9,1,9,2],[10,1,10,2],[11,1,11,2],[12,1,12,2],[13,1,13,2],[14,1,14,2],[15,1,15,2],[16,1,16,2],[20,9,20,10],[20,17,20,18],[20,19,20,20],[20,21,22,21]]}
[{"$nulls":3},"Kreisrundenwettkampf",{"$nulls":5},"Saison","2023/2024",{"$nulls":4},"Schüler"]
[]
[null,null,"Wettkampftag:","16.09.","07.10.","04.11.","02.12.",null,null,"Hinrunde",null,"13.01.","03.02.","17.02.","09.03.","06.04.",null,"Rückrunde",null,"Serie komplett"]
["Pos.","Verein / Gruppe",null,"Lorup","Börgermoor","Lahn","Spahnharrenstätte",null,null,"Schnitt","Gesamt ","Esterwegen","Lähden","Breddenberg","Neubörger","Sögel",null,"Schnitt","Gesamt ","Schnitt","Gesamt","Differenz"]
[]
[1,{"$f":"'Übersicht Gruppen'!B2","v":"Lähden"},null,{"$f":"'Übersicht Gruppen'!C2","v":{"v":565,"d":"565.0"}},{"$f":"'Übersicht Gruppen'!D2","v":545.3},{"$f":"'Übersicht Gruppen'!E2","v":564.7},{"$f":"'Übersicht Gruppen'!F2","v":539.2},{"$f":"'Übersicht Gruppen'!G2","v":{"v":0,"d":"0.0"}},{"$f":"'Übersicht Gruppen'!H2","v":{"v":0,"d":"0.0"}},{"$f":"'Übersicht Gruppen'!I2","v":553.55},{"$f":"SUM(D6:I6)","v":{"v":2214.2,"d":"2,214.2"}},{"$f":"'Übersicht Gruppen'!K2","v":563.6},{"$f":"'Übersicht Gruppen'!L2","v":551.9},{"$f":"'Übersicht Gruppen'!M2","v":560.7},{"$f":"'Übersicht Gruppen'!N2","v":{"v":562,"d":"562.0"}},{"$f":"'Übersicht Gruppen'!O2","v":{"v":559.5999999999999,"d":"559.6"}},{"$f":"'Übersicht Gruppen'!P2","v":{"v":0,"d":"0.0"}},{"$f":"'Übersicht Gruppen'!Q2","v":559.56},{"$f":"SUM(L6:Q6)","v":{"v":2797.7999999999997,"d":"2,797.8"}},{"$f":"'Übersicht Gruppen'!S2","v":{"v":556.8888888888889,"d":"556.89"}},{"$f":"SUM(S6+K6)","v":{"v":5012,"d":"5,012.0"}}]
[2,{"$f":"'Übersicht Gruppen'!B3","v":"Esterwegen"},null,{"$f":"'Übersicht Gruppen'!C3","v":519.5},{"$f":"'Übersicht Gruppen'!D3","v":478.6},{"$f":"'Übersicht Gruppen'!E3","v":{"v":515,"d":"515.0"}},{"$f":"'Übersicht Gruppen'!F3","v":492.8},{"$f":"'Übersicht Gruppen'!G3","v":{"v":0,"d":"0.0"}},{"$f":"'Übersicht Gruppen'!H3","v":{"v":0,"d":"0.0"}},{"$f":"'Übersicht Gruppen'!I3","v":{"v":501.47499999999997,"d":"501.48"}},{"v":2005.8999999999999,"d":"2,005.9"},{"$f":"'Übersicht Gruppen'!K3","v":522.2},{"$f":"'Übersicht Gruppen'!L3","v":522.9},{"$f":"'Übersicht Gruppen'!M3","v":490.7},{"$f":"'Übersicht Gruppen'!N3","v":508.3},{"$f":"'Übersicht Gruppen'!O3","v":{"v":508,"d":"508.0"}},{"$f":"'Übersicht Gruppen'!P3","v":{"v":0,"d":"0.0"}},{"$f":"'Übersicht Gruppen'!Q3","v":{"v":510.41999999999996,"d":"510.42"}},{"v":2552.1,"d":"2,552.1"},{"$f":"'Übersicht Gruppen'!S3","v":{"v":506.44444444444446,"d":"506.44"}},{"$f":"SUM(S7+K7)","v":{"v":4558,"d":"4,558.0"}},{"$f":"(U6-U7)*-1","v":{"v":-454,"d":"-454.0"}}]
[3,{"$f":"'Übersicht Gruppen'!B4","v":"Lorup"},null,{"$f":"'Übersicht Gruppen'!C4","v":{"v":394.90000000000003,"d":"394.9"}},{"$f":"'Übersicht Gruppen'!D4","v":404.5},{"$f":"'Übersicht Gruppen'!E4","v":436.5},{"$f":"'Übersicht Gruppen'!F4","v":443.2},{"$f":"'Übersicht Gruppen'!G4","v":{"v":0,"d":"0.0"}},{"$f":"'Übersicht Gruppen'!H4","v":{"v":0,"d":"0.0"}},{"$f":"'Übersicht Gruppen'!I4","v":{"v":419.77500000000003,"d":"419.78"}},{"v":1679.1000000000001,"d":"1,679.1"},{"$f":"'Übersicht Gruppen'!K4","v":{"v":425.40000000000003,"d":"425.4"}},{"$f":"'Übersicht Gruppen'!L4","v":{"v":444.20000000000005,"d":"444.2"}},{"$f":"'Übersicht Gruppen'!M4","v":507.7},{"$f":"'Übersicht Gruppen'!N4","v":{"v":458,"d":"458.0"}},{"$f":"'Übersicht Gruppen'!O4","v":500.4},{"$f":"'Übersicht Gruppen'!P4","v":{"v":0,"d":"0.0"}},{"$f":"'Übersicht Gruppen'!Q4","v":{"v":467.14000000000004,"d":"467.14"}},{"v":2335.7000000000003,"d":"2,335.7"},{"$f":"'Übersicht Gruppen'!S4","v":{"v":446.08888888888885,"d":"446.09"}},{"v":4014.8,"d":"4,014.8"},{"$f":"(U7-U8)*-1","v":{"v":-543.1999999999998,"d":"-543.2"}}]
[4,{"$f":"'Übersicht Gruppen'!B5","v":"Spahnharenstätte"},null,{"$f":"'Übersicht Gruppen'!C5","v":318.6},{"$f":"'Übersicht Gruppen'!D5","v":{"v":349.09999999999997,"d":"349.1"}},{"$f":"'Übersicht Gruppen'!E5","v":263.5},{"$f":"'Übersicht Gruppen'!F5","v":344.4},{"$f":"'Übersicht Gruppen'!G5","v":{"v":0,"d":"0.0"}},{"$f":"'Übersicht Gruppen'!H5","v":{"v":0,"d":"0.0"}},{"$f":"'Übersicht Gruppen'!I5","v":{"v":318.9,"d":"318.90"}},{"v":1275.6,"d":"1,275.6"},{"$f":"'Übersicht Gruppen'!K5","v":225.8},{"$f":"'Übersicht Gruppen'!L5","v":361.5},{"$f":"'Übersicht Gruppen'!M5","v":372.1},{"$f":"'Übersicht Gruppen'!N5","v":248.5},{"$f":"'Übersicht Gruppen'!O5","v":294.7},{"$f":"'Übersicht Gruppen'!P5","v":{"v":0,"d":"0.0"}},{"$f":"'Übersicht Gruppen'!Q5","v":{"v":300.52000000000004,"d":"300.52"}},{"v":1502.6000000000001,"d":"1,502.6"},{"$f":"'Übersicht Gruppen'!S5","v":{"v":308.68888888888887,"d":"308.69"}},{"v":2778.2,"d":"2,778.2"},{"v":-1236.6000000000004,"d":"-1,236.6"}]
[5,{"$f":"'Übersicht Gruppen'!B6","v":"Börgermoor"},null,{"$f":"'Übersicht Gruppen'!C6","v":183.4},{"$f":"'Übersicht Gruppen'!D6","v":{"v":201.10000000000002,"d":"201.1"}},{"$f":"'Übersicht Gruppen'!E6","v":227.3},{"$f":"'Übersicht Gruppen'!F6","v":134.2},{"$f":"'Übersicht Gruppen'!G6","v":{"v":0,"d":"0.0"}},{"$f":"'Übersicht Gruppen'!H6","v":{"v":0,"d":"0.0"}},{"$f":"'Übersicht Gruppen'!I6","v":{"v":186.5,"d":"186.50"}},{"v":746,"d":"746.0"},{"$f":"'Übersicht Gruppen'!K6","v":{"v":0,"d":"0.0"}},{"$f":"'Übersicht Gruppen'!L6","v":145.7},{"$f":"'Übersicht Gruppen'!M6","v":175.5},{"$f":"'Übersicht Gruppen'!N6","v":137.2},{"$f":"'Übersicht Gruppen'!O6","v":160.3},{"$f":"'Übersicht Gruppen'!P6","v":{"v":0,"d":"0.0"}},{"$f":"'Übersicht Gruppen'!Q6","v":{"v":154.675,"d":"154.68"}},618.7,{"$f":"'Übersicht Gruppen'!S6","v":{"v":170.5875,"d":"170.59"}},{"v":1364.7,"d":"1,364.7"},{"v":-1413.4999999999998,"d":"-1,413.5"}]
[6,{"$f":"'Übersicht Gruppen'!B7","v":"Sögel"},null,{"$f":"'Übersicht Gruppen'!C7","v":{"v":0,"d":"0.0"}},{"$f":"'Übersicht Gruppen'!D7","v":{"v":0,"d":"0.0"}},{"$f":"'Übersicht Gruppen'!E7","v":{"v":0,"d":"0.0"}},{"$f":"'Übersicht Gruppen'!F7","v":{"v":0,"d":"0.0"}},{"$f":"'Übersicht Gruppen'!G7","v":{"v":0,"d":"0.0"}},{"$f":"'Übersicht Gruppen'!H7","v":{"v":0,"d":"0.0"}},{"$f":"'Übersicht Gruppen'!I7","v":{"v":0,"d":"0.00"}},{"v":0,"d":"0.0"},{"$f":"'Übersicht Gruppen'!K7","v":{"v":0,"d":"0.0"}},{"$f":"'Übersicht Gruppen'!L7","v":{"v":0,"d":"0.0"}},{"$f":"'Übersicht Gruppen'!M7","v":{"v":0,"d":"0.0"}},{"$f":"'Übersicht Gruppen'!N7","v":{"v":0,"d":"0.0"}},{"$f":"'Übersicht Gruppen'!O7","v":{"v":0,"d":"0.0"}},{"$f":"'Übersicht Gruppen'!P7","v":{"v":0,"d":"0.0"}},{"$f":"'Übersicht Gruppen'!Q7","v":{"v":0,"d":"0.00"}},{"v":0,"d":"0.0"},{"$f":"'Übersicht Gruppen'!S7","v":{"v":0,"d":"0.00"}},{"v":0,"d":"0.0"},{"v":-1364.7,"d":"-1,364.7"}]
[7,{"$f":"'Übersicht Gruppen'!B8","v":"Verein VII"},null,{"$f":"'Übersicht Gruppen'!C8","v":{"v":0,"d":"0.0"}},{"$f":"'Übersicht Gruppen'!D8","v":{"v":0,"d":"0.0"}},{"$f":"'Übersicht Gruppen'!E8","v":{"v":0,"d":"0.0"}},{"$f":"'Übersicht Gruppen'!F8","v":{"v":0,"d":"0.0"}},{"$f":"'Übersicht Gruppen'!G8","v":{"v":0,"d":"0.0"}},{"$f":"'Übersicht Gruppen'!H8","v":{"v":0,"d":"0.0"}},{"$f":"'Übersicht Gruppen'!I8","v":{"v":0,"d":"0.00"}},{"v":0,"d":"0.0"},{"$f":"'Übersicht Gruppen'!K8","v":{"v":0,"d":"0.0"}},{"$f":"'Übersicht Gruppen'!L8","v":{"v":0,"d":"0.0"}},{"$f":"'Übersicht Gruppen'!M8","v":{"v":0,"d":"0.0"}},{"$f":"'Übersicht Gruppen'!N8","v":{"v":0,"d":"0.0"}},{"$f":"'Übersicht Gruppen'!O8","v":{"v":0,"d":"0.0"}},{"$f":"'Übersicht Gruppen'!P8","v":{"v":0,"d":"0.0"}},{"$f":"'Übersicht Gruppen'!Q8","v":{"v":0,"d":"0.00"}},{"v":0,"d":"0.0"},{"$f":"'Übersicht Gruppen'!S8","v":{"v":0,"d":"0.00"}},{"v":0,"d":"0.0"},{"v":0,"d":"0.0"}]
[8,{"$f":"'Übersicht Gruppen'!B9","v":"Verein VIII"},null,{"$f":"'Übersicht Gruppen'!C9","v":{"v":0,"d":"0.0"}},{"$f":"'Übersicht Gruppen'!D9","v":{"v":0,"d":"0.0"}},{"$f":"'Übersicht Gruppen'!E9","v":{"v":0,"d":"0.0"}},{"$f":"'Übersicht Gruppen'!F9","v":{"v":0,"d":"0.0"}},{"$f":"'Übersicht Gruppen'!G9","v":{"v":0,"d":"0.0"}},{"$f":"'Übersicht Gruppen'!H9","v":{"v":0,"d":"0.0"}},{"$f":"'Übersicht Gruppen'!I9","v":{"v":0,"d":"0.00"}},{"v":0,"d":"0.0"},{"$f":"'Übersicht Gruppen'!K9","v":{"v":0,"d":"0.0"}},{"$f":"'Übersicht Gruppen'!L9","v":{"v":0,"d":"0.0"}},{"$f":"'Übersicht Gruppen'!M9","v":{"v":0,"d":"0.0"}},{"$f":"'Übersicht Gruppen'!N9","v":{"v":0,"d":"0.0"}},{"$f":"'Übersicht Gruppen'!O9","v":{"v":0,"d":"0.0"}},{"$f":"'Übersicht Gruppen'!P9","v":{"v":0,"d":"0.0"}},{"$f":"'Übersicht Gruppen'!Q9","v":{"v":0,"d":"0.00"}},{"v":0,"d":"0.0"},{"$f":"'Übersicht Gruppen'!S9","v":{"v":0,"d":"0.00"}},{"v":0,"d":"0.0"},{"v":0,"d":"0.0"}]
[9,{"$f":"'Übersicht Gruppen'!B10","v":"Verein IX"},null,{"$f":"'Übersicht Gruppen'!C10","v":{"v":0,"d":"0.0"}},{"$f":"'Übersicht Gruppen'!D10","v":{"v":0,"d":"0.0"}},{"$f":"'Übersicht Gruppen'!E10","v":{"v":0,"d":"0.0"}},{"$f":"'Übersicht Gruppen'!F10","v":{"v":0,"d":"0.0"}},{"$f":"'Übersicht Gruppen'!G10","v":{"v":0,"d":"0.0"}},{"$f":"'Übersicht Gruppen'!H10","v":{"v":0,"d":"0.0"}},{"$f":"'Übersicht Gruppen'!I10","v":{"v":0,"d":"0.00"}},{"v":0,"d":"0.0"},{"$f":"'Übersicht Gruppen'!K10","v":{"v":0,"d":"0.0"}},{"$f":"'Übersicht Gruppen'!L10","v":{"v":0,"d":"0.0"}},{"$f":"'Übersicht Gruppen'!M10","v":{"v":0,"d":"0.0"}},{"$f":"'Übersicht Gruppen'!N10","v":{"v":0,"d":"0.0"}},{"$f":"'Übersicht Gruppen'!O10","v":{"v":0,"d":"0.0"}},{"$f":"'Übersicht Gruppen'!P10","v":{"v":0,"d":"0.0"}},{"$f":"'Übersicht Gruppen'!Q10","v":{"v":0,"d":"0.00"}},{"v":0,"d":"0.0"},{"$f":"'Übersicht Gruppen'!S10","v":{"v":0,"d":"0.00"}},{"v":0,"d":"0.0"},{"v":0,"d":"0.0"}]
[10,{"$f":"'Übersicht Gruppen'!B11","v":"Verein X"},null,{"$f":"'Übersicht Gruppen'!C11","v":{"v":0,"d":"0.0"}},{"$f":"'Übersicht Gruppen'!D11","v":{"v":0,"d":"0.0"}},{"$f":"'Übersicht Gruppen'!E11","v":{"v":0,"d":"0.0"}},{"$f":"'Übersicht Gruppen'!F11","v":{"v":0,"d":"0.0"}},{"$f":"'Übersicht Gruppen'!G11","v":{"v":0,"d":"0.0"}},{"$f":"'Übersicht Gruppen'!H11","v":{"v":0,"d":"0.0"}},{"$f":"'Übersicht Gruppen'!I11","v":{"v":0,"d":"0.00"}},{"v":0,"d":"0.0"},{"$f":"'Übersicht Gruppen'!K11","v":{"v":0,"d":"0.0"}},{"$f":"'Übersicht Gruppen'!L11","v":{"v":0,"d":"0.0"}},{"$f":"'Übersicht Gruppen'!M11","v":{"v":0,"d":"0.0"}},{"$f":"'Übersicht Gruppen'!N11","v":{"v":0,"d":"0.0"}},{"$f":"'Übersicht Gruppen'!O11","v":{"v":0,"d":"0.0"}},{"$f":"'Übersicht Gruppen'!P11","v":{"v":0,"d":"0.0"}},{"$f":"'Übersicht Gruppen'!Q11","v":{"v":0,"d":"0.00"}},{"v":0,"d":"0.0"},{"$f":"'Übersicht Gruppen'!S11","v":{"v":0,"d":"0.00"}},{"v":0,"d":"0.0"},{"v":0,"d":"0.0"}]
[11,{"$f":"'Übersicht Gruppen'!B12","v":"Verein XI"},null,{"$f":"'Übersicht Gruppen'!C12","v":{"v":0,"d":"0.0"}},{"$f":"'Übersicht Gruppen'!D12","v":{"v":0,"d":"0.0"}},{"$f":"'Übersicht Gruppen'!E12","v":{"v":0,"d":"0.0"}},{"$f":"'Übersicht Gruppen'!F12","v":{"v":0,"d":"0.0"}},{"$f":"'Übersicht Gruppen'!G12","v":{"v":0,"d":"0.0"}},{"$f":"'Übersicht Gruppen'!H12","v":{"v":0,"d":"0.0"}},{"$f":"'Übersicht Gruppen'!I12","v":{"v":0,"d":"0.00"}},{"v":0,"d":"0.0"},{"$f":"'Übersicht Gruppen'!K12","v":{"v":0,"d":"0.0"}},{"$f":"'Übersicht Gruppen'!L12","v":{"v":0,"d":"0.0"}},{"$f":"'Übersicht Gruppen'!M12","v":{"v":0,"d":"0.0"}},{"$f":"'Übersicht Gruppen'!N12","v":{"v":0,"d":"0.0"}},{"$f":"'Übersicht Gruppen'!O12","v":{"v":0,"d":"0.0"}},{"$f":"'Übersicht Gruppen'!P12","v":{"v":0,"d":"0.0"}},{"$f":"'Übersicht Gruppen'!Q12","v":{"v":0,"d":"0.00"}},{"v":0,"d":"0.0"},{"$f":"'Übersicht Gruppen'!S12","v":{"v":0,"d":"0.00"}},{"v":0,"d":"0.0"},{"v":0,"d":"0.0"}]
[12,{"$f":"'Übersicht Gruppen'!B13","v":"Verein XII"},null,{"$f":"'Übersicht Gruppen'!C13","v":{"v":0,"d":"0.0"}},{"$f":"'Übersicht Gruppen'!D13","v":{"v":0,"d":"0.0"}},{"$f":"'Übersicht Gruppen'!E13","v":{"v":0,"d":"0.0"}},{"$f":"'Übersicht Gruppen'!F13","v":{"v":0,"d":"0.0"}},{"$f":"'Übersicht Gruppen'!G13","v":{"v":0,"d":"0.0"}},{"$f":"'Übersicht Gruppen'!H13","v":{"v":0,"d":"0.0"}},{"$f":"'Übersicht Gruppen'!I13","v":{"v":0,"d":"0.00"}},{"v":0,"d":"0.0"},{"$f":"'Übersicht Gruppen'!K13","v":{"v":0,"d":"0.0"}},{"$f":"'Übersicht Gruppen'!L13","v":{"v":0,"d":"0.0"}},{"$f":"'Übersicht Gruppen'!M13","v":{"v":0,"d":"0.0"}},{"$f":"'Übersicht Gruppen'!N13","v":{"v":0,"d":"0.0"}},{"$f":"'Übersicht Gruppen'!O13","v":{"v":0,"d":"0.0"}},{"$f":"'Übersicht Gruppen'!P13","v":{"v":0,"d":"0.0"}},{"$f":"'Übersicht Gruppen'!Q13","v":{"v":0,"d":"0.00"}},{"v":0,"d":"0.0"},{"$f":"'Übersicht Gruppen'!S13","v":{"v":0,"d":"0.00"}},{"v":0,"d":"0.0"},{"v":0,"d":"0.0"}]
[]
[null,null,"Schnitt:",{"$f":"AVERAGE(D6:D11)","v":{"v":330.23333333333335,"d":"330.2"}},{"$f":"AVERAGE(E6:E11)","v":{"v":329.76666666666665,"d":"329.8"}},334.5,{"v":325.6333333333333,"d":"325.6"},{"v":0,"d":"0.0"},{"v":0,"d":"0.0"},{"v":330.0333333333333,"d":"330.03"},{"$f":"SUM(K6:K11)/6","v":{"v":1320.1333333333332,"d":"1,320.1"}},{"v":289.50000000000006,"d":"289.5"},337.7,{"v":351.11666666666673,"d":"351.1"},{"v":319,"d":"319.0"},{"v":337.1666666666667,"d":"337.2"},{"v":0,"d":"0.0"},{"v":332.0525,"d":"332.05"},{"v":1634.4833333333336,"d":"1634.5"},{"v":331.44976851851857,"d":"331.45"},{"v":2954.616666666667,"d":"2,954.6"}]
[]
[{"$nulls":9},"Hinrunde",{"$nulls":7},"Rückrunde",null,"Serie komplett",null,"Differenz"]
["Pos.","Vorname Name","Verein / Gruppe",{"$nulls":6},"Schnitt","Gesamt",{"$nulls":6},"Schnitt","Gesamt","Schnitt","Gesamt"]
[1,{"$f":"'Übersicht Schützen'!A2","v":"Buschen Johann "},{"$f":"'Übersicht Schützen'!B2","v":"Lähden"},{"$f":"'Übersicht Schützen'!C2","v":188.7},{"$f":"'Übersicht Schützen'!D2","v":190.9},{"$f":"'Übersicht Schützen'!E2","v":194.9},{"$f":"'Übersicht Schützen'!F2","v":184.9},{"$f":"'Übersicht Schützen'!G2","v":{"v":0,"d":"0.0"}},{"$f":"'Übersicht Schützen'!H2","v":{"v":0,"d":"0.0"}},{"$f":"'Übersicht Schützen'!I2","v":189.85},{"$f":"SUM(D23:I23)","v":759.4},{"$f":"'Übersicht Schützen'!L2","v":195.9},{"$f":"'Übersicht Schützen'!M2","v":179.6},{"$f":"'Übersicht Schützen'!N2","v":189.5},{"$f":"'Übersicht Schützen'!O2","v":184.5},{"$f":"'Übersicht Schützen'!P2","v":192.1},{"$f":"'Übersicht Schützen'!Q2","v":{"v":0,"d":"0.0"}},{"$f":"'Übersicht Schützen'!R2","v":188.32},{"$f":"SUM(L23:Q23)","v":941.6},{"$f":"'Übersicht Schützen'!U2","v":{"v":188.99999999999997,"d":"189.00"}},{"$f":"SUM(K23+S23)","v":{"v":1701,"d":"1,701.0"}}]
[2,{"$f":"'Übersicht Schützen'!A3","v":"Suhle Annalena"},{"$f":"'Übersicht Schützen'!B3","v":"Esterwegen"},{"$f":"'Übersicht Schützen'!C3","v":177.9},{"$f":"'Übersicht Schützen'!D3","v":175.9},{"$f":"'Übersicht Schützen'!E3","v":184.4},{"$f":"'Übersicht Schützen'!F3","v":179.3},{"$f":"'Übersicht Schützen'!G3","v":{"v":0,"d":"0.0"}},{"$f":"'Übersicht Schützen'!H3","v":{"v":0,"d":"0.0"}},{"$f":"'Übersicht Schützen'!I3","v":{"v":179.375,"d":"179.38"}},{"$f":"SUM(D24:I24)","v":717.5},{"$f":"'Übersicht Schützen'!L3","v":185.3},{"$f":"'Übersicht Schützen'!M3","v":190.5},{"$f":"'Übersicht Schützen'!N3","v":186.4},{"$f":"'Übersicht Schützen'!O3","v":188.9},{"$f":"'Übersicht Schützen'!P3","v":196.1},{"$f":"'Übersicht Schützen'!Q3","v":{"v":0,"d":"0.0"}},{"$f":"'Übersicht Schützen'!R3","v":189.44},{"$f":"SUM(L24:Q24)","v":947.2},{"$f":"'Übersicht Schützen'!U3","v":{"v":184.96666666666667,"d":"184.97"}},{"$f":"SUM(K24+S24)","v":{"v":1664.7,"d":"1,664.7"}},{"$f":"(U23-U24)*-1","v":{"v":-36.299999999999955,"d":"-36.3"}}]
[3,{"$f":"'Übersicht Schützen'!A4","v":"Hellweg Thea"},{"$f":"'Übersicht Schützen'!B4","v":"Lähden"},{"$f":"'Übersicht Schützen'!C4","v":191.8},{"$f":"'Übersicht Schützen'!D4","v":174.2},{"$f":"'Übersicht Schützen'!E4","v":181.9},{"$f":"'Übersicht Schützen'!F4","v":182.2},{"$f":"'Übersicht Schützen'!G4","v":{"v":0,"d":"0.0"}},{"$f":"'Übersicht Schützen'!H4","v":{"v":0,"d":"0.0"}},{"$f":"'Übersicht Schützen'!I4","v":{"v":182.52499999999998,"d":"182.53"}},{"$f":"SUM(D25:I25)","v":{"v":730.0999999999999,"d":"730.1"}},{"$f":"'Übersicht Schützen'!L4","v":183.8},{"$f":"'Übersicht Schützen'!M4","v":180.4},{"$f":"'Übersicht Schützen'!N4","v":175.1},{"$f":"'Übersicht Schützen'!O4","v":188.4},{"$f":"'Übersicht Schützen'!P4","v":181.7},{"$f":"'Übersicht Schützen'!Q4","v":{"v":0,"d":"0.0"}},{"$f":"'Übersicht Schützen'!R4","v":{"v":181.88000000000002,"d":"181.88"}},{"v":909.4000000000001,"d":"909.4"},{"$f":"'Übersicht Schützen'!U4","v":{"v":182.16666666666666,"d":"182.17"}},{"v":1639.5,"d":"1,639.5"},{"$f":"(U24-U25)*-1","v":{"v":-25.200000000000045,"d":"-25.2"}}]
[4,{"$f":"'Übersicht Schützen'!A5","v":"Bruns Henrik"},{"$f":"'Übersicht Schützen'!B5","v":"Lähden"},{"$f":"'Übersicht Schützen'!C5","v":184.5},{"$f":"'Übersicht Schützen'!D5","v":180.2},{"$f":"'Übersicht Schützen'!E5","v":187.9},{"$f":"'Übersicht Schützen'!F5","v":172.1},{"$f":"'Übersicht Schützen'!G5","v":{"v":0,"d":"0.0"}},{"$f":"'Übersicht Schützen'!H5","v":{"v":0,"d":"0.0"}},{"$f":"'Übersicht Schützen'!I5","v":{"v":181.175,"d":"181.18"}},724.7,{"$f":"'Übersicht Schützen'!L5","v":183.9},{"$f":"'Übersicht Schützen'!M5","v":179.1},{"$f":"'Übersicht Schützen'!N5","v":184.7},{"$f":"'Übersicht Schützen'!O5","v":180.7},{"$f":"'Übersicht Schützen'!P5","v":178.9},{"$f":"'Übersicht Schützen'!Q5","v":{"v":0,"d":"0.0"}},{"$f":"'Übersicht Schützen'!R5","v":181.46},{"v":907.3000000000001,"d":"907.3"},{"$f":"'Übersicht Schützen'!U5","v":{"v":181.33333333333337,"d":"181.33"}},{"v":1632,"d":"1,632.0"},-7.5]
[5,{"$f":"'Übersicht Schützen'!A6","v":"Gäken Lena"},{"$f":"'Übersicht Schützen'!B6","v":"Esterwegen"},{"$f":"'Übersicht Schützen'!C6","v":186.7},{"$f":"'Übersicht Schützen'!D6","v":170.4},{"$f":"'Übersicht Schützen'!E6","v":175.5},{"$f":"'Übersicht Schützen'!F6","v":179.5},{"$f":"'Übersicht Schützen'!G6","v":{"v":0,"d":"0.0"}},{"$f":"'Übersicht Schützen'!H6","v":{"v":0,"d":"0.0"}},{"$f":"'Übersicht Schützen'!I6","v":{"v":178.025,"d":"178.03"}},712.1,{"$f":"'Übersicht Schützen'!L6","v":170.4},{"$f":"'Übersicht Schützen'!M6","v":184.7},{"$f":"'Übersicht Schützen'!N6","v":185.5},{"$f":"'Übersicht Schützen'!O6","v":179.6},{"$f":"'Übersicht Schützen'!P6","v":{"v":188,"d":"188.0"}},{"$f":"'Übersicht Schützen'!Q6","v":{"v":0,"d":"0.0"}},{"$f":"'Übersicht Schützen'!R6","v":{"v":181.64000000000001,"d":"181.64"}},908.2,{"$f":"'Übersicht Schützen'!U6","v":{"v":180.03333333333333,"d":"180.03"}},{"v":1620.3000000000002,"d":"1,620.3"},{"v":-11.699999999999818,"d":"-11.7"}]
[6,{"$f":"'Übersicht Schützen'!A7","v":"Wotte Lia"},{"$f":"'Übersicht Schützen'!B7","v":"Lorup"},{"$f":"'Übersicht Schützen'!C7","v":148.9},{"$f":"'Übersicht Schützen'!D7","v":166.8},{"$f":"'Übersicht Schützen'!E7","v":165.9},{"$f":"'Übersicht Schützen'!F7","v":170.3},{"$f":"'Übersicht Schützen'!G7","v":{"v":0,"d":"0.0"}},{"$f":"'Übersicht Schützen'!H7","v":{"v":0,"d":"0.0"}},{"$f":"'Übersicht Schützen'!I7","v":{"v":162.97500000000002,"d":"162.98"}},{"v":651.9000000000001,"d":"651.9"},{"$f":"'Übersicht Schützen'!L7","v":166.3},{"$f":"'Übersicht Schützen'!M7","v":168.8},{"$f":"'Übersicht Schützen'!N7","v":178.6},{"$f":"'Übersicht Schützen'!O7","v":166.4},{"$f":"'Übersicht Schützen'!P7","v":182.2},{"$f":"'Übersicht Schützen'!Q7","v":{"v":0,"d":"0.0"}},{"$f":"'Übersicht Schützen'!R7","v":{"v":172.45999999999998,"d":"172.46"}},862.3,{"$f":"'Übersicht Schützen'!U7","v":{"v":168.24444444444444,"d":"168.24"}},{"v":1514.2,"d":"1,514.2"},{"v":-106.10000000000014,"d":"-106.1"}]
[7,{"$f":"'Übersicht Schützen'!A8","v":"Preut Jannis"},{"$f":"'Übersicht Schützen'!B8","v":"Lähden"},{"$f":"'Übersicht Schützen'!C8","v":173.7},{"$f":"'Übersicht Schützen'!D8","v":{"v":0,"d":"0.0"}},{"$f":"'Übersicht Schützen'!E8","v":{"v":173,"d":"173.0"}},{"$f":"'Übersicht Schützen'!F8","v":164.2},{"$f":"'Übersicht Schützen'!G8","v":{"v":0,"d":"0.0"}},{"$f":"'Übersicht Schützen'!H8","v":{"v":0,"d":"0.0"}},{"$f":"'Übersicht Schützen'!I8","v":{"v":170.29999999999998,"d":"170.30"}},510.9,{"$f":"'Übersicht Schützen'!L8","v":173.3},{"$f":"'Übersicht Schützen'!M8","v":166.4},{"$f":"'Übersicht Schützen'!N8","v":150.1},{"$f":"'Übersicht Schützen'!O8","v":149.6},{"$f":"'Übersicht Schützen'!P8","v":159.3},{"$f":"'Übersicht Schützen'!Q8","v":{"v":0,"d":"0.0"}},{"$f":"'Übersicht Schützen'!R8","v":159.74},798.7,{"$f":"'Übersicht Schützen'!U8","v":{"v":163.7,"d":"163.70"}},{"v":1309.6,"d":"1,309.6"},{"v":-204.60000000000014,"d":"-204.6"}]
[8,{"$f":"'Übersicht Schützen'!A9","v":"Runde Marcel"},{"$f":"'Übersicht Schützen'!B9","v":"Spahnharenstätte"},{"$f":"'Übersicht Schützen'!C9","v":126.7},{"$f":"'Übersicht Schützen'!D9","v":150.7},{"$f":"'Übersicht Schützen'!E9","v":144.5},{"$f":"'Übersicht Schützen'!F9","v":140.6},{"$f":"'Übersicht Schützen'!G9","v":{"v":0,"d":"0.0"}},{"$f":"'Übersicht Schützen'!H9","v":{"v":0,"d":"0.0"}},{"$f":"'Übersicht Schützen'!I9","v":{"v":140.625,"d":"140.63"}},562.5,{"$f":"'Übersicht Schützen'!L9","v":155.8},{"$f":"'Übersicht Schützen'!M9","v":151.2},{"$f":"'Übersicht Schützen'!N9","v":{"v":137,"d":"137.0"}},{"$f":"'Übersicht Schützen'!O9","v":{"v":147,"d":"147.0"}},{"$f":"'Übersicht Schützen'!P9","v":{"v":154,"d":"154.0"}},{"$f":"'Übersicht Schützen'!Q9","v":{"v":0,"d":"0.0"}},{"$f":"'Übersicht Schützen'!R9","v":{"v":149,"d":"149.00"}},{"v":745,"d":"745.0"},{"$f":"'Übersicht Schützen'!U9","v":{"v":145.27777777777777,"d":"145.28"}},{"v":1307.5,"d":"1,307.5"},{"v":-2.099999999999909,"d":"-2.1"}]
[9,{"$f":"'Übersicht Schützen'!A10","v":"Wotte Hannes"},{"$f":"'Übersicht Schützen'!B10","v":"Lorup"},{"$f":"'Übersicht Schützen'!C10","v":135.3},{"$f":"'Übersicht Schützen'!D10","v":125.8},{"$f":"'Übersicht Schützen'!E10","v":139.7},{"$f":"'Übersicht Schützen'!F10","v":144.1},{"$f":"'Übersicht Schützen'!G10","v":{"v":0,"d":"0.0"}},{"$f":"'Übersicht Schützen'!H10","v":{"v":0,"d":"0.0"}},{"$f":"'Übersicht Schützen'!I10","v":{"v":136.225,"d":"136.23"}},544.9,{"$f":"'Übersicht Schützen'!L10","v":131.3},{"$f":"'Übersicht Schützen'!M10","v":135.9},{"$f":"'Übersicht Schützen'!N10","v":139.8},{"$f":"'Übersicht Schützen'!O10","v":149.6},{"$f":"'Übersicht Schützen'!P10","v":140.3},{"$f":"'Übersicht Schützen'!Q10","v":{"v":0,"d":"0.0"}},{"$f":"'Übersicht Schützen'!R10","v":{"v":139.38000000000002,"d":"139.38"}},{"v":696.9000000000001,"d":"696.9"},{"$f":"'Übersicht Schützen'!U10","v":{"v":137.97777777777776,"d":"137.98"}},{"v":1241.8000000000002,"d":"1,241.8"},{"v":-65.69999999999982,"d":"-65.7"}]
[10,{"$f":"'Übersicht Schützen'!A11","v":"Helmer Maike"},{"$f":"'Übersicht Schützen'!B11","v":"Lorup"},{"$f":"'Übersicht Schützen'!C11","v":91.9},{"$f":"'Übersicht Schützen'!D11","v":101.8},{"$f":"'Übersicht Schützen'!E11","v":130.9},{"$f":"'Übersicht Schützen'!F11","v":118.8},{"$f":"'Übersicht Schützen'!G11","v":{"v":0,"d":"0.0"}},{"$f":"'Übersicht Schützen'!H11","v":{"v":0,"d":"0.0"}},{"$f":"'Übersicht Schützen'!I11","v":{"v":110.85000000000001,"d":"110.85"}},{"v":443.40000000000003,"d":"443.4"},{"$f":"'Übersicht Schützen'!L11","v":127.8},{"$f":"'Übersicht Schützen'!M11","v":139.5},{"$f":"'Übersicht Schützen'!N11","v":180.9},{"$f":"'Übersicht Schützen'!O11","v":155.1},{"$f":"'Übersicht Schützen'!P11","v":{"v":170,"d":"170.0"}},{"$f":"'Übersicht Schützen'!Q11","v":{"v":0,"d":"0.0"}},{"$f":"'Übersicht Schützen'!R11","v":{"v":154.66000000000003,"d":"154.66"}},{"v":773.3000000000001,"d":"773.3"},{"$f":"'Übersicht Schützen'!U11","v":{"v":135.1888888888889,"d":"135.19"}},{"v":1216.7,"d":"1,216.7"},{"v":-25.100000000000136,"d":"-25.1"}]
[11,{"$f":"'Übersicht Schützen'!A12","v":"Kohnen Saskia"},{"$f":"'Übersicht Schützen'!B12","v":"Börgermoor"},{"$f":"'Übersicht Schützen'!C12","v":134.9},{"$f":"'Übersicht Schützen'!D12","v":139.4},{"$f":"'Übersicht Schützen'!E12","v":135.8},{"$f":"'Übersicht Schützen'!F12","v":134.2},{"$f":"'Übersicht Schützen'!G12","v":{"v":0,"d":"0.0"}},{"$f":"'Übersicht Schützen'!H12","v":{"v":0,"d":"0.0"}},{"$f":"'Übersicht Schützen'!I12","v":{"v":136.075,"d":"136.08"}},544.3,{"$f":"'Übersicht Schützen'!L12","v":{"v":0,"d":"0.0"}},{"$f":"'Übersicht Schützen'!M12","v":145.7},{"$f":"'Übersicht Schützen'!N12","v":175.5},{"$f":"'Übersicht Schützen'!O12","v":137.2},{"$f":"'Übersicht Schützen'!P12","v":160.3},{"$f":"'Übersicht Schützen'!Q12","v":{"v":0,"d":"0.0"}},{"$f":"'Übersicht Schützen'!R12","v":{"v":154.675,"d":"154.68"}},618.7,{"$f":"'Übersicht Schützen'!U12","v":{"v":145.375,"d":"145.38"}},{"v":1163,"d":"1,163.0"},{"v":-53.700000000000045,"d":"-53.7"}]
[12,{"$f":"'Übersicht Schützen'!A13","v":"Jansen Daniel"},{"$f":"'Übersicht Schützen'!B13","v":"Esterwegen"},{"$f":"'Übersicht Schützen'!C13","v":154.9},{"$f":"'Übersicht Schützen'!D13","v":132.3},{"$f":"'Übersicht Schützen'!E13","v":155.1},{"$f":"'Übersicht Schützen'!F13","v":{"v":134,"d":"134.0"}},{"$f":"'Übersicht Schützen'!G13","v":{"v":0,"d":"0.0"}},{"$f":"'Übersicht Schützen'!H13","v":{"v":0,"d":"0.0"}},{"$f":"'Übersicht Schützen'!I13","v":{"v":144.07500000000002,"d":"144.08"}},{"v":576.3000000000001,"d":"576.3"},{"$f":"'Übersicht Schützen'!L13","v":166.5},{"$f":"'Übersicht Schützen'!M13","v":126.8},{"$f":"'Übersicht Schützen'!N13","v":{"v":0,"d":"0.0"}},{"$f":"'Übersicht Schützen'!O13","v":139.8},{"$f":"'Übersicht Schützen'!P13","v":123.9},{"$f":"'Übersicht Schützen'!Q13","v":{"v":0,"d":"0.0"}},{"$f":"'Übersicht Schützen'!R13","v":139.25},{"v":557,"d":"557.0"},{"$f":"'Übersicht Schützen'!U13","v":{"v":141.66250000000002,"d":"141.66"}},{"v":1133.3000000000002,"d":"1,133.3"},{"v":-29.699999999999818,"d":"-29.7"}]
[13,{"$f":"'Übersicht Schützen'!A14","v":"Fleschenberg Jana"},{"$f":"'Übersicht Schützen'!B14","v":"Lähden"},{"$f":"'Übersicht Schützen'!C14","v":{"v":0,"d":"0.0"}},{"$f":"'Übersicht Schützen'!D14","v":{"v":0,"d":"0.0"}},{"$f":"'Übersicht Schützen'!E14","v":178.6},{"$f":"'Übersicht Schützen'!F14","v":{"v":0,"d":"0.0"}},{"$f":"'Übersicht Schützen'!G14","v":{"v":0,"d":"0.0"}},{"$f":"'Übersicht Schützen'!H14","v":{"v":0,"d":"0.0"}},{"$f":"'Übersicht Schützen'!I14","v":{"v":178.6,"d":"178.60"}},178.6,{"$f":"'Übersicht Schützen'!L14","v":179.2},{"$f":"'Übersicht Schützen'!M14","v":191.9},{"$f":"'Übersicht Schützen'!N14","v":186.5},{"$f":"'Übersicht Schützen'!O14","v":189.1},{"$f":"'Übersicht Schützen'!P14","v":185.8},{"$f":"'Übersicht Schützen'!Q14","v":{"v":0,"d":"0.0"}},{"$f":"'Übersicht Schützen'!R14","v":{"v":186.5,"d":"186.50"}},932.5,{"$f":"'Übersicht Schützen'!U14","v":{"v":185.1833333333333,"d":"185.18"}},{"v":1111.1,"d":"1,111.1"},{"v":-22.200000000000273,"d":"-22.2"}]
[14,{"$f":"'Übersicht Schützen'!A15","v":"Gretenabeln Elias"},{"$f":"'Übersicht Schützen'!B15","v":"Lorup"},{"$f":"'Übersicht Schützen'!C15","v":110.7},{"$f":"'Übersicht Schützen'!D15","v":111.9},{"$f":"'Übersicht Schützen'!E15","v":82.6},{"$f":"'Übersicht Schützen'!F15","v":128.8},{"$f":"'Übersicht Schützen'!G15","v":{"v":0,"d":"0.0"}},{"$f":"'Übersicht Schützen'!H15","v":{"v":0,"d":"0.0"}},{"$f":"'Übersicht Schützen'!I15","v":{"v":108.50000000000001,"d":"108.50"}},{"v":434.00000000000006,"d":"434.0"},{"$f":"'Übersicht Schützen'!L15","v":105.2},{"$f":"'Übersicht Schützen'!M15","v":117.5},{"$f":"'Übersicht Schützen'!N15","v":148.2},{"$f":"'Übersicht Schützen'!O15","v":{"v":142,"d":"142.0"}},{"$f":"'Übersicht Schützen'!P15","v":148.2},{"$f":"'Übersicht Schützen'!Q15","v":{"v":0,"d":"0.0"}},{"$f":"'Übersicht Schützen'!R15","v":{"v":132.21999999999997,"d":"132.22"}},{"v":661.0999999999999,"d":"661.1"},{"$f":"'Übersicht Schützen'!U15","v":{"v":121.67777777777779,"d":"121.68"}},{"v":1095.1,"d":"1,095.1"},{"v":-16,"d":"-16.0"}]
[15,{"$f":"'Übersicht Schützen'!A16","v":"Többen Jannes"},{"$f":"'Übersicht Schützen'!B16","v":"Lorup"},{"$f":"'Übersicht Schützen'!C16","v":108.5},{"$f":"'Übersicht Schützen'!D16","v":{"v":91,"d":"91.0"}},{"$f":"'Übersicht Schützen'!E16","v":{"v":76,"d":"76.0"}},{"$f":"'Übersicht Schützen'!F16","v":105.4},{"$f":"'Übersicht Schützen'!G16","v":{"v":0,"d":"0.0"}},{"$f":"'Übersicht Schützen'!H16","v":{"v":0,"d":"0.0"}},{"$f":"'Übersicht Schützen'!I16","v":{"v":95.225,"d":"95.23"}},380.9,{"$f":"'Übersicht Schützen'!L16","v":109.5},{"$f":"'Übersicht Schützen'!M16","v":125.6},{"$f":"'Übersicht Schützen'!N16","v":115.3},{"$f":"'Übersicht Schützen'!O16","v":131.9},{"$f":"'Übersicht Schützen'!P16","v":128.3},{"$f":"'Übersicht Schützen'!Q16","v":{"v":0,"d":"0.0"}},{"$f":"'Übersicht Schützen'!R16","v":{"v":122.11999999999998,"d":"122.12"}},{"v":610.5999999999999,"d":"610.6"},{"$f":"'Übersicht Schützen'!U16","v":{"v":110.16666666666667,"d":"110.17"}},{"v":991.4999999999999,"d":"991.5"},{"v":-103.60000000000002,"d":"-103.6"}]
[16,{"$f":"'Übersicht Schützen'!A17","v":"von Seggern Moritz"},{"$f":"'Übersicht Schützen'!B17","v":"Lähden"},{"$f":"'Übersicht Schützen'!C17","v":{"v":0,"d":"0.0"}},{"$f":"'Übersicht Schützen'!D17","v":{"v":0,"d":"0.0"}},{"$f":"'Übersicht Schützen'!E17","v":{"v":0,"d":"0.0"}},{"$f":"'Übersicht Schützen'!F17","v":142.7},{"$f":"'Übersicht Schützen'!G17","v":{"v":0,"d":"0.0"}},{"$f":"'Übersicht Schützen'!H17","v":{"v":0,"d":"0.0"}},{"$f":"'Übersicht Schützen'!I17","v":{"v":142.7,"d":"142.70"}},142.7,{"$f":"'Übersicht Schützen'!L17","v":{"v":133,"d":"133.0"}},{"$f":"'Übersicht Schützen'!M17","v":152.4},{"$f":"'Übersicht Schützen'!N17","v":166.8},{"$f":"'Übersicht Schützen'!O17","v":162.8},{"$f":"'Übersicht Schützen'!P17","v":154.1},{"$f":"'Übersicht Schützen'!Q17","v":{"v":0,"d":"0.0"}},{"$f":"'Übersicht Schützen'!R17","v":153.82},769.1,{"$f":"'Übersicht Schützen'!U17","v":{"v":151.96666666666667,"d":"151.97"}},911.8,{"v":-79.69999999999993,"d":"-79.7"}]
[17,{"$f":"'Übersicht Schützen'!A18","v":"Jansen Lars"},{"$f":"'Übersicht Schützen'!B18","v":"Spahnharenstätte"},{"$f":"'Übersicht Schützen'!C18","v":124.4},{"$f":"'Übersicht Schützen'!D18","v":144.2},{"$f":"'Übersicht Schützen'!E18","v":{"v":119,"d":"119.0"}},{"$f":"'Übersicht Schützen'!F18","v":125.3},{"$f":"'Übersicht Schützen'!G18","v":{"v":0,"d":"0.0"}},{"$f":"'Übersicht Schützen'!H18","v":{"v":0,"d":"0.0"}},{"$f":"'Übersicht Schützen'!I18","v":{"v":128.225,"d":"128.23"}},512.9,{"$f":"'Übersicht Schützen'!L18","v":{"v":0,"d":"0.0"}},{"$f":"'Übersicht Schützen'!M18","v":121.9},{"$f":"'Übersicht Schützen'!N18","v":125.3},{"$f":"'Übersicht Schützen'!O18","v":{"v":0,"d":"0.0"}},{"$f":"'Übersicht Schützen'!P18","v":140.7},{"$f":"'Übersicht Schützen'!Q18","v":{"v":0,"d":"0.0"}},{"$f":"'Übersicht Schützen'!R18","v":{"v":129.29999999999998,"d":"129.30"}},387.9,{"$f":"'Übersicht Schützen'!U18","v":{"v":128.68571428571428,"d":"128.69"}},900.8,{"v":-11,"d":"-11.0"}]
[18,{"$f":"'Übersicht Schützen'!A19","v":"Engbers Hannes"},{"$f":"'Übersicht Schützen'!B19","v":"Spahnharenstätte"},{"$f":"'Übersicht Schützen'!C19","v":67.5},{"$f":"'Übersicht Schützen'!D19","v":54.2},{"$f":"'Übersicht Schützen'!E19","v":{"v":0,"d":"0.0"}},{"$f":"'Übersicht Schützen'!F19","v":78.5},{"$f":"'Übersicht Schützen'!G19","v":{"v":0,"d":"0.0"}},{"$f":"'Übersicht Schützen'!H19","v":{"v":0,"d":"0.0"}},{"$f":"'Übersicht Schützen'!I19","v":{"v":66.73333333333333,"d":"66.73"}},200.2,{"$f":"'Übersicht Schützen'!L19","v":{"v":70,"d":"70.0"}},{"$f":"'Übersicht Schützen'!M19","v":88.4},{"$f":"'Übersicht Schützen'!N19","v":109.8},{"$f":"'Übersicht Schützen'!O19","v":101.5},{"$f":"'Übersicht Schützen'!P19","v":{"v":0,"d":"0.0"}},{"$f":"'Übersicht Schützen'!Q19","v":{"v":0,"d":"0.0"}},{"$f":"'Übersicht Schützen'!R19","v":{"v":92.425,"d":"92.43"}},369.7,{"$f":"'Übersicht Schützen'!U19","v":{"v":81.41428571428573,"d":"81.41"}},569.9,-330.9]
[19,{"$f":"'Übersicht Schützen'!A20","v":"Helmer, Nils"},{"$f":"'Übersicht Schützen'!B20","v":"Lorup"},{"$f":"'Übersicht Schützen'!C20","v":{"v":0,"d":"0.0"}},{"$f":"'Übersicht Schützen'!D20","v":{"v":0,"d":"0.0"}},{"$f":"'Übersicht Schützen'!E20","v":{"v":0,"d":"0.0"}},{"$f":"'Übersicht Schützen'!F20","v":{"v":0,"d":"0.0"}},{"$f":"'Übersicht Schützen'!G20","v":{"v":0,"d":"0.0"}},{"$f":"'Übersicht Schützen'!H20","v":{"v":0,"d":"0.0"}},{"$f":"'Übersicht Schützen'!I20","v":{"v":0,"d":"0.00"}},{"v":0,"d":"0.0"},{"$f":"'Übersicht Schützen'!L20","v":{"v":0,"d":"0.0"}},{"$f":"'Übersicht Schützen'!M20","v":126.2},{"$f":"'Übersicht Schützen'!N20","v":71.8},{"$f":"'Übersicht Schützen'!O20","v":100.1},{"$f":"'Übersicht Schützen'!P20","v":{"v":142,"d":"142.0"}},{"$f":"'Übersicht Schützen'!Q20","v":{"v":0,"d":"0.0"}},{"$f":"'Übersicht Schützen'!R20","v":{"v":110.025,"d":"110.03"}},440.1,{"$f":"'Übersicht Schützen'!U20","v":{"v":110.025,"d":"110.03"}},440.1,{"v":-129.79999999999995,"d":"-129.8"}]
[20,{"$f":"'Übersicht Schützen'!A21","v":"Pieper Jonas"},{"$f":"'Übersicht Schützen'!B21","v":"Esterwegen"},{"$f":"'Übersicht Schützen'!C21","v":{"v":0,"d":"0.0"}},{"$f":"'Übersicht Schützen'!D21","v":{"v":0,"d":"0.0"}},{"$f":"'Übersicht Schützen'!E21","v":{"v":0,"d":"0.0"}},{"$f":"'Übersicht Schützen'!F21","v":{"v":0,"d":"0.0"}},{"$f":"'Übersicht Schützen'!G21","v":{"v":0,"d":"0.0"}},{"$f":"'Übersicht Schützen'!H21","v":{"v":0,"d":"0.0"}},{"$f":"'Übersicht Schützen'!I21","v":{"v":0,"d":"0.00"}},{"v":0,"d":"0.0"},{"$f":"'Übersicht Schützen'!L21","v":{"v":0,"d":"0.0"}},{"$f":"'Übersicht Schützen'!M21","v":147.7},{"$f":"'Übersicht Schützen'!N21","v":118.8},{"$f":"'Übersicht Schützen'!O21","v":117.2},{"$f":"'Übersicht Schützen'!P21","v":{"v":0,"d":"0.0"}},{"$f":"'Übersicht Schützen'!Q21","v":{"v":0,"d":"0.0"}},{"$f":"'Übersicht Schützen'!R21","v":{"v":127.89999999999999,"d":"127.90"}},383.7,{"$f":"'Übersicht Schützen'!U21","v":{"v":127.89999999999999,"d":"127.90"}},383.7,{"v":-56.400000000000034,"d":"-56.4"}]
[21,{"$f":"'Übersicht Schützen'!A22","v":"Lüken Arne"},{"$f":"'Übersicht Schützen'!B22","v":"Lorup"},{"$f":"'Übersicht Schützen'!C22","v":108.9},{"$f":"'Übersicht Schützen'!D22","v":107.8},{"$f":"'Übersicht Schützen'!E22","v":114.4},{"$f":"'Übersicht Schützen'!F22","v":{"v":0,"d":"0.0"}},{"$f":"'Übersicht Schützen'!G22","v":{"v":0,"d":"0.0"}},{"$f":"'Übersicht Schützen'!H22","v":{"v":0,"d":"0.0"}},{"$f":"'Übersicht Schützen'!I22","v":{"v":110.36666666666667,"d":"110.37"}},331.1,{"$f":"'Übersicht Schützen'!L22","v":{"v":0,"d":"0.0"}},{"$f":"'Übersicht Schützen'!M22","v":{"v":0,"d":"0.0"}},{"$f":"'Übersicht Schützen'!N22","v":{"v":0,"d":"0.0"}},{"$f":"'Übersicht Schützen'!O22","v":{"v":0,"d":"0.0"}},{"$f":"'Übersicht Schützen'!P22","v":{"v":0,"d":"0.0"}},{"$f":"'Übersicht Schützen'!Q22","v":{"v":0,"d":"0.0"}},{"$f":"'Übersicht Schützen'!R22","v":{"v":0,"d":"0.00"}},{"v":0,"d":"0.0"},{"$f":"'Übersicht Schützen'!U22","v":{"v":110.36666666666667,"d":"110.37"}},331.1,{"v":-52.599999999999966,"d":"-52.6"}]
[22,{"$f":"'Übersicht Schützen'!A23","v":"Niemann Paul"},{"$f":"'Übersicht Schützen'!B23","v":"Börgermoor"},{"$f":"'Übersicht Schützen'!C23","v":48.5},{"$f":"'Übersicht Schützen'!D23","v":61.7},{"$f":"'Übersicht Schützen'!E23","v":91.5},{"$f":"'Übersicht Schützen'!F23","v":{"v":0,"d":"0.0"}},{"$f":"'Übersicht Schützen'!G23","v":{"v":0,"d":"0.0"}},{"$f":"'Übersicht Schützen'!H23","v":{"v":0,"d":"0.0"}},{"$f":"'Übersicht Schützen'!I23","v":{"v":67.23333333333333,"d":"67.23"}},201.7,{"$f":"'Übersicht Schützen'!L23","v":{"v":0,"d":"0.0"}},{"$f":"'Übersicht Schützen'!M23","v":{"v":0,"d":"0.0"}},{"$f":"'Übersicht Schützen'!N23","v":{"v":0,"d":"0.0"}},{"$f":"'Übersicht Schützen'!O23","v":{"v":0,"d":"0.0"}},{"$f":"'Übersicht Schützen'!P23","v":{"v":0,"d":"0.0"}},{"$f":"'Übersicht Schützen'!Q23","v":{"v":0,"d":"0.0"}},{"$f":"'Übersicht Schützen'!R23","v":{"v":0,"d":"0.00"}},{"v":0,"d":"0.0"},{"$f":"'Übersicht Schützen'!U23","v":{"v":67.23333333333333,"d":"67.23"}},201.7,{"v":-129.40000000000003,"d":"-129.4"}]
[23,{"$f":"'Übersicht Schützen'!A24","v":"Schütze 7"},{"$f":"'Übersicht Schützen'!B24","v":"Sögel"},{"$f":"'Übersicht Schützen'!C24","v":{"v":0,"d":"0.0"}},{"$f":"'Übersicht Schützen'!D24","v":{"v":0,"d":"0.0"}},{"$f":"'Übersicht Schützen'!E24","v":{"v":0,"d":"0.0"}},{"$f":"'Übersicht Schützen'!F24","v":{"v":0,"d":"0.0"}},{"$f":"'Übersicht Schützen'!G24","v":{"v":0,"d":"0.0"}},{"$f":"'Übersicht Schützen'!H24","v":{"v":0,"d":"0.0"}},{"$f":"'Übersicht Schützen'!I24","v":{"v":0,"d":"0.00"}},{"v":0,"d":"0.0"},{"$f":"'Übersicht Schützen'!L24","v":{"v":0,"d":"0.0"}},{"$f":"'Übersicht Schützen'!M24","v":{"v":0,"d":"0.0"}},{"$f":"'Übersicht Schützen'!N24","v":{"v":0,"d":"0.0"}},{"$f":"'Übersicht Schützen'!O24","v":{"v":0,"d":"0.0"}},{"$f":"'Übersicht Schützen'!P24","v":{"v":0,"d":"0.0"}},{"$f":"'Übersicht Schützen'!Q24","v":{"v":0,"d":"0.0"}},{"$f":"'Übersicht Schützen'!R24","v":{"v":0,"d":"0.00"}},{"v":0,"d":"0.0"},{"$f":"'Übersicht Schützen'!U24","v":{"v":0,"d":"0.00"}},{"v":0,"d":"0.0"},-201.7]
[24,{"$f":"'Übersicht Schützen'!A25","v":"Schütze 8"},{"$f":"'Übersicht Schützen'!B25","v":"Sögel"},{"$f":"'Übersicht Schützen'!C25","v":{"v":0,"d":"0.0"}},{"$f":"'Übersicht Schützen'!D25","v":{"v":0,"d":"0.0"}},{"$f":"'Übersicht Schützen'!E25","v":{"v":0,"d":"0.0"}},{"$f":"'Übersicht Schützen'!F25","v":{"v":0,"d":"0.0"}},{"$f":"'Übersicht Schützen'!G25","v":{"v":0,"d":"0.0"}},{"$f":"'Übersicht Schützen'!H25","v":{"v":0,"d":"0.0"}},{"$f":"'Übersicht Schützen'!I25","v":{"v":0,"d":"0.00"}},{"v":0,"d":"0.0"},{"$f":"'Übersicht Schützen'!L25","v":{"v":0,"d":"0.0"}},{"$f":"'Übersicht Schützen'!M25","v":{"v":0,"d":"0.0"}},{"$f":"'Übersicht Schützen'!N25","v":{"v":0,"d":"0.0"}},{"$f":"'Übersicht Schützen'!O25","v":{"v":0,"d":"0.0"}},{"$f":"'Übersicht Schützen'!P25","v":{"v":0,"d":"0.0"}},{"$f":"'Übersicht Schützen'!Q25","v":{"v":0,"d":"0.0"}},{"$f":"'Übersicht Schützen'!R25","v":{"v":0,"d":"0.00"}},{"v":0,"d":"0.0"},{"$f":"'Übersicht Schützen'!U25","v":{"v":0,"d":"0.00"}},{"v":0,"d":"0.0"},{"v":0,"d":"0.0"}]
[25,{"$f":"'Übersicht Schützen'!A26","v":"Schütze 9"},{"$f":"'Übersicht Schützen'!B26","v":"Sögel"},{"$f":"'Übersicht Schützen'!C26","v":{"v":0,"d":"0.0"}},{"$f":"'Übersicht Schützen'!D26","v":{"v":0,"d":"0.0"}},{"$f":"'Übersicht Schützen'!E26","v":{"v":0,"d":"0.0"}},{"$f":"'Übersicht Schützen'!F26","v":{"v":0,"d":"0.0"}},{"$f":"'Übersicht Schützen'!G26","v":{"v":0,"d":"0.0"}},{"$f":"'Übersicht Schützen'!H26","v":{"v":0,"d":"0.0"}},{"$f":"'Übersicht Schützen'!I26","v":{"v":0,"d":"0.00"}},{"v":0,"d":"0.0"},{"$f":"'Übersicht Schützen'!L26","v":{"v":0,"d":"0.0"}},{"$f":"'Übersicht Schützen'!M26","v":{"v":0,"d":"0.0"}},{"$f":"'Übersicht Schützen'!N26","v":{"v":0,"d":"0.0"}},{"$f":"'Übersicht Schützen'!O26","v":{"v":0,"d":"0.0"}},{"$f":"'Übersicht Schützen'!P26","v":{"v":0,"d":"0.0"}},{"$f":"'Übersicht Schützen'!Q26","v":{"v":0,"d":"0.0"}},{"$f":"'Übersicht Schützen'!R26","v":{"v":0,"d":"0.00"}},{"v":0,"d":"0.0"},{"$f":"'Übersicht Schützen'!U26","v":{"v":0,"d":"0.00"}},{"v":0,"d":"0.0"},{"v":0,"d":"0.0"}]
[26,{"$f":"'Übersicht Schützen'!A27","v":"Schütze 10"},{"$f":"'Übersicht Schützen'!B27","v":"Sögel"},{"$f":"'Übersicht Schützen'!C27","v":{"v":0,"d":"0.0"}},{"$f":"'Übersicht Schützen'!D27","v":{"v":0,"d":"0.0"}},{"$f":"'Übersicht Schützen'!E27","v":{"v":0,"d":"0.0"}},{"$f":"'Übersicht Schützen'!F27","v":{"v":0,"d":"0.0"}},{"$f":"'Übersicht Schützen'!G27","v":{"v":0,"d":"0.0"}},{"$f":"'Übersicht Schützen'!H27","v":{"v":0,"d":"0.0"}},{"$f":"'Übersicht Schützen'!I27","v":{"v":0,"d":"0.00"}},{"v":0,"d":"0.0"},{"$f":"'Übersicht Schützen'!L27","v":{"v":0,"d":"0.0"}},{"$f":"'Übersicht Schützen'!M27","v":{"v":0,"d":"0.0"}},{"$f":"'Übersicht Schützen'!N27","v":{"v":0,"d":"0.0"}},{"$f":"'Übersicht Schützen'!O27","v":{"v":0,"d":"0.0"}},{"$f":"'Übersicht Schützen'!P27","v":{"v":0,"d":"0.0"}},{"$f":"'Übersicht Schützen'!Q27","v":{"v":0,"d":"0.0"}},{"$f":"'Übersicht Schützen'!R27","v":{"v":0,"d":"0.00"}},{"v":0,"d":"0.0"},{"$f":"'Übersicht Schützen'!U27","v":{"v":0,"d":"0.00"}},{"v":0,"d":"0.0"},{"v":0,"d":"0.0"}]
[27,{"$f":"'Übersicht Schützen'!A28","v":"Schütze 14"},{"$f":"'Übersicht Schützen'!B28","v":"Spahnharenstätte"},{"$f":"'Übersicht Schützen'!C28","v":{"v":0,"d":"0.0"}},{"$f":"'Übersicht Schützen'!D28","v":{"v":0,"d":"0.0"}},{"$f":"'Übersicht Schützen'!E28","v":{"v":0,"d":"0.0"}},{"$f":"'Übersicht Schützen'!F28","v":{"v":0,"d":"0.0"}},{"$f":"'Übersicht Schützen'!G28","v":{"v":0,"d":"0.0"}},{"$f":"'Übersicht Schützen'!H28","v":{"v":0,"d":"0.0"}},{"$f":"'Übersicht Schützen'!I28","v":{"v":0,"d":"0.00"}},{"v":0,"d":"0.0"},{"$f":"'Übersicht Schützen'!L28","v":{"v":0,"d":"0.0"}},{"$f":"'Übersicht Schützen'!M28","v":{"v":0,"d":"0.0"}},{"$f":"'Übersicht Schützen'!N28","v":{"v":0,"d":"0.0"}},{"$f":"'Übersicht Schützen'!O28","v":{"v":0,"d":"0.0"}},{"$f":"'Übersicht Schützen'!P28","v":{"v":0,"d":"0.0"}},{"$f":"'Übersicht Schützen'!Q28","v":{"v":0,"d":"0.0"}},{"$f":"'Übersicht Schützen'!R28","v":{"v":0,"d":"0.00"}},{"v":0,"d":"0.0"},{"$f":"'Übersicht Schützen'!U28","v":{"v":0,"d":"0.00"}},{"v":0,"d":"0.0"},{"v":0,"d":"0.0"}]
[28,{"$f":"'Übersicht Schützen'!A29","v":"Schütze 15"},{"$f":"'Übersicht Schützen'!B29","v":"Spahnharenstätte"},{"$f":"'Übersicht Schützen'!C29","v":{"v":0,"d":"0.0"}},{"$f":"'Übersicht Schützen'!D29","v":{"v":0,"d":"0.0"}},{"$f":"'Übersicht Schützen'!E29","v":{"v":0,"d":"0.0"}},{"$f":"'Übersicht Schützen'!F29","v":{"v":0,"d":"0.0"}},{"$f":"'Übersicht Schützen'!G29","v":{"v":0,"d":"0.0"}},{"$f":"'Übersicht Schützen'!H29","v":{"v":0,"d":"0.0"}},{"$f":"'Übersicht Schützen'!I29","v":{"v":0,"d":"0.00"}},{"v":0,"d":"0.0"},{"$f":"'Übersicht Schützen'!L29","v":{"v":0,"d":"0.0"}},{"$f":"'Übersicht Schützen'!M29","v":{"v":0,"d":"0.0"}},{"$f":"'Übersicht Schützen'!N29","v":{"v":0,"d":"0.0"}},{"$f":"'Übersicht Schützen'!O29","v":{"v":0,"d":"0.0"}},{"$f":"'Übersicht Schützen'!P29","v":{"v":0,"d":"0.0"}},{"$f":"'Übersicht Schützen'!Q29","v":{"v":0,"d":"0.0"}},{"$f":"'Übersicht Schützen'!R29","v":{"v":0,"d":"0.00"}},{"v":0,"d":"0.0"},{"$f":"'Übersicht Schützen'!U29","v":{"v":0,"d":"0.00"}},{"v":0,"d":"0.0"},{"v":0,"d":"0.0"}]
[29,{"$f":"'Übersicht Schützen'!A30","v":"Schütze 20"},{"$f":"'Übersicht Schützen'!B30","v":"Esterwegen"},{"$f":"'Übersicht Schützen'!C30","v":{"v":0,"d":"0.0"}},{"$f":"'Übersicht Schützen'!D30","v":{"v":0,"d":"0.0"}},{"$f":"'Übersicht Schützen'!E30","v":{"v":0,"d":"0.0"}},{"$f":"'Übersicht Schützen'!F30","v":{"v":0,"d":"0.0"}},{"$f":"'Übersicht Schützen'!G30","v":{"v":0,"d":"0.0"}},{"$f":"'Übersicht Schützen'!H30","v":{"v":0,"d":"0.0"}},{"$f":"'Übersicht Schützen'!I30","v":{"v":0,"d":"0.00"}},{"v":0,"d":"0.0"},{"$f":"'Übersicht Schützen'!L30","v":{"v":0,"d":"0.0"}},{"$f":"'Übersicht Schützen'!M30","v":{"v":0,"d":"0.0"}},{"$f":"'Übersicht Schützen'!N30","v":{"v":0,"d":"0.0"}},{"$f":"'Übersicht Schützen'!O30","v":{"v":0,"d":"0.0"}},{"$f":"'Übersicht Schützen'!P30","v":{"v":0,"d":"0.0"}},{"$f":"'Übersicht Schützen'!Q30","v":{"v":0,"d":"0.0"}},{"$f":"'Übersicht Schützen'!R30","v":{"v":0,"d":"0.00"}},{"v":0,"d":"0.0"},{"$f":"'Übersicht Schützen'!U30","v":{"v":0,"d":"0.00"}},{"v":0,"d":"0.0"},{"v":0,"d":"0.0"}]
[30,{"$f":"'Übersicht Schützen'!A31","v":"Schütze 29"},{"$f":"'Übersicht Schützen'!B31","v":"Börgermoor"},{"$f":"'Übersicht Schützen'!C31","v":{"v":0,"d":"0.0"}},{"$f":"'Übersicht Schützen'!D31","v":{"v":0,"d":"0.0"}},{"$f":"'Übersicht Schützen'!E31","v":{"v":0,"d":"0.0"}},{"$f":"'Übersicht Schützen'!F31","v":{"v":0,"d":"0.0"}},{"$f":"'Übersicht Schützen'!G31","v":{"v":0,"d":"0.0"}},{"$f":"'Übersicht Schützen'!H31","v":{"v":0,"d":"0.0"}},{"$f":"'Übersicht Schützen'!I31","v":{"v":0,"d":"0.00"}},{"v":0,"d":"0.0"},{"$f":"'Übersicht Schützen'!L31","v":{"v":0,"d":"0.0"}},{"$f":"'Übersicht Schützen'!M31","v":{"v":0,"d":"0.0"}},{"$f":"'Übersicht Schützen'!N31","v":{"v":0,"d":"0.0"}},{"$f":"'Übersicht Schützen'!O31","v":{"v":0,"d":"0.0"}},{"$f":"'Übersicht Schützen'!P31","v":{"v":0,"d":"0.0"}},{"$f":"'Übersicht Schützen'!Q31","v":{"v":0,"d":"0.0"}},{"$f":"'Übersicht Schützen'!R31","v":{"v":0,"d":"0.00"}},{"v":0,"d":"0.0"},{"$f":"'Übersicht Schützen'!U31","v":{"v":0,"d":"0.00"}},{"v":0,"d":"0.0"},{"v":0,"d":"0.0"}]
[31,{"$f":"'Übersicht Schützen'!A32","v":"Schütze 30"},{"$f":"'Übersicht Schützen'!B32","v":"Börgermoor"},{"$f":"'Übersicht Schützen'!C32","v":{"v":0,"d":"0.0"}},{"$f":"'Übersicht Schützen'!D32","v":{"v":0,"d":"0.0"}},{"$f":"'Übersicht Schützen'!E32","v":{"v":0,"d":"0.0"}},{"$f":"'Übersicht Schützen'!F32","v":{"v":0,"d":"0.0"}},{"$f":"'Übersicht Schützen'!G32","v":{"v":0,"d":"0.0"}},{"$f":"'Übersicht Schützen'!H32","v":{"v":0,"d":"0.0"}},{"$f":"'Übersicht Schützen'!I32","v":{"v":0,"d":"0.00"}},{"v":0,"d":"0.0"},{"$f":"'Übersicht Schützen'!L32","v":{"v":0,"d":"0.0"}},{"$f":"'Übersicht Schützen'!M32","v":{"v":0,"d":"0.0"}},{"$f":"'Übersicht Schützen'!N32","v":{"v":0,"d":"0.0"}},{"$f":"'Übersicht Schützen'!O32","v":{"v":0,"d":"0.0"}},{"$f":"'Übersicht Schützen'!P32","v":{"v":0,"d":"0.0"}},{"$f":"'Übersicht Schützen'!Q32","v":{"v":0,"d":"0.0"}},{"$f":"'Übersicht Schützen'!R32","v":{"v":0,"d":"0.00"}},{"v":0,"d":"0.0"},{"$f":"'Übersicht Schützen'!U32","v":{"v":0,"d":"0.00"}},{"v":0,"d":"0.0"},{"$f":"(U52-U53)*-1","v":{"v":0,"d":"0.0"}}]
[32,{"$f":"'Übersicht Schützen'!A33","v":"Stümpler Jan Luka "},{"$f":"'Übersicht Schützen'!B33","v":"Lähden"},{"$f":"'Übersicht Schützen'!C33","v":{"v":0,"d":"0.0"}},{"$f":"'Übersicht Schützen'!D33","v":{"v":0,"d":"0.0"}},{"$f":"'Übersicht Schützen'!E33","v":{"v":0,"d":"0.0"}},{"$f":"'Übersicht Schützen'!F33","v":{"v":0,"d":"0.0"}},{"$f":"'Übersicht Schützen'!G33","v":{"v":0,"d":"0.0"}},{"$f":"'Übersicht Schützen'!H33","v":{"v":0,"d":"0.0"}},{"$f":"'Übersicht Schützen'!I33","v":{"v":0,"d":"0.00"}},{"v":0,"d":"0.0"},{"$f":"'Übersicht Schützen'!L33","v":{"v":0,"d":"0.0"}},{"$f":"'Übersicht Schützen'!M33","v":{"v":0,"d":"0.0"}},{"$f":"'Übersicht Schützen'!N33","v":{"v":0,"d":"0.0"}},{"$f":"'Übersicht Schützen'!O33","v":{"v":0,"d":"0.0"}},{"$f":"'Übersicht Schützen'!P33","v":{"v":0,"d":"0.0"}},{"$f":"'Übersicht Schützen'!Q33","v":{"v":0,"d":"0.0"}},{"$f":"'Übersicht Schützen'!R33","v":{"v":0,"d":"0.00"}},{"v":0,"d":"0.0"},{"$f":"'Übersicht Schützen'!U33","v":{"v":0,"d":"0.00"}},{"v":0,"d":"0.0"},{"v":0,"d":"0.0"}]
[33,{"$f":"'Übersicht Schützen'!A34","v":"Schütze 33"},{"$f":"'Übersicht Schützen'!B34","v":"Verein VII"},{"$f":"'Übersicht Schützen'!C34","v":{"v":0,"d":"0.0"}},{"$f":"'Übersicht Schützen'!D34","v":{"v":0,"d":"0.0"}},{"$f":"'Übersicht Schützen'!E34","v":{"v":0,"d":"0.0"}},{"$f":"'Übersicht Schützen'!F34","v":{"v":0,"d":"0.0"}},{"$f":"'Übersicht Schützen'!G34","v":{"v":0,"d":"0.0"}},{"$f":"'Übersicht Schützen'!H34","v":{"v":0,"d":"0.0"}},{"$f":"'Übersicht Schützen'!I34","v":{"v":0,"d":"0.00"}},{"v":0,"d":"0.0"},{"$f":"'Übersicht Schützen'!L34","v":{"v":0,"d":"0.0"}},{"$f":"'Übersicht Schützen'!M34","v":{"v":0,"d":"0.0"}},{"$f":"'Übersicht Schützen'!N34","v":{"v":0,"d":"0.0"}},{"$f":"'Übersicht Schützen'!O34","v":{"v":0,"d":"0.0"}},{"$f":"'Übersicht Schützen'!P34","v":{"v":0,"d":"0.0"}},{"$f":"'Übersicht Schützen'!Q34","v":{"v":0,"d":"0.0"}},{"$f":"'Übersicht Schützen'!R34","v":{"v":0,"d":"0.00"}},{"v":0,"d":"0.0"},{"$f":"'Übersicht Schützen'!U34","v":{"v":0,"d":"0.00"}},{"v":0,"d":"0.0"},{"v":0,"d":"0.0"}]
[34,{"$f":"'Übersicht Schützen'!A35","v":"Schütze 34"},{"$f":"'Übersicht Schützen'!B35","v":"Verein VII"},{"$f":"'Übersicht Schützen'!C35","v":{"v":0,"d":"0.0"}},{"$f":"'Übersicht Schützen'!D35","v":{"v":0,"d":"0.0"}},{"$f":"'Übersicht Schützen'!E35","v":{"v":0,"d":"0.0"}},{"$f":"'Übersicht Schützen'!F35","v":{"v":0,"d":"0.0"}},{"$f":"'Übersicht Schützen'!G35","v":{"v":0,"d":"0.0"}},{"$f":"'Übersicht Schützen'!H35","v":{"v":0,"d":"0.0"}},{"$f":"'Übersicht Schützen'!I35","v":{"v":0,"d":"0.00"}},{"v":0,"d":"0.0"},{"$f":"'Übersicht Schützen'!L35","v":{"v":0,"d":"0.0"}},{"$f":"'Übersicht Schützen'!M35","v":{"v":0,"d":"0.0"}},{"$f":"'Übersicht Schützen'!N35","v":{"v":0,"d":"0.0"}},{"$f":"'Übersicht Schützen'!O35","v":{"v":0,"d":"0.0"}},{"$f":"'Übersicht Schützen'!P35","v":{"v":0,"d":"0.0"}},{"$f":"'Übersicht Schützen'!Q35","v":{"v":0,"d":"0.0"}},{"$f":"'Übersicht Schützen'!R35","v":{"v":0,"d":"0.00"}},{"v":0,"d":"0.0"},{"$f":"'Übersicht Schützen'!U35","v":{"v":0,"d":"0.00"}},{"v":0,"d":"0.0"},{"v":0,"d":"0.0"}]
[35,{"$f":"'Übersicht Schützen'!A36","v":"Schütze 35"},{"$f":"'Übersicht Schützen'!B36","v":"Verein VII"},{"$f":"'Übersicht Schützen'!C36","v":{"v":0,"d":"0.0"}},{"$f":"'Übersicht Schützen'!D36","v":{"v":0,"d":"0.0"}},{"$f":"'Übersicht Schützen'!E36","v":{"v":0,"d":"0.0"}},{"$f":"'Übersicht Schützen'!F36","v":{"v":0,"d":"0.0"}},{"$f":"'Übersicht Schützen'!G36","v":{"v":0,"d":"0.0"}},{"$f":"'Übersicht Schützen'!H36","v":{"v":0,"d":"0.0"}},{"$f":"'Übersicht Schützen'!I36","v":{"v":0,"d":"0.00"}},{"v":0,"d":"0.0"},{"$f":"'Übersicht Schützen'!L36","v":{"v":0,"d":"0.0"}},{"$f":"'Übersicht Schützen'!M36","v":{"v":0,"d":"0.0"}},{"$f":"'Übersicht Schützen'!N36","v":{"v":0,"d":"0.0"}},{"$f":"'Übersicht Schützen'!O36","v":{"v":0,"d":"0.0"}},{"$f":"'Übersicht Schützen'!P36","v":{"v":0,"d":"0.0"}},{"$f":"'Übersicht Schützen'!Q36","v":{"v":0,"d":"0.0"}},{"$f":"'Übersicht Schützen'!R36","v":{"v":0,"d":"0.00"}},{"v":0,"d":"0.0"},{"$f":"'Übersicht Schützen'!U36","v":{"v":0,"d":"0.00"}},{"v":0,"d":"0.0"},{"$f":"(U56-U57)*-1","v":{"v":0,"d":"0.0"}}]
[36,{"$f":"'Übersicht Schützen'!A37","v":"Schütze 36"},{"$f":"'Übersicht Schützen'!B37","v":"Verein VII"},{"$f":"'Übersicht Schützen'!C37","v":{"v":0,"d":"0.0"}},{"$f":"'Übersicht Schützen'!D37","v":{"v":0,"d":"0.0"}},{"$f":"'Übersicht Schützen'!E37","v":{"v":0,"d":"0.0"}},{"$f":"'Übersicht Schützen'!F37","v":{"v":0,"d":"0.0"}},{"$f":"'Übersicht Schützen'!G37","v":{"v":0,"d":"0.0"}},{"$f":"'Übersicht Schützen'!H37","v":{"v":0,"d":"0.0"}},{"$f":"'Übersicht Schützen'!I37","v":{"v":0,"d":"0.00"}},{"v":0,"d":"0.0"},{"$f":"'Übersicht Schützen'!L37","v":{"v":0,"d":"0.0"}},{"$f":"'Übersicht Schützen'!M37","v":{"v":0,"d":"0.0"}},{"$f":"'Übersicht Schützen'!N37","v":{"v":0,"d":"0.0"}},{"$f":"'Übersicht Schützen'!O37","v":{"v":0,"d":"0.0"}},{"$f":"'Übersicht Schützen'!P37","v":{"v":0,"d":"0.0"}},{"$f":"'Übersicht Schützen'!Q37","v":{"v":0,"d":"0.0"}},{"$f":"'Übersicht Schützen'!R37","v":{"v":0,"d":"0.00"}},{"v":0,"d":"0.0"},{"$f":"'Übersicht Schützen'!U37","v":{"v":0,"d":"0.00"}},{"v":0,"d":"0.0"},{"v":0,"d":"0.0"}]
[37,{"$f":"'Übersicht Schützen'!A38","v":"Schütze 37"},{"$f":"'Übersicht Schützen'!B38","v":"Verein VII"},{"$f":"'Übersicht Schützen'!C38","v":{"v":0,"d":"0.0"}},{"$f":"'Übersicht Schützen'!D38","v":{"v":0,"d":"0.0"}},{"$f":"'Übersicht Schützen'!E38","v":{"v":0,"d":"0.0"}},{"$f":"'Übersicht Schützen'!F38","v":{"v":0,"d":"0.0"}},{"$f":"'Übersicht Schützen'!G38","v":{"v":0,"d":"0.0"}},{"$f":"'Übersicht Schützen'!H38","v":{"v":0,"d":"0.0"}},{"$f":"'Übersicht Schützen'!I38","v":{"v":0,"d":"0.00"}},{"$f":"SUM(D59:I59)","v":{"v":0,"d":"0.0"}},{"$f":"'Übersicht Schützen'!L38","v":{"v":0,"d":"0.0"}},{"$f":"'Übersicht Schützen'!M38","v":{"v":0,"d":"0.0"}},{"$f":"'Übersicht Schützen'!N38","v":{"v":0,"d":"0.0"}},{"$f":"'Übersicht Schützen'!O38","v":{"v":0,"d":"0.0"}},{"$f":"'Übersicht Schützen'!P38","v":{"v":0,"d":"0.0"}},{"$f":"'Übersicht Schützen'!Q38","v":{"v":0,"d":"0.0"}},{"$f":"'Übersicht Schützen'!R38","v":{"v":0,"d":"0.00"}},{"$f":"SUM(L59:Q59)","v":{"v":0,"d":"0.0"}},{"$f":"'Übersicht Schützen'!U38","v":{"v":0,"d":"0.00"}},{"$f":"SUM(K59+S59)","v":{"v":0,"d":"0.0"}},{"$f":"(U58-U59)*-1","v":{"v":0,"d":"0.0"}}]
[38,{"$f":"'Übersicht Schützen'!A39","v":"Schütze 38"},{"$f":"'Übersicht Schützen'!B39","v":"Verein VIII"},{"$f":"'Übersicht Schützen'!C39","v":{"v":0,"d":"0.0"}},{"$f":"'Übersicht Schützen'!D39","v":{"v":0,"d":"0.0"}},{"$f":"'Übersicht Schützen'!E39","v":{"v":0,"d":"0.0"}},{"$f":"'Übersicht Schützen'!F39","v":{"v":0,"d":"0.0"}},{"$f":"'Übersicht Schützen'!G39","v":{"v":0,"d":"0.0"}},{"$f":"'Übersicht Schützen'!H39","v":{"v":0,"d":"0.0"}},{"$f":"'Übersicht Schützen'!I39","v":{"v":0,"d":"0.00"}},{"v":0,"d":"0.0"},{"$f":"'Übersicht Schützen'!L39","v":{"v":0,"d":"0.0"}},{"$f":"'Übersicht Schützen'!M39","v":{"v":0,"d":"0.0"}},{"$f":"'Übersicht Schützen'!N39","v":{"v":0,"d":"0.0"}},{"$f":"'Übersicht Schützen'!O39","v":{"v":0,"d":"0.0"}},{"$f":"'Übersicht Schützen'!P39","v":{"v":0,"d":"0.0"}},{"$f":"'Übersicht Schützen'!Q39","v":{"v":0,"d":"0.0"}},{"$f":"'Übersicht Schützen'!R39","v":{"v":0,"d":"0.00"}},{"v":0,"d":"0.0"},{"$f":"'Übersicht Schützen'!U39","v":{"v":0,"d":"0.00"}},{"v":0,"d":"0.0"},{"v":0,"d":"0.0"}]
[39,{"$f":"'Übersicht Schützen'!A40","v":"Schütze 39"},{"$f":"'Übersicht Schützen'!B40","v":"Verein VIII"},{"$f":"'Übersicht Schützen'!C40","v":{"v":0,"d":"0.0"}},{"$f":"'Übersicht Schützen'!D40","v":{"v":0,"d":"0.0"}},{"$f":"'Übersicht Schützen'!E40","v":{"v":0,"d":"0.0"}},{"$f":"'Übersicht Schützen'!F40","v":{"v":0,"d":"0.0"}},{"$f":"'Übersicht Schützen'!G40","v":{"v":0,"d":"0.0"}},{"$f":"'Übersicht Schützen'!H40","v":{"v":0,"d":"0.0"}},{"$f":"'Übersicht Schützen'!I40","v":{"v":0,"d":"0.00"}},{"v":0,"d":"0.0"},{"$f":"'Übersicht Schützen'!L40","v":{"v":0,"d":"0.0"}},{"$f":"'Übersicht Schützen'!M40","v":{"v":0,"d":"0.0"}},{"$f":"'Übersicht Schützen'!N40","v":{"v":0,"d":"0.0"}},{"$f":"'Übersicht Schützen'!O40","v":{"v":0,"d":"0.0"}},{"$f":"'Übersicht Schützen'!P40","v":{"v":0,"d":"0.0"}},{"$f":"'Übersicht Schützen'!Q40","v":{"v":0,"d":"0.0"}},{"$f":"'Übersicht Schützen'!R40","v":{"v":0,"d":"0.00"}},{"v":0,"d":"0.0"},{"$f":"'Übersicht Schützen'!U40","v":{"v":0,"d":"0.00"}},{"v":0,"d":"0.0"},{"v":0,"d":"0.0"}]
[40,{"$f":"'Übersicht Schützen'!A41","v":"Schütze 40"},{"$f":"'Übersicht Schützen'!B41","v":"Verein VIII"},{"$f":"'Übersicht Schützen'!C41","v":{"v":0,"d":"0.0"}},{"$f":"'Übersicht Schützen'!D41","v":{"v":0,"d":"0.0"}},{"$f":"'Übersicht Schützen'!E41","v":{"v":0,"d":"0.0"}},{"$f":"'Übersicht Schützen'!F41","v":{"v":0,"d":"0.0"}},{"$f":"'Übersicht Schützen'!G41","v":{"v":0,"d":"0.0"}},{"$f":"'Übersicht Schützen'!H41","v":{"v":0,"d":"0.0"}},{"$f":"'Übersicht Schützen'!I41","v":{"v":0,"d":"0.00"}},{"v":0,"d":"0.0"},{"$f":"'Übersicht Schützen'!L41","v":{"v":0,"d":"0.0"}},{"$f":"'Übersicht Schützen'!M41","v":{"v":0,"d":"0.0"}},{"$f":"'Übersicht Schützen'!N41","v":{"v":0,"d":"0.0"}},{"$f":"'Übersicht Schützen'!O41","v":{"v":0,"d":"0.0"}},{"$f":"'Übersicht Schützen'!P41","v":{"v":0,"d":"0.0"}},{"$f":"'Übersicht Schützen'!Q41","v":{"v":0,"d":"0.0"}},{"$f":"'Übersicht Schützen'!R41","v":{"v":0,"d":"0.00"}},{"v":0,"d":"0.0"},{"$f":"'Übersicht Schützen'!U41","v":{"v":0,"d":"0.00"}},{"v":0,"d":"0.0"},{"v":0,"d":"0.0"}]
[41,{"$f":"'Übersicht Schützen'!A42","v":"Schütze 41"},{"$f":"'Übersicht Schützen'!B42","v":"Verein IX"},{"$f":"'Übersicht Schützen'!C42","v":{"v":0,"d":"0.0"}},{"$f":"'Übersicht Schützen'!D42","v":{"v":0,"d":"0.0"}},{"$f":"'Übersicht Schützen'!E42","v":{"v":0,"d":"0.0"}},{"$f":"'Übersicht Schützen'!F42","v":{"v":0,"d":"0.0"}},{"$f":"'Übersicht Schützen'!G42","v":{"v":0,"d":"0.0"}},{"$f":"'Übersicht Schützen'!H42","v":{"v":0,"d":"0.0"}},{"$f":"'Übersicht Schützen'!I42","v":{"v":0,"d":"0.00"}},{"v":0,"d":"0.0"},{"$f":"'Übersicht Schützen'!L42","v":{"v":0,"d":"0.0"}},{"$f":"'Übersicht Schützen'!M42","v":{"v":0,"d":"0.0"}},{"$f":"'Übersicht Schützen'!N42","v":{"v":0,"d":"0.0"}},{"$f":"'Übersicht Schützen'!O42","v":{"v":0,"d":"0.0"}},{"$f":"'Übersicht Schützen'!P42","v":{"v":0,"d":"0.0"}},{"$f":"'Übersicht Schützen'!Q42","v":{"v":0,"d":"0.0"}},{"$f":"'Übersicht Schützen'!R42","v":{"v":0,"d":"0.00"}},{"v":0,"d":"0.0"},{"$f":"'Übersicht Schützen'!U42","v":{"v":0,"d":"0.00"}},{"v":0,"d":"0.0"},{"v":0,"d":"0.0"}]
[42,{"$f":"'Übersicht Schützen'!A43","v":"Schütze 42"},{"$f":"'Übersicht Schützen'!B43","v":"Verein IX"},{"$f":"'Übersicht Schützen'!C43","v":{"v":0,"d":"0.0"}},{"$f":"'Übersicht Schützen'!D43","v":{"v":0,"d":"0.0"}},{"$f":"'Übersicht Schützen'!E43","v":{"v":0,"d":"0.0"}},{"$f":"'Übersicht Schützen'!F43","v":{"v":0,"d":"0.0"}},{"$f":"'Übersicht Schützen'!G43","v":{"v":0,"d":"0.0"}},{"$f":"'Übersicht Schützen'!H43","v":{"v":0,"d":"0.0"}},{"$f":"'Übersicht Schützen'!I43","v":{"v":0,"d":"0.00"}},{"v":0,"d":"0.0"},{"$f":"'Übersicht Schützen'!L43","v":{"v":0,"d":"0.0"}},{"$f":"'Übersicht Schützen'!M43","v":{"v":0,"d":"0.0"}},{"$f":"'Übersicht Schützen'!N43","v":{"v":0,"d":"0.0"}},{"$f":"'Übersicht Schützen'!O43","v":{"v":0,"d":"0.0"}},{"$f":"'Übersicht Schützen'!P43","v":{"v":0,"d":"0.0"}},{"$f":"'Übersicht Schützen'!Q43","v":{"v":0,"d":"0.0"}},{"$f":"'Übersicht Schützen'!R43","v":{"v":0,"d":"0.00"}},{"v":0,"d":"0.0"},{"$f":"'Übersicht Schützen'!U43","v":{"v":0,"d":"0.00"}},{"v":0,"d":"0.0"},{"v":0,"d":"0.0"}]
[43,{"$f":"'Übersicht Schützen'!A44","v":"Schütze 43"},{"$f":"'Übersicht Schützen'!B44","v":"Verein IX"},{"$f":"'Übersicht Schützen'!C44","v":{"v":0,"d":"0.0"}},{"$f":"'Übersicht Schützen'!D44","v":{"v":0,"d":"0.0"}},{"$f":"'Übersicht Schützen'!E44","v":{"v":0,"d":"0.0"}},{"$f":"'Übersicht Schützen'!F44","v":{"v":0,"d":"0.0"}},{"$f":"'Übersicht Schützen'!G44","v":{"v":0,"d":"0.0"}},{"$f":"'Übersicht Schützen'!H44","v":{"v":0,"d":"0.0"}},{"$f":"'Übersicht Schützen'!I44","v":{"v":0,"d":"0.00"}},{"v":0,"d":"0.0"},{"$f":"'Übersicht Schützen'!L44","v":{"v":0,"d":"0.0"}},{"$f":"'Übersicht Schützen'!M44","v":{"v":0,"d":"0.0"}},{"$f":"'Übersicht Schützen'!N44","v":{"v":0,"d":"0.0"}},{"$f":"'Übersicht Schützen'!O44","v":{"v":0,"d":"0.0"}},{"$f":"'Übersicht Schützen'!P44","v":{"v":0,"d":"0.0"}},{"$f":"'Übersicht Schützen'!Q44","v":{"v":0,"d":"0.0"}},{"$f":"'Übersicht Schützen'!R44","v":{"v":0,"d":"0.00"}},{"v":0,"d":"0.0"},{"$f":"'Übersicht Schützen'!U44","v":{"v":0,"d":"0.00"}},{"v":0,"d":"0.0"},{"v":0,"d":"0.0"}]
[44,{"$f":"'Übersicht Schützen'!A45","v":"Schütze 44"},{"$f":"'Übersicht Schützen'!B45","v":"Verein IX"},{"$f":"'Übersicht Schützen'!C45","v":{"v":0,"d":"0.0"}},{"$f":"'Übersicht Schützen'!D45","v":{"v":0,"d":"0.0"}},{"$f":"'Übersicht Schützen'!E45","v":{"v":0,"d":"0.0"}},{"$f":"'Übersicht Schützen'!F45","v":{"v":0,"d":"0.0"}},{"$f":"'Übersicht Schützen'!G45","v":{"v":0,"d":"0.0"}},{"$f":"'Übersicht Schützen'!H45","v":{"v":0,"d":"0.0"}},{"$f":"'Übersicht Schützen'!I45","v":{"v":0,"d":"0.00"}},{"v":0,"d":"0.0"},{"$f":"'Übersicht Schützen'!L45","v":{"v":0,"d":"0.0"}},{"$f":"'Übersicht Schützen'!M45","v":{"v":0,"d":"0.0"}},{"$f":"'Übersicht Schützen'!N45","v":{"v":0,"d":"0.0"}},{"$f":"'Übersicht Schützen'!O45","v":{"v":0,"d":"0.0"}},{"$f":"'Übersicht Schützen'!P45","v":{"v":0,"d":"0.0"}},{"$f":"'Übersicht Schützen'!Q45","v":{"v":0,"d":"0.0"}},{"$f":"'Übersicht Schützen'!R45","v":{"v":0,"d":"0.00"}},{"v":0,"d":"0.0"},{"$f":"'Übersicht Schützen'!U45","v":{"v":0,"d":"0.00"}},{"v":0,"d":"0.0"},{"v":0,"d":"0.0"}]
[45,{"$f":"'Übersicht Schützen'!A46","v":"Schütze 45"},{"$f":"'Übersicht Schützen'!B46","v":"Verein IX"},{"$f":"'Übersicht Schützen'!C46","v":{"v":0,"d":"0.0"}},{"$f":"'Übersicht Schützen'!D46","v":{"v":0,"d":"0.0"}},{"$f":"'Übersicht Schützen'!E46","v":{"v":0,"d":"0.0"}},{"$f":"'Übersicht Schützen'!F46","v":{"v":0,"d":"0.0"}},{"$f":"'Übersicht Schützen'!G46","v":{"v":0,"d":"0.0"}},{"$f":"'Übersicht Schützen'!H46","v":{"v":0,"d":"0.0"}},{"$f":"'Übersicht Schützen'!I46","v":{"v":0,"d":"0.00"}},{"v":0,"d":"0.0"},{"$f":"'Übersicht Schützen'!L46","v":{"v":0,"d":"0.0"}},{"$f":"'Übersicht Schützen'!M46","v":{"v":0,"d":"0.0"}},{"$f":"'Übersicht Schützen'!N46","v":{"v":0,"d":"0.0"}},{"$f":"'Übersicht Schützen'!O46","v":{"v":0,"d":"0.0"}},{"$f":"'Übersicht Schützen'!P46","v":{"v":0,"d":"0.0"}},{"$f":"'Übersicht Schützen'!Q46","v":{"v":0,"d":"0.0"}},{"$f":"'Übersicht Schützen'!R46","v":{"v":0,"d":"0.00"}},{"v":0,"d":"0.0"},{"$f":"'Übersicht Schützen'!U46","v":{"v":0,"d":"0.00"}},{"v":0,"d":"0.0"},{"v":0,"d":"0.0"}]
[46,{"$f":"'Übersicht Schützen'!A47","v":"Schütze 46"},{"$f":"'Übersicht Schützen'!B47","v":"Verein X"},{"$f":"'Übersicht Schützen'!C47","v":{"v":0,"d":"0.0"}},{"$f":"'Übersicht Schützen'!D47","v":{"v":0,"d":"0.0"}},{"$f":"'Übersicht Schützen'!E47","v":{"v":0,"d":"0.0"}},{"$f":"'Übersicht Schützen'!F47","v":{"v":0,"d":"0.0"}},{"$f":"'Übersicht Schützen'!G47","v":{"v":0,"d":"0.0"}},{"$f":"'Übersicht Schützen'!H47","v":{"v":0,"d":"0.0"}},{"$f":"'Übersicht Schützen'!I47","v":{"v":0,"d":"0.00"}},{"v":0,"d":"0.0"},{"$f":"'Übersicht Schützen'!L47","v":{"v":0,"d":"0.0"}},{"$f":"'Übersicht Schützen'!M47","v":{"v":0,"d":"0.0"}},{"$f":"'Übersicht Schützen'!N47","v":{"v":0,"d":"0.0"}},{"$f":"'Übersicht Schützen'!O47","v":{"v":0,"d":"0.0"}},{"$f":"'Übersicht Schützen'!P47","v":{"v":0,"d":"0.0"}},{"$f":"'Übersicht Schützen'!Q47","v":{"v":0,"d":"0.0"}},{"$f":"'Übersicht Schützen'!R47","v":{"v":0,"d":"0.00"}},{"v":0,"d":"0.0"},{"$f":"'Übersicht Schützen'!U47","v":{"v":0,"d":"0.00"}},{"v":0,"d":"0.0"},{"v":0,"d":"0.0"}]
[47,{"$f":"'Übersicht Schützen'!A48","v":"Schütze 47"},{"$f":"'Übersicht Schützen'!B48","v":"Verein X"},{"$f":"'Übersicht Schützen'!C48","v":{"v":0,"d":"0.0"}},{"$f":"'Übersicht Schützen'!D48","v":{"v":0,"d":"0.0"}},{"$f":"'Übersicht Schützen'!E48","v":{"v":0,"d":"0.0"}},{"$f":"'Übersicht Schützen'!F48","v":{"v":0,"d":"0.0"}},{"$f":"'Übersicht Schützen'!G48","v":{"v":0,"d":"0.0"}},{"$f":"'Übersicht Schützen'!H48","v":{"v":0,"d":"0.0"}},{"$f":"'Übersicht Schützen'!I48","v":{"v":0,"d":"0.00"}},{"v":0,"d":"0.0"},{"$f":"'Übersicht Schützen'!L48","v":{"v":0,"d":"0.0"}},{"$f":"'Übersicht Schützen'!M48","v":{"v":0,"d":"0.0"}},{"$f":"'Übersicht Schützen'!N48","v":{"v":0,"d":"0.0"}},{"$f":"'Übersicht Schützen'!O48","v":{"v":0,"d":"0.0"}},{"$f":"'Übersicht Schützen'!P48","v":{"v":0,"d":"0.0"}},{"$f":"'Übersicht Schützen'!Q48","v":{"v":0,"d":"0.0"}},{"$f":"'Übersicht Schützen'!R48","v":{"v":0,"d":"0.00"}},{"v":0,"d":"0.0"},{"$f":"'Übersicht Schützen'!U48","v":{"v":0,"d":"0.00"}},{"v":0,"d":"0.0"},{"v":0,"d":"0.0"}]
[48,{"$f":"'Übersicht Schützen'!A49","v":"Schütze 48"},{"$f":"'Übersicht Schützen'!B49","v":"Verein X"},{"$f":"'Übersicht Schützen'!C49","v":{"v":0,"d":"0.0"}},{"$f":"'Übersicht Schützen'!D49","v":{"v":0,"d":"0.0"}},{"$f":"'Übersicht Schützen'!E49","v":{"v":0,"d":"0.0"}},{"$f":"'Übersicht Schützen'!F49","v":{"v":0,"d":"0.0"}},{"$f":"'Übersicht Schützen'!G49","v":{"v":0,"d":"0.0"}},{"$f":"'Übersicht Schützen'!H49","v":{"v":0,"d":"0.0"}},{"$f":"'Übersicht Schützen'!I49","v":{"v":0,"d":"0.00"}},{"v":0,"d":"0.0"},{"$f":"'Übersicht Schützen'!L49","v":{"v":0,"d":"0.0"}},{"$f":"'Übersicht Schützen'!M49","v":{"v":0,"d":"0.0"}},{"$f":"'Übersicht Schützen'!N49","v":{"v":0,"d":"0.0"}},{"$f":"'Übersicht Schützen'!O49","v":{"v":0,"d":"0.0"}},{"$f":"'Übersicht Schützen'!P49","v":{"v":0,"d":"0.0"}},{"$f":"'Übersicht Schützen'!Q49","v":{"v":0,"d":"0.0"}},{"$f":"'Übersicht Schützen'!R49","v":{"v":0,"d":"0.00"}},{"v":0,"d":"0.0"},{"$f":"'Übersicht Schützen'!U49","v":{"v":0,"d":"0.00"}},{"v":0,"d":"0.0"},{"v":0,"d":"0.0"}]
[49,{"$f":"'Übersicht Schützen'!A50","v":"Schütze 49"},{"$f":"'Übersicht Schützen'!B50","v":"Verein X"},{"$f":"'Übersicht Schützen'!C50","v":{"v":0,"d":"0.0"}},{"$f":"'Übersicht Schützen'!D50","v":{"v":0,"d":"0.0"}},{"$f":"'Übersicht Schützen'!E50","v":{"v":0,"d":"0.0"}},{"$f":"'Übersicht Schützen'!F50","v":{"v":0,"d":"0.0"}},{"$f":"'Übersicht Schützen'!G50","v":{"v":0,"d":"0.0"}},{"$f":"'Übersicht Schützen'!H50","v":{"v":0,"d":"0.0"}},{"$f":"'Übersicht Schützen'!I50","v":{"v":0,"d":"0.00"}},{"v":0,"d":"0.0"},{"$f":"'Übersicht Schützen'!L50","v":{"v":0,"d":"0.0"}},{"$f":"'Übersicht Schützen'!M50","v":{"v":0,"d":"0.0"}},{"$f":"'Übersicht Schützen'!N50","v":{"v":0,"d":"0.0"}},{"$f":"'Übersicht Schützen'!O50","v":{"v":0,"d":"0.0"}},{"$f":"'Übersicht Schützen'!P50","v":{"v":0,"d":"0.0"}},{"$f":"'Übersicht Schützen'!Q50","v":{"v":0,"d":"0.0"}},{"$f":"'Übersicht Schützen'!R50","v":{"v":0,"d":"0.00"}},{"v":0,"d":"0.0"},{"$f":"'Übersicht Schützen'!U50","v":{"v":0,"d":"0.00"}},{"v":0,"d":"0.0"},{"v":0,"d":"0.0"}]
[50,{"$f":"'Übersicht Schützen'!A51","v":"Schütze 50"},{"$f":"'Übersicht Schützen'!B51","v":"Verein X"},{"$f":"'Übersicht Schützen'!C51","v":{"v":0,"d":"0.0"}},{"$f":"'Übersicht Schützen'!D51","v":{"v":0,"d":"0.0"}},{"$f":"'Übersicht Schützen'!E51","v":{"v":0,"d":"0.0"}},{"$f":"'Übersicht Schützen'!F51","v":{"v":0,"d":"0.0"}},{"$f":"'Übersicht Schützen'!G51","v":{"v":0,"d":"0.0"}},{"$f":"'Übersicht Schützen'!H51","v":{"v":0,"d":"0.0"}},{"$f":"'Übersicht Schützen'!I51","v":{"v":0,"d":"0.00"}},{"v":0,"d":"0.0"},{"$f":"'Übersicht Schützen'!L51","v":{"v":0,"d":"0.0"}},{"$f":"'Übersicht Schützen'!M51","v":{"v":0,"d":"0.0"}},{"$f":"'Übersicht Schützen'!N51","v":{"v":0,"d":"0.0"}},{"$f":"'Übersicht Schützen'!O51","v":{"v":0,"d":"0.0"}},{"$f":"'Übersicht Schützen'!P51","v":{"v":0,"d":"0.0"}},{"$f":"'Übersicht Schützen'!Q51","v":{"v":0,"d":"0.0"}},{"$f":"'Übersicht Schützen'!R51","v":{"v":0,"d":"0.00"}},{"v":0,"d":"0.0"},{"$f":"'Übersicht Schützen'!U51","v":{"v":0,"d":"0.00"}},{"v":0,"d":"0.0"},{"v":0,"d":"0.0"}]
[51,{"$f":"'Übersicht Schützen'!A52","v":"Schütze 51"},{"$f":"'Übersicht Schützen'!B52","v":"Verein XI"},{"$f":"'Übersicht Schützen'!C52","v":{"v":0,"d":"0.0"}},{"$f":"'Übersicht Schützen'!D52","v":{"v":0,"d":"0.0"}},{"$f":"'Übersicht Schützen'!E52","v":{"v":0,"d":"0.0"}},{"$f":"'Übersicht Schützen'!F52","v":{"v":0,"d":"0.0"}},{"$f":"'Übersicht Schützen'!G52","v":{"v":0,"d":"0.0"}},{"$f":"'Übersicht Schützen'!H52","v":{"v":0,"d":"0.0"}},{"$f":"'Übersicht Schützen'!I52","v":{"v":0,"d":"0.00"}},{"v":0,"d":"0.0"},{"$f":"'Übersicht Schützen'!L52","v":{"v":0,"d":"0.0"}},{"$f":"'Übersicht Schützen'!M52","v":{"v":0,"d":"0.0"}},{"$f":"'Übersicht Schützen'!N52","v":{"v":0,"d":"0.0"}},{"$f":"'Übersicht Schützen'!O52","v":{"v":0,"d":"0.0"}},{"$f":"'Übersicht Schützen'!P52","v":{"v":0,"d":"0.0"}},{"$f":"'Übersicht Schützen'!Q52","v":{"v":0,"d":"0.0"}},{"$f":"'Übersicht Schützen'!R52","v":{"v":0,"d":"0.00"}},{"v":0,"d":"0.0"},{"$f":"'Übersicht Schützen'!U52","v":{"v":0,"d":"0.00"}},{"v":0,"d":"0.0"},{"v":0,"d":"0.0"}]
[52,{"$f":"'Übersicht Schützen'!A53","v":"Schütze 52"},{"$f":"'Übersicht Schützen'!B53","v":"Verein XI"},{"$f":"'Übersicht Schützen'!C53","v":{"v":0,"d":"0.0"}},{"$f":"'Übersicht Schützen'!D53","v":{"v":0,"d":"0.0"}},{"$f":"'Übersicht Schützen'!E53","v":{"v":0,"d":"0.0"}},{"$f":"'Übersicht Schützen'!F53","v":{"v":0,"d":"0.0"}},{"$f":"'Übersicht Schützen'!G53","v":{"v":0,"d":"0.0"}},{"$f":"'Übersicht Schützen'!H53","v":{"v":0,"d":"0.0"}},{"$f":"'Übersicht Schützen'!I53","v":{"v":0,"d":"0.00"}},{"v":0,"d":"0.0"},{"$f":"'Übersicht Schützen'!L53","v":{"v":0,"d":"0.0"}},{"$f":"'Übersicht Schützen'!M53","v":{"v":0,"d":"0.0"}},{"$f":"'Übersicht Schützen'!N53","v":{"v":0,"d":"0.0"}},{"$f":"'Übersicht Schützen'!O53","v":{"v":0,"d":"0.0"}},{"$f":"'Übersicht Schützen'!P53","v":{"v":0,"d":"0.0"}},{"$f":"'Übersicht Schützen'!Q53","v":{"v":0,"d":"0.0"}},{"$f":"'Übersicht Schützen'!R53","v":{"v":0,"d":"0.00"}},{"v":0,"d":"0.0"},{"$f":"'Übersicht Schützen'!U53","v":{"v":0,"d":"0.00"}},{"v":0,"d":"0.0"},{"v":0,"d":"0.0"}]
[53,{"$f":"'Übersicht Schützen'!A54","v":"Schütze 53"},{"$f":"'Übersicht Schützen'!B54","v":"Verein XI"},{"$f":"'Übersicht Schützen'!C54","v":{"v":0,"d":"0.0"}},{"$f":"'Übersicht Schützen'!D54","v":{"v":0,"d":"0.0"}},{"$f":"'Übersicht Schützen'!E54","v":{"v":0,"d":"0.0"}},{"$f":"'Übersicht Schützen'!F54","v":{"v":0,"d":"0.0"}},{"$f":"'Übersicht Schützen'!G54","v":{"v":0,"d":"0.0"}},{"$f":"'Übersicht Schützen'!H54","v":{"v":0,"d":"0.0"}},{"$f":"'Übersicht Schützen'!I54","v":{"v":0,"d":"0.00"}},{"v":0,"d":"0.0"},{"$f":"'Übersicht Schützen'!L54","v":{"v":0,"d":"0.0"}},{"$f":"'Übersicht Schützen'!M54","v":{"v":0,"d":"0.0"}},{"$f":"'Übersicht Schützen'!N54","v":{"v":0,"d":"0.0"}},{"$f":"'Übersicht Schützen'!O54","v":{"v":0,"d":"0.0"}},{"$f":"'Übersicht Schützen'!P54","v":{"v":0,"d":"0.0"}},{"$f":"'Übersicht Schützen'!Q54","v":{"v":0,"d":"0.0"}},{"$f":"'Übersicht Schützen'!R54","v":{"v":0,"d":"0.00"}},{"v":0,"d":"0.0"},{"$f":"'Übersicht Schützen'!U54","v":{"v":0,"d":"0.00"}},{"v":0,"d":"0.0"},{"v":0,"d":"0.0"}]
[54,{"$f":"'Übersicht Schützen'!A55","v":"Schütze 54"},{"$f":"'Übersicht Schützen'!B55","v":"Verein XI"},{"$f":"'Übersicht Schützen'!C55","v":{"v":0,"d":"0.0"}},{"$f":"'Übersicht Schützen'!D55","v":{"v":0,"d":"0.0"}},{"$f":"'Übersicht Schützen'!E55","v":{"v":0,"d":"0.0"}},{"$f":"'Übersicht Schützen'!F55","v":{"v":0,"d":"0.0"}},{"$f":"'Übersicht Schützen'!G55","v":{"v":0,"d":"0.0"}},{"$f":"'Übersicht Schützen'!H55","v":{"v":0,"d":"0.0"}},{"$f":"'Übersicht Schützen'!I55","v":{"v":0,"d":"0.00"}},{"v":0,"d":"0.0"},{"$f":"'Übersicht Schützen'!L55","v":{"v":0,"d":"0.0"}},{"$f":"'Übersicht Schützen'!M55","v":{"v":0,"d":"0.0"}},{"$f":"'Übersicht Schützen'!N55","v":{"v":0,"d":"0.0"}},{"$f":"'Übersicht Schützen'!O55","v":{"v":0,"d":"0.0"}},{"$f":"'Übersicht Schützen'!P55","v":{"v":0,"d":"0.0"}},{"$f":"'Übersicht Schützen'!Q55","v":{"v":0,"d":"0.0"}},{"$f":"'Übersicht Schützen'!R55","v":{"v":0,"d":"0.00"}},{"v":0,"d":"0.0"},{"$f":"'Übersicht Schützen'!U55","v":{"v":0,"d":"0.00"}},{"v":0,"d":"0.0"},{"v":0,"d":"0.0"}]
[55,{"$f":"'Übersicht Schützen'!A56","v":"Schütze 55"},{"$f":"'Übersicht Schützen'!B56","v":"Verein XI"},{"$f":"'Übersicht Schützen'!C56","v":{"v":0,"d":"0.0"}},{"$f":"'Übersicht Schützen'!D56","v":{"v":0,"d":"0.0"}},{"$f":"'Übersicht Schützen'!E56","v":{"v":0,"d":"0.0"}},{"$f":"'Übersicht Schützen'!F56","v":{"v":0,"d":"0.0"}},{"$f":"'Übersicht Schützen'!G56","v":{"v":0,"d":"0.0"}},{"$f":"'Übersicht Schützen'!H56","v":{"v":0,"d":"0.0"}},{"$f":"'Übersicht Schützen'!I56","v":{"v":0,"d":"0.00"}},{"v":0,"d":"0.0"},{"$f":"'Übersicht Schützen'!L56","v":{"v":0,"d":"0.0"}},{"$f":"'Übersicht Schützen'!M56","v":{"v":0,"d":"0.0"}},{"$f":"'Übersicht Schützen'!N56","v":{"v":0,"d":"0.0"}},{"$f":"'Übersicht Schützen'!O56","v":{"v":0,"d":"0.0"}},{"$f":"'Übersicht Schützen'!P56","v":{"v":0,"d":"0.0"}},{"$f":"'Übersicht Schützen'!Q56","v":{"v":0,"d":"0.0"}},{"$f":"'Übersicht Schützen'!R56","v":{"v":0,"d":"0.00"}},{"v":0,"d":"0.0"},{"$f":"'Übersicht Schützen'!U56","v":{"v":0,"d":"0.00"}},{"v":0,"d":"0.0"},{"v":0,"d":"0.0"}]
[56,{"$f":"'Übersicht Schützen'!A57","v":"Schütze 56"},{"$f":"'Übersicht Schützen'!B57","v":"Verein XII"},{"$f":"'Übersicht Schützen'!C57","v":{"v":0,"d":"0.0"}},{"$f":"'Übersicht Schützen'!D57","v":{"v":0,"d":"0.0"}},{"$f":"'Übersicht Schützen'!E57","v":{"v":0,"d":"0.0"}},{"$f":"'Übersicht Schützen'!F57","v":{"v":0,"d":"0.0"}},{"$f":"'Übersicht Schützen'!G57","v":{"v":0,"d":"0.0"}},{"$f":"'Übersicht Schützen'!H57","v":{"v":0,"d":"0.0"}},{"$f":"'Übersicht Schützen'!I57","v":{"v":0,"d":"0.00"}},{"v":0,"d":"0.0"},{"$f":"'Übersicht Schützen'!L57","v":{"v":0,"d":"0.0"}},{"$f":"'Übersicht Schützen'!M57","v":{"v":0,"d":"0.0"}},{"$f":"'Übersicht Schützen'!N57","v":{"v":0,"d":"0.0"}},{"$f":"'Übersicht Schützen'!O57","v":{"v":0,"d":"0.0"}},{"$f":"'Übersicht Schützen'!P57","v":{"v":0,"d":"0.0"}},{"$f":"'Übersicht Schützen'!Q57","v":{"v":0,"d":"0.0"}},{"$f":"'Übersicht Schützen'!R57","v":{"v":0,"d":"0.00"}},{"v":0,"d":"0.0"},{"$f":"'Übersicht Schützen'!U57","v":{"v":0,"d":"0.00"}},{"v":0,"d":"0.0"},{"v":0,"d":"0.0"}]
[57,{"$f":"'Übersicht Schützen'!A58","v":"Schütze 57"},{"$f":"'Übersicht Schützen'!B58","v":"Verein XII"},{"$f":"'Übersicht Schützen'!C58","v":{"v":0,"d":"0.0"}},{"$f":"'Übersicht Schützen'!D58","v":{"v":0,"d":"0.0"}},{"$f":"'Übersicht Schützen'!E58","v":{"v":0,"d":"0.0"}},{"$f":"'Übersicht Schützen'!F58","v":{"v":0,"d":"0.0"}},{"$f":"'Übersicht Schützen'!G58","v":{"v":0,"d":"0.0"}},{"$f":"'Übersicht Schützen'!H58","v":{"v":0,"d":"0.0"}},{"$f":"'Übersicht Schützen'!I58","v":{"v":0,"d":"0.00"}},{"v":0,"d":"0.0"},{"$f":"'Übersicht Schützen'!L58","v":{"v":0,"d":"0.0"}},{"$f":"'Übersicht Schützen'!M58","v":{"v":0,"d":"0.0"}},{"$f":"'Übersicht Schützen'!N58","v":{"v":0,"d":"0.0"}},{"$f":"'Übersicht Schützen'!O58","v":{"v":0,"d":"0.0"}},{"$f":"'Übersicht Schützen'!P58","v":{"v":0,"d":"0.0"}},{"$f":"'Übersicht Schützen'!Q58","v":{"v":0,"d":"0.0"}},{"$f":"'Übersicht Schützen'!R58","v":{"v":0,"d":"0.00"}},{"v":0,"d":"0.0"},{"$f":"'Übersicht Schützen'!U58","v":{"v":0,"d":"0.00"}},{"v":0,"d":"0.0"},{"v":0,"d":"0.0"}]
[58,{"$f":"'Übersicht Schützen'!A59","v":"Schütze 58"},{"$f":"'Übersicht Schützen'!B59","v":"Verein XII"},{"$f":"'Übersicht Schützen'!C59","v":{"v":0,"d":"0.0"}},{"$f":"'Übersicht Schützen'!D59","v":{"v":0,"d":"0.0"}},{"$f":"'Übersicht Schützen'!E59","v":{"v":0,"d":"0.0"}},{"$f":"'Übersicht Schützen'!F59","v":{"v":0,"d":"0.0"}},{"$f":"'Übersicht Schützen'!G59","v":{"v":0,"d":"0.0"}},{"$f":"'Übersicht Schützen'!H59","v":{"v":0,"d":"0.0"}},{"$f":"'Übersicht Schützen'!I59","v":{"v":0,"d":"0.00"}},{"v":0,"d":"0.0"},{"$f":"'Übersicht Schützen'!L59","v":{"v":0,"d":"0.0"}},{"$f":"'Übersicht Schützen'!M59","v":{"v":0,"d":"0.0"}},{"$f":"'Übersicht Schützen'!N59","v":{"v":0,"d":"0.0"}},{"$f":"'Übersicht Schützen'!O59","v":{"v":0,"d":"0.0"}},{"$f":"'Übersicht Schützen'!P59","v":{"v":0,"d":"0.0"}},{"$f":"'Übersicht Schützen'!Q59","v":{"v":0,"d":"0.0"}},{"$f":"'Übersicht Schützen'!R59","v":{"v":0,"d":"0.00"}},{"v":0,"d":"0.0"},{"$f":"'Übersicht Schützen'!U59","v":{"v":0,"d":"0.00"}},{"v":0,"d":"0.0"},{"v":0,"d":"0.0"}]
[59,{"$f":"'Übersicht Schützen'!A60","v":"Schütze 59"},{"$f":"'Übersicht Schützen'!B60","v":"Verein XII"},{"$f":"'Übersicht Schützen'!C60","v":{"v":0,"d":"0.0"}},{"$f":"'Übersicht Schützen'!D60","v":{"v":0,"d":"0.0"}},{"$f":"'Übersicht Schützen'!E60","v":{"v":0,"d":"0.0"}},{"$f":"'Übersicht Schützen'!F60","v":{"v":0,"d":"0.0"}},{"$f":"'Übersicht Schützen'!G60","v":{"v":0,"d":"0.0"}},{"$f":"'Übersicht Schützen'!H60","v":{"v":0,"d":"0.0"}},{"$f":"'Übersicht Schützen'!I60","v":{"v":0,"d":"0.00"}},{"v":0,"d":"0.0"},{"$f":"'Übersicht Schützen'!L60","v":{"v":0,"d":"0.0"}},{"$f":"'Übersicht Schützen'!M60","v":{"v":0,"d":"0.0"}},{"$f":"'Übersicht Schützen'!N60","v":{"v":0,"d":"0.0"}},{"$f":"'Übersicht Schützen'!O60","v":{"v":0,"d":"0.0"}},{"$f":"'Übersicht Schützen'!P60","v":{"v":0,"d":"0.0"}},{"$f":"'Übersicht Schützen'!Q60","v":{"v":0,"d":"0.0"}},{"$f":"'Übersicht Schützen'!R60","v":{"v":0,"d":"0.00"}},{"v":0,"d":"0.0"},{"$f":"'Übersicht Schützen'!U60","v":{"v":0,"d":"0.00"}},{"v":0,"d":"0.0"},{"v":0,"d":"0.0"}]
[60,{"$f":"'Übersicht Schützen'!A61","v":"Schütze 60"},{"$f":"'Übersicht Schützen'!B61","v":"Verein XII"},{"$f":"'Übersicht Schützen'!C61","v":{"v":0,"d":"0.0"}},{"$f":"'Übersicht Schützen'!D61","v":{"v":0,"d":"0.0"}},{"$f":"'Übersicht Schützen'!E61","v":{"v":0,"d":"0.0"}},{"$f":"'Übersicht Schützen'!F61","v":{"v":0,"d":"0.0"}},{"$f":"'Übersicht Schützen'!G61","v":{"v":0,"d":"0.0"}},{"$f":"'Übersicht Schützen'!H61","v":{"v":0,"d":"0.0"}},{"$f":"'Übersicht Schützen'!I61","v":{"v":0,"d":"0.00"}},{"v":0,"d":"0.0"},{"$f":"'Übersicht Schützen'!L61","v":{"v":0,"d":"0.0"}},{"$f":"'Übersicht Schützen'!M61","v":{"v":0,"d":"0.0"}},{"$f":"'Übersicht Schützen'!N61","v":{"v":0,"d":"0.0"}},{"$f":"'Übersicht Schützen'!O61","v":{"v":0,"d":"0.0"}},{"$f":"'Übersicht Schützen'!P61","v":{"v":0,"d":"0.0"}},{"$f":"'Übersicht Schützen'!Q61","v":{"v":0,"d":"0.0"}},{"$f":"'Übersicht Schützen'!R61","v":{"v":0,"d":"0.00"}},{"v":0,"d":"0.0"},{"$f":"'Übersicht Schützen'!U61","v":{"v":0,"d":"0.00"}},{"v":0,"d":"0.0"},{"v":0,"d":"0.0"}]
[]
[null,null,"Schnitt:",{"$f":"IF(Formelhilfe!B75 > 0, SUM(D23:D82)/Formelhilfe!B75, 0)","v":{"v":136.91111111111115,"d":"136.9"}},{"$f":"IF(Formelhilfe!C75 > 0, SUM(E23:E82)/Formelhilfe!C75, 0)","v":{"v":134.0705882352941,"d":"134.1"}},{"$f":"IF(Formelhilfe!D75 > 0, SUM(F23:F82)/Formelhilfe!D75, 0)","v":146.2},{"$f":"IF(Formelhilfe!E75 > 0, SUM(G23:G82)/Formelhilfe!E75, 0)","v":{"v":146.17058823529413,"d":"146.2"}},{"$f":"IF(Formelhilfe!F75 > 0, SUM(H23:H82)/Formelhilfe!F75, 0)","v":{"v":0,"d":"0.0"}},{"$f":"IF(Formelhilfe!G75 > 0, SUM(I23:I82)/Formelhilfe!G75, 0)","v":{"v":0,"d":"0.0"}},{"$f":"IF(SUM(J23:J82)<>0,AVERAGEIF(J23:J82,\"<>0\"),0)","v":{"v":140.48291666666663,"d":"140.48"}},{"$f":"IF(SUM(K23:K82)<>0,AVERAGEIF(K23:K82,\"<>0\"),0)","v":{"v":493.0050000000001,"d":"493.01"}},{"$f":"IF(Formelhilfe!I75 > 0, SUM(L23:L82)/Formelhilfe!I75, 0)","v":{"v":152.325,"d":"152.3"}},{"$f":"IF(Formelhilfe!J75 > 0, SUM(M23:M82)/Formelhilfe!J75, 0)","v":{"v":151.01,"d":"151.0"}},{"$f":"IF(Formelhilfe!K75 > 0, SUM(N23:N82)/Formelhilfe!K75, 0)","v":{"v":153.9789473684211,"d":"154.0"}},{"$f":"IF(Formelhilfe!L75 > 0, SUM(O23:O82)/Formelhilfe!L75, 0)","v":{"v":153.2315789473684,"d":"153.2"}},{"$f":"IF(Formelhilfe!M75 > 0, SUM(P23:P82)/Formelhilfe!M75, 0)","v":{"v":162.54999999999998,"d":"162.6"}},{"$f":"IF(Formelhilfe!N75 > 0, SUM(Q23:Q82)/Formelhilfe!N75, 0)","v":{"v":0,"d":"0.0"}},{"$f":"IF(SUM(R23:R82)<>0,AVERAGEIF(R23:R82,\"<>0\"),0)","v":{"v":152.31075000000004,"d":"152.31"}},{"$f":"IF(SUM(S23:S82)<>0,AVERAGEIF(S23:S82,\"<>0\"),0)","v":{"v":711.0150000000001,"d":"711.02"}},{"$f":"IF(SUM(T23:T82)<>0,AVERAGEIF(T23:T82,\"<>0\"),0)","v":{"v":143.16117424242427,"d":"143.16"}},{"$f":"(K84+S84)","v":{"v":1204.0200000000002,"d":"1,204.02 "}}]

{"sheet":"Wettkampf 1","index":1,"n_rows":77,"n_cols":41,"rows_kept":77,"merged":[[0,36,0,37],[1,36,1,37],[4,36,4,37],[5,36,5,37],[6,36,6,37],[14,34,14,37]]}
[null,"Verein / Gruppe",null,"Ergebnisse",{"$nulls":31},"Austragungsort:",{"$f":"Übersicht!D4","v":"Lorup"}]
[1,"Lorup",null,{"$f":"G76","v":{"v":394.90000000000003,"d":"394.9"}},{"$f":"IF(H76>4,\"Es sind zu viele Schützen in Wertung!\",\" \")","v":"Es sind zu viele Schützen in Wertung!"},{"$nulls":30},"Wettkampftag:",{"$f":"Übersicht!D3","v":"16.09."}]
[2,"Sögel",null,{"$f":"I76","v":{"v":0,"d":"0.0"}},{"$f":"IF(J76>4,\"Es sind zu viele Schützen in Wertung!\",\" \")","v":" "}]
[3,"Spahnharenstätte",null,{"$f":"K76","v":318.6},{"$f":"IF(L76>4,\"Es sind zu viele Schützen in Wertung!\",\" \")","v":" "},{"$nulls":32},"Ansprechpartner für Rückfragen:"]
[4,"Esterwegen",null,{"$f":"M76","v":519.5},{"$f":"IF(N76>4,\"Es sind zu viele Schützen in Wertung!\",\" \")","v":" "},{"$nulls":30},"Name:","Heiner Krull"]
[5,"Lähden",null,{"$f":"O76","v":{"v":565,"d":"565.0"}},{"$f":"IF(P76>4,\"Es sind zu viele Schützen in Wertung!\",\" \")","v":"Es sind zu viele Schützen in Wertung!"},{"$nulls":30},"Tel:","05954659"]
[6,"Börgermoor",null,{"$f":"Q76","v":183.4},{"$f":"IF(R76>4,\"Es sind zu viele Schützen in Wertung!\",\" \")","v":" "},{"$nulls":30},"Standaufsicht:","Heiner Krull"]
[7,"Verein VII",null,{"$f":"S76","v":{"v":0,"d":"0.0"}},{"$f":"IF(T76>4,\"Es sind zu viele Schützen in Wertung!\",\" \")","v":" "}]
[8,"Verein VIII",null,{"$f":"U76","v":{"v":0,"d":"0.0"}},{"$f":"IF(V76>4,\"Es sind zu viele Schützen in Wertung!\",\" \")","v":" "}]
[9,"Verein IX",null,{"$f":"W76","v":{"v":0,"d":"0.0"}},{"$f":"IF(X76>4,\"Es sind zu viele Schützen in Wertung!\",\" \")","v":"Es sind zu viele Schützen in Wertung!"}]
[10,"Verein X",null,{"$f":"Y76","v":{"v":0,"d":"0.0"}},{"$f":"IF(Z76>4,\"Es sind zu viele Schützen in Wertung!\",\" \")","v":"Es sind zu viele Schützen in Wertung!"}]
[11,"Verein XI",null,{"$f":"AA76","v":{"v":0,"d":"0.0"}},{"$f":"IF(AB76>4,\"Es sind zu viele Schützen in Wertung!\",\" \")","v":"Es sind zu viele Schützen in Wertung!"}]
[12,"Verein XII",null,{"$f":"AC76","v":{"v":0,"d":"0.0"}},{"$f":"IF(AD76>4,\"Es sind zu viele Schützen in Wertung!\",\" \")","v":"Es sind zu viele Schützen in Wertung!"}]
[]
[null,"Einzelergebnisse:","Verein/Gruppe (per Dropdown-Feld einzutragen)","Ergebnisse","AW? Dann x eintippen",null,"Verein 1",null,"Verein 2",null,"Verein 3",null,"Verein 4",null,"Verein 5",null,"Verein 6",null,"Verein 7",null,"Verein 8",null,"Verein 9",null,"Verein 10",null,"Verein 11",null,"Verein 12",{"$nulls":3},"Geburtsdatum",null,"Proberechnung bei Streifen:"]
[1,"Wotte Lia","Lorup",148.9,null,{"$f":"IF(E16=\"x\",\"0\",D16)","v":148.9},{"$f":"IF(C16=$B$2,F16,0)","v":148.9},{"$f":"(IF(AND($E16=\"\",$C16=$B$2),1,0))","v":1},{"$f":"IF($C16=$B$3,F16,0)","v":0},{"$f":"(IF(AND($E16=\"\",$C16=$B$3),1,0))","v":0},{"$f":"IF($C16=$B$4,F16,0)","v":0},{"$f":"(IF(AND($E16=\"\",$C16=$B$4),1,0))","v":0},{"$f":"IF($C16=$B$5,F16,0)","v":0},{"$f":"(IF(AND($E16=\"\",$C16=$B$5),1,0))","v":0},{"$f":"IF($C16=$B$6,F16,0)","v":0},{"$f":"(IF(AND($E16=\"\",$C16=$B$6),1,0))","v":0},{"$f":"IF($C16=$B$7,F16,0)","v":0},{"$f":"(IF(AND($E16=\"\",$C16=$B$7),1,0))","v":0},{"$f":"IF($C16=$B$8,F16,0)","v":0},{"$f":"(IF(AND($E16=\"\",$C16=$B$8),1,0))","v":0},{"$f":"IF($C16=$B$9,F16,0)","v":0},{"$f":"(IF(AND($E16=\"\",$C16=$B$9),1,0))","v":0},{"$f":"IF($C16=$B$10,F16,0)","v":0},{"$f":"(IF(AND($E16=\"\",$C16=$B$10),1,0))","v":0},{"$f":"IF($C16=$B$11,F16,0)","v":0},{"$f":"(IF(AND($E16=\"\",$C16=$B$11),1,0))","v":0},{"$f":"IF($C16=$B$12,F16,0)","v":0},{"$f":"(IF(AND($E16=\"\",$C16=$B$12),1,0))","v":0},{"$f":"IF($C16=$B$13,F16,0)","v":0},{"$f":"(IF(AND($E16=\"\",$C16=$B$13),1,0))","v":0},null,null,"02.03.2011",{"$nulls":4},{"$f":"SUM(AI16:AK16)","v":{"v":0,"d":"0.0"}},{"$f":"IF(AL16=D16,1,0)","v":0},{"$f":"IF(AL16=0,0,1)","v":0},{"$f":"IF(AM16+AN16=2,\"Korrekt\",\"\")","v":""}]
[2,"Wotte Hannes",{"$f":"B2","v":"Lorup"},135.3,null,{"$f":"IF(E17=\"x\",\"0\",D17)","v":135.3},135.3,{"$f":"(IF(AND($E17=\"\",$C17=$B$2),1,0))","v":1},0,{"$f":"(IF(AND($E17=\"\",$C17=$B$3),1,0))","v":0},0,{"$f":"(IF(AND($E17=\"\",$C17=$B$4),1,0))","v":0},0,{"$f":"(IF(AND($E17=\"\",$C17=$B$5),1,0))","v":0},0,{"$f":"(IF(AND($E17=\"\",$C17=$B$6),1,0))","v":0},0,{"$f":"(IF(AND($E17=\"\",$C17=$B$7),1,0))","v":0},{"$f":"IF($C17=$B$8,F17,0)","v":0},{"$f":"(IF(AND($E17=\"\",$C17=$B$8),1,0))","v":0},{"$f":"IF($C17=$B$9,F17,0)","v":0},{"$f":"(IF(AND($E17=\"\",$C17=$B$9),1,0))","v":0},{"$f":"IF($C17=$B$10,F17,0)","v":0},{"$f":"(IF(AND($E17=\"\",$C17=$B$10),1,0))","v":0},{"$f":"IF($C17=$B$11,F17,0)","v":0},{"$f":"(IF(AND($E17=\"\",$C17=$B$11),1,0))","v":0},{"$f":"IF($C17=$B$12,F17,0)","v":0},{"$f":"(IF(AND($E17=\"\",$C17=$B$12),1,0))","v":0},{"$f":"IF($C17=$B$13,F17,0)","v":0},{"$f":"(IF(AND($E17=\"\",$C17=$B$13),1,0))","v":0},null,null,"05.01.2011",{"$nulls":4},{"$f":"SUM(AI17:AK17)","v":{"v":0,"d":"0.0"}},{"$f":"IF(AL17=D17,1,0)","v":0},{"$f":"IF(AL17=0,0,1)","v":0},{"$f":"IF(AM17+AN17=2,\"Korrekt\",\"\")","v":""}]
[3,"Gretenabeln Elias",{"$f":"B2","v":"Lorup"},110.7,null,110.7,110.7,1,0,0,0,0,0,0,0,0,0,0,0,0,0,0,0,0,0,0,0,0,0,0,null,null,"14.06.2011",{"$nulls":4},{"v":0,"d":"0.0"},0,0,""]
[4,"Helmer Maike",{"$f":"B2","v":"Lorup"},91.9,null,91.9,91.9,1,0,0,0,0,0,0,0,0,0,0,0,0,0,0,0,0,0,0,0,0,0,0,null,null,"07.07.2011",{"$nulls":4},{"v":0,"d":"0.0"},0,0,""]
[5,"Többen Jannes",{"$f":"B2","v":"Lorup"},108.5,"x","0","0",0,0,0,0,0,0,0,0,0,0,0,0,0,0,0,0,0,0,0,0,0,0,0,null,null,"09.06.2011",{"$nulls":4},{"v":0,"d":"0.0"},0,0,""]
[6,"Lüken Arne","Lorup",108.9,"x","0","0",0,0,0,0,0,0,0,0,0,0,0,0,0,0,0,0,0,0,0,0,0,0,0,null,null,"25.01.2011",{"$nulls":4},{"v":0,"d":"0.0"},0,0,""]
[7,"Schütze 7",{"$f":"B3","v":"Sögel"},null,null,0,0,0,0,1,0,0,0,0,0,0,0,0,0,0,0,0,0,0,0,0,0,0,0,0,{"$nulls":7},{"v":0,"d":"0.0"},1,0,""]
[8,"Schütze 8",{"$f":"B3","v":"Sögel"},null,null,0,0,0,0,1,0,0,0,0,0,0,0,0,0,0,0,0,0,0,0,0,0,0,0,0,{"$nulls":7},{"v":0,"d":"0.0"},1,0,""]
[9,"Schütze 9",{"$f":"B3","v":"Sögel"},null,null,0,0,0,0,1,0,0,0,0,0,0,0,0,0,0,0,0,0,0,0,0,0,0,0,0,{"$nulls":7},{"v":0,"d":"0.0"},1,0,""]
[10,"Schütze 10",{"$f":"B3","v":"Sögel"},null,null,0,0,0,0,1,0,0,0,0,0,0,0,0,0,0,0,0,0,0,0,0,0,0,0,0,{"$nulls":7},{"v":0,"d":"0.0"},1,0,""]
[11,"Engbers Hannes",{"$f":"B4","v":"Spahnharenstätte"},67.5,null,67.5,0,0,0,0,67.5,1,0,0,0,0,0,0,0,0,0,0,0,0,0,0,0,0,0,0,null,null,"04.11.2011",{"$nulls":4},{"v":0,"d":"0.0"},0,0,""]
[12,"Runde Marcel",{"$f":"B4","v":"Spahnharenstätte"},126.7,null,126.7,0,0,0,0,126.7,1,0,0,0,0,0,0,0,0,0,0,0,0,0,0,0,0,0,0,null,null,"07.05.2010",{"$nulls":4},{"v":0,"d":"0.0"},0,0,""]
[13,"Jansen Lars",{"$f":"B4","v":"Spahnharenstätte"},124.4,null,124.4,0,0,0,0,124.4,1,0,0,0,0,0,0,0,0,0,0,0,0,0,0,0,0,0,0,null,null,"22.05.2010",{"$nulls":4},{"v":0,"d":"0.0"},0,0,""]
[14,"Schütze 14",{"$f":"B4","v":"Spahnharenstätte"},null,null,0,0,0,0,0,0,1,0,0,0,0,0,0,0,0,0,0,0,0,0,0,0,0,0,0,{"$nulls":7},{"v":0,"d":"0.0"},1,0,""]
[15,"Schütze 15",{"$f":"B4","v":"Spahnharenstätte"},null,"x","0",0,0,0,0,"0",0,0,0,0,0,0,0,0,0,0,0,0,0,0,0,0,0,0,0,{"$nulls":7},{"v":0,"d":"0.0"},1,0,""]
[16,"Suhle Annalena",{"$f":"B5","v":"Esterwegen"},177.9,null,177.9,0,0,0,0,0,0,177.9,1,0,0,0,0,0,0,0,0,0,0,0,0,0,0,0,0,null,null,"11.04.2011",{"$nulls":4},{"v":0,"d":"0.0"},0,0,""]
[17,"Gäken Lena",{"$f":"B5","v":"Esterwegen"},186.7,null,186.7,0,{"$f":"(IF(AND($E32=\"\",$C32=$B$2),1,0))","v":0},0,{"$f":"(IF(AND($E32=\"\",$C32=$B$3),1,0))","v":0},0,{"$f":"(IF(AND($E32=\"\",$C32=$B$4),1,0))","v":0},186.7,{"$f":"(IF(AND($E32=\"\",$C32=$B$5),1,0))","v":1},0,{"$f":"(IF(AND($E32=\"\",$C32=$B$6),1,0))","v":0},0,{"$f":"(IF(AND($E32=\"\",$C32=$B$7),1,0))","v":0},{"$f":"IF($C32=$B$8,F32,0)","v":0},{"$f":"(IF(AND($E32=\"\",$C32=$B$8),1,0))","v":0},{"$f":"IF($C32=$B$9,F32,0)","v":0},{"$f":"(IF(AND($E32=\"\",$C32=$B$9),1,0))","v":0},{"$f":"IF($C32=$B$10,F32,0)","v":0},{"$f":"(IF(AND($E32=\"\",$C32=$B$10),1,0))","v":0},{"$f":"IF($C32=$B$11,F32,0)","v":0},{"$f":"(IF(AND($E32=\"\",$C32=$B$11),1,0))","v":0},{"$f":"IF($C32=$B$12,F32,0)","v":0},{"$f":"(IF(AND($E32=\"\",$C32=$B$12),1,0))","v":0},{"$f":"IF($C32=$B$13,F32,0)","v":0},{"$f":"(IF(AND($E32=\"\",$C32=$B$13),1,0))","v":0},null,null,"24.07.2011",{"$nulls":4},{"v":0,"d":"0.0"},0,0,""]
[18,"Jansen Daniel",{"$f":"B5","v":"Esterwegen"},154.9,null,154.9,0,0,0,0,0,0,154.9,1,0,0,0,0,0,0,0,0,0,0,0,0,0,0,0,0,null,null,"05.08.2011",{"$nulls":4},{"v":0,"d":"0.0"},0,0,""]
[19,"Pieper Jonas",{"$f":"B5","v":"Esterwegen"},null,"x","0",0,0,0,0,0,0,"0",0,0,0,0,0,0,0,0,0,0,0,0,0,0,0,0,0,{"$nulls":7},{"v":0,"d":"0.0"},1,0,""]
[20,"Schütze 20",{"$f":"B5","v":"Esterwegen"},null,"x","0",0,0,0,0,0,0,"0",0,0,0,0,0,0,0,0,0,0,0,0,0,0,0,0,0,{"$nulls":7},{"v":0,"d":"0.0"},1,0,""]
[21,"Hellweg Thea",{"$f":"B6","v":"Lähden"},191.8,null,191.8,0,0,0,0,0,0,0,0,191.8,1,0,0,0,0,0,0,0,0,0,0,0,0,0,0,null,null,"10.2010",{"$nulls":4},{"v":0,"d":"0.0"},0,0,""]
[22,"Bruns Henrik",{"$f":"B6","v":"Lähden"},184.5,null,184.5,0,0,0,0,0,0,0,0,184.5,1,0,0,0,0,0,0,0,0,0,0,0,0,0,0,null,null,"12.2010",{"$nulls":4},{"v":0,"d":"0.0"},0,0,""]
[23,"Buschen Johann ",{"$f":"B6","v":"Lähden"},188.7,null,188.7,0,0,0,0,0,0,0,0,188.7,1,0,0,0,0,0,0,0,0,0,0,0,0,0,0,null,null,"12.2011",{"$nulls":4},{"v":0,"d":"0.0"},0,0,""]
[24,"Preut Jannis",{"$f":"B6","v":"Lähden"},173.7,null,173.7,0,0,0,0,0,0,0,0,173.7,1,0,0,0,0,0,0,0,0,0,0,0,0,0,0,null,null,"10.2010",{"$nulls":4},{"v":0,"d":"0.0"},0,0,""]
[25,"Fleschenberg Jana","Lähden",null,"x","0",0,0,0,0,0,0,0,0,"0",0,0,0,0,0,0,0,0,0,0,0,0,0,0,0,{"$nulls":7},{"v":0,"d":"0.0"},1,0,""]
[26,"von Seggern Moritz","Lähden",null,"x","0",0,0,0,0,0,0,0,0,"0",0,0,0,0,0,0,0,0,0,0,0,0,0,0,0,{"$nulls":7},{"v":0,"d":"0.0"},1,0,""]
[27,"Kohnen Saskia","Börgermoor",134.9,null,134.9,0,0,0,0,0,0,0,0,0,0,134.9,1,0,0,0,0,0,0,0,0,0,0,0,0,null,null,"24.11.2010",{"$nulls":4},{"v":0,"d":"0.0"},0,0,""]
[28,"Niemann Paul","Börgermoor",48.5,null,48.5,0,0,0,0,0,0,0,0,0,0,48.5,1,0,0,0,0,0,0,0,0,0,0,0,0,null,null,"20.01.2010",{"$nulls":4},{"v":0,"d":"0.0"},0,0,""]
[29,"Schütze 29","Börgermoor",null,null,0,0,0,0,0,0,0,0,0,0,0,0,1,0,0,0,0,0,0,0,0,0,0,0,0,{"$nulls":7},{"v":0,"d":"0.0"},1,0,""]
[30,"Schütze 30","Börgermoor",null,"x","0",0,0,0,0,0,0,0,0,0,0,"0",0,0,0,0,0,0,0,0,0,0,0,0,0,{"$nulls":7},{"v":0,"d":"0.0"},1,0,""]
[31,"Stümpler Jan Luka ","Lähden",null,null,0,0,0,0,0,0,0,0,0,0,1,0,0,0,0,0,0,0,0,0,0,0,0,0,0,{"$nulls":7},{"v":0,"d":"0.0"},{"$f":"IF(AL46=D46,1,0)","v":1},{"$f":"IF(AL46=0,0,1)","v":0},{"$f":"IF(AM46+AN46=2,\"Korrekt\",\"\")","v":""}]
[32,"Helmer, Nils","Lorup",null,null,0,0,1,0,0,0,0,0,0,0,0,0,0,0,0,0,0,0,0,0,0,0,0,0,0,{"$nulls":7},{"v":0,"d":"0.0"},1,0,""]
[33,"Schütze 33",{"$f":"B8","v":"Verein VII"},null,null,0,0,0,0,0,0,0,0,0,0,0,0,0,0,1,0,0,0,0,0,0,0,0,0,0,{"$nulls":7},{"v":0,"d":"0.0"},1,0,""]
[34,"Schütze 34",{"$f":"B8","v":"Verein VII"},null,null,0,0,0,0,0,0,0,0,0,0,0,0,0,0,1,0,0,0,0,0,0,0,0,0,0,{"$nulls":7},{"v":0,"d":"0.0"},1,0,""]
[35,"Schütze 35",{"$f":"B8","v":"Verein VII"},null,"x","0",0,0,0,0,0,0,0,0,0,0,0,0,"0",0,0,0,0,0,0,0,0,0,0,0,{"$nulls":7},{"v":0,"d":"0.0"},1,0,""]
[36,"Schütze 36","Verein VII",null,"x","0",0,0,0,0,0,0,0,0,0,0,0,0,"0",0,0,0,0,0,0,0,0,0,0,0,{"$nulls":7},{"v":0,"d":"0.0"},{"$f":"IF(AL51=D51,1,0)","v":1},{"$f":"IF(AL51=0,0,1)","v":0},{"$f":"IF(AM51+AN51=2,\"Korrekt\",\"\")","v":""}]
[37,"Schütze 37","Verein VII",null,"x","0",{"$f":"IF(C52=$B$2,F52,0)","v":0},0,{"$f":"IF($C52=$B$3,F52,0)","v":0},0,{"$f":"IF($C52=$B$4,F52,0)","v":0},0,{"$f":"IF($C52=$B$5,F52,0)","v":0},0,{"$f":"IF($C52=$B$6,F52,0)","v":0},0,{"$f":"IF($C52=$B$7,F52,0)","v":0},0,{"$f":"IF($C52=$B$8,F52,0)","v":"0"},0,{"$f":"IF($C52=$B$9,F52,0)","v":0},0,{"$f":"IF($C52=$B$10,F52,0)","v":0},0,{"$f":"IF($C52=$B$11,F52,0)","v":0},0,{"$f":"IF($C52=$B$12,F52,0)","v":0},0,{"$f":"IF($C52=$B$13,F52,0)","v":0},0,{"$nulls":7},{"v":0,"d":"0.0"}]
[38,"Schütze 38",{"$f":"B9","v":"Verein VIII"},null,null,0,0,0,0,0,0,0,0,0,0,0,0,0,0,0,0,1,0,0,0,0,0,0,0,0,{"$nulls":7},{"v":0,"d":"0.0"}]
[39,"Schütze 39",{"$f":"B9","v":"Verein VIII"},null,null,0,0,0,0,0,0,0,0,0,0,0,0,0,0,0,0,1,0,0,0,0,0,0,0,0,{"$nulls":7},{"v":0,"d":"0.0"}]
[40,"Schütze 40",{"$f":"B9","v":"Verein VIII"},null,null,0,0,0,0,0,0,0,0,0,0,0,0,0,0,0,0,1,0,0,0,0,0,0,0,0,{"$nulls":7},{"v":0,"d":"0.0"}]
[41,"Schütze 41",{"$f":"B10","v":"Verein IX"},null,null,0,0,0,0,0,0,0,0,0,0,0,0,0,0,0,0,0,0,1,0,0,0,0,0,0,{"$nulls":7},{"v":0,"d":"0.0"}]
[42,"Schütze 42",{"$f":"B10","v":"Verein IX"},null,null,0,0,0,0,0,0,0,0,0,0,0,0,0,0,0,0,0,0,1,0,0,0,0,0,0,{"$nulls":7},{"v":0,"d":"0.0"}]
[43,"Schütze 43",{"$f":"B10","v":"Verein IX"},null,null,0,0,0,0,0,0,0,0,0,0,0,0,0,0,0,0,0,0,1,0,0,0,0,0,0,{"$nulls":7},{"v":0,"d":"0.0"}]
[44,"Schütze 44",{"$f":"B10","v":"Verein IX"},null,null,0,0,0,0,0,0,0,0,0,0,0,0,0,0,0,0,0,0,1,0,0,0,0,0,0,{"$nulls":7},{"v":0,"d":"0.0"}]
[45,"Schütze 45",{"$f":"B10","v":"Verein IX"},null,null,0,0,0,0,0,0,0,0,0,0,0,0,0,0,0,0,0,0,1,0,0,0,0,0,0,{"$nulls":7},{"v":0,"d":"0.0"}]
[46,"Schütze 46",{"$f":"B11","v":"Verein X"},null,null,0,0,0,0,0,0,0,0,0,0,0,0,0,0,0,0,0,0,0,0,1,0,0,0,0,{"$nulls":7},{"v":0,"d":"0.0"}]
[47,"Schütze 47",{"$f":"B11","v":"Verein X"},null,null,0,0,0,0,0,0,0,0,0,0,0,0,0,0,0,0,0,0,0,0,1,0,0,0,0,{"$nulls":7},{"v":0,"d":"0.0"}]
[48,"Schütze 48",{"$f":"B11","v":"Verein X"},null,null,0,0,0,0,0,0,0,0,0,0,0,0,0,0,0,0,0,0,0,0,1,0,0,0,0,{"$nulls":7},{"v":0,"d":"0.0"}]
[49,"Schütze 49",{"$f":"B11","v":"Verein X"},null,null,0,0,0,0,0,0,0,0,0,0,0,0,0,0,0,0,0,0,0,0,1,0,0,0,0,{"$nulls":7},{"v":0,"d":"0.0"}]
[50,"Schütze 50",{"$f":"B11","v":"Verein X"},null,null,0,0,0,0,0,0,0,0,0,0,0,0,0,0,0,0,0,0,0,0,1,0,0,0,0,{"$nulls":7},{"v":0,"d":"0.0"}]
[51,"Schütze 51",{"$f":"B12","v":"Verein XI"},null,null,0,0,0,0,0,0,0,0,0,0,0,0,0,0,0,0,0,0,0,0,0,0,1,0,0,{"$nulls":7},{"v":0,"d":"0.0"}]
[52,"Schütze 52",{"$f":"B12","v":"Verein XI"},null,null,0,0,0,0,0,0,0,0,0,0,0,0,0,0,0,0,0,0,0,0,0,0,1,0,0,{"$nulls":7},{"v":0,"d":"0.0"}]
[53,"Schütze 53",{"$f":"B12","v":"Verein XI"},null,null,0,0,0,0,0,0,0,0,0,0,0,0,0,0,0,0,0,0,0,0,0,0,1,0,0,{"$nulls":7},{"v":0,"d":"0.0"}]
[54,"Schütze 54",{"$f":"B12","v":"Verein XI"},null,null,0,0,0,0,0,0,0,0,0,0,0,0,0,0,0,0,0,0,0,0,0,0,1,0,0,{"$nulls":7},{"v":0,"d":"0.0"}]
[55,"Schütze 55",{"$f":"B12","v":"Verein XI"},null,null,0,0,0,0,0,0,0,0,0,0,0,0,0,0,0,0,0,0,0,0,0,0,1,0,0,{"$nulls":7},{"v":0,"d":"0.0"}]
[56,"Schütze 56",{"$f":"B13","v":"Verein XII"},null,null,0,0,0,0,0,0,0,0,0,0,0,0,0,0,0,0,0,0,0,0,0,0,0,0,1,{"$nulls":7},{"v":0,"d":"0.0"}]
[57,"Schütze 57",{"$f":"B13","v":"Verein XII"},null,null,0,0,0,0,0,0,0,0,0,0,0,0,0,0,0,0,0,0,0,0,0,0,0,0,1,{"$nulls":7},{"v":0,"d":"0.0"}]
[58,"Schütze 58",{"$f":"B13","v":"Verein XII"},null,null,0,0,0,0,0,0,0,0,0,0,0,0,0,0,0,0,0,0,0,0,0,0,0,0,1,{"$nulls":7},{"v":0,"d":"0.0"}]
[59,"Schütze 59",{"$f":"B13","v":"Verein XII"},null,null,0,0,0,0,0,0,0,0,0,0,0,0,0,0,0,0,0,0,0,0,0,0,0,0,1,{"$nulls":7},{"v":0,"d":"0.0"}]
[60,"Schütze 60",{"$f":"B13","v":"Verein XII"},null,null,0,0,0,0,0,0,0,0,0,0,0,0,0,0,0,0,0,0,0,0,0,0,0,0,1,{"$nulls":7},{"v":0,"d":"0.0"}]
[{"$nulls":6},{"$f":"LARGE(G16:G75,1)+LARGE(G16:G75,2)+LARGE(G16:G75,3)","v":394.90000000000003},{"$f":"SUM(H16:H75)","v":5},{"$f":"LARGE(I16:I75,1)+LARGE(I16:I75,2)+LARGE(I16:I75,3)","v":0},{"$f":"SUM(J16:J75)","v":4},{"$f":"LARGE(K16:K75,1)+LARGE(K16:K75,2)+LARGE(K16:K75,3)","v":318.6},{"$f":"SUM(L16:L75)","v":4},{"$f":"LARGE(M16:M75,1)+LARGE(M16:M75,2)+LARGE(M16:M75,3)","v":519.5},{"$f":"SUM(N16:N75)","v":3},{"$f":"LARGE(O16:O75,1)+LARGE(O16:O75,2)+LARGE(O16:O75,3)","v":565},{"$f":"SUM(P16:P75)","v":5},{"$f":"LARGE(Q16:Q75,1)+LARGE(Q16:Q75,2)+LARGE(Q16:Q75,3)","v":183.4},{"$f":"SUM(R16:R75)","v":3},{"$f":"LARGE(S16:S75,1)+LARGE(S16:S75,2)+LARGE(S16:S75,3)","v":0},{"$f":"SUM(T16:T75)","v":2},{"$f":"LARGE(U16:U75,1)+LARGE(U16:U75,2)+LARGE(U16:U75,3)","v":0},{"$f":"SUM(V16:V75)","v":3},{"$f":"LARGE(W16:W75,1)+LARGE(W16:W75,2)+LARGE(W16:W75,3)","v":0},{"$f":"SUM(X16:X75)","v":5},{"$f":"LARGE(Y16:Y75,1)+LARGE(Y16:Y75,2)+LARGE(Y16:Y75,3)","v":0},{"$f":"SUM(Z16:Z75)","v":5},{"$f":"LARGE(AA16:AA75,1)+LARGE(AA16:AA75,2)+LARGE(AA16:AA75,3)","v":0},{"$f":"SUM(AB16:AB75)","v":5},{"$f":"LARGE(AC16:AC75,1)+LARGE(AC16:AC75,2)+LARGE(AC16:AC75,3)","v":0},{"$f":"SUM(AD16:AD75)","v":5}]
[null,null,"per Email an: sk-huemmling@gmx.de"]

{"sheet":"Börgermoor","index":2,"n_rows":77,"n_cols":39,"rows_kept":77,"merged":[[0,34,0,35],[1,34,1,35],[4,34,4,35],[5,34,5,35],[6,34,6,35],[14,32,14,35]]}
[null,"Verein / Gruppe",null,"Ergebnisse",{"$nulls":29},"Austragungsort:",{"$f":"Übersicht!E4","v":"Börgermoor"}]
[1,{"$f":"'Wettkampf 1'!B2","v":"Lorup"},null,{"$f":"G76","v":404.5},{"$f":"IF(H76>4,\"Es sind zu viele Schützen in Wertung!\",\" \")","v":"Es sind zu viele Schützen in Wertung!"},{"$nulls":28},"Wettkampftag:",{"$f":"Übersicht!E3","v":"07.10."}]
[2,{"$f":"'Wettkampf 1'!B3","v":"Sögel"},null,{"$f":"I76","v":{"v":0,"d":"0.0"}},{"$f":"IF(J76>4,\"Es sind zu viele Schützen in Wertung!\",\" \")","v":" "}]
[3,{"$f":"'Wettkampf 1'!B4","v":"Spahnharenstätte"},null,{"$f":"K76","v":{"v":349.09999999999997,"d":"349.1"}},{"$f":"IF(L76>4,\"Es sind zu viele Schützen in Wertung!\",\" \")","v":"Es sind zu viele Schützen in Wertung!"},{"$nulls":30},"Ansprechpartner für Rückfragen:"]
[4,{"$f":"'Wettkampf 1'!B5","v":"Esterwegen"},null,{"$f":"M76","v":478.6},{"$f":"IF(N76>4,\"Es sind zu viele Schützen in Wertung!\",\" \")","v":" "},{"$nulls":28},"Name:"]
[5,{"$f":"'Wettkampf 1'!B6","v":"Lähden"},null,{"$f":"O76","v":545.3},{"$f":"IF(P76>4,\"Es sind zu viele Schützen in Wertung!\",\" \")","v":"Es sind zu viele Schützen in Wertung!"},{"$nulls":28},"Tel:"]
[6,{"$f":"'Wettkampf 1'!B7","v":"Börgermoor"},null,{"$f":"Q76","v":{"v":201.10000000000002,"d":"201.1"}},{"$f":"IF(R76>4,\"Es sind zu viele Schützen in Wertung!\",\" \")","v":" "},{"$nulls":28},"Standaufsicht:","Yvonne Segbers"]
[7,{"$f":"'Wettkampf 1'!B8","v":"Verein VII"},null,{"$f":"S76","v":{"v":0,"d":"0.0"}},{"$f":"IF(T76>4,\"Es sind zu viele Schützen in Wertung!\",\" \")","v":"Es sind zu viele Schützen in Wertung!"}]
[8,{"$f":"'Wettkampf 1'!B9","v":"Verein VIII"},null,{"$f":"U76","v":{"v":0,"d":"0.0"}},{"$f":"IF(V76>4,\"Es sind zu viele Schützen in Wertung!\",\" \")","v":" "}]
[9,{"$f":"'Wettkampf 1'!B10","v":"Verein IX"},null,{"$f":"W76","v":{"v":0,"d":"0.0"}},{"$f":"IF(X76>4,\"Es sind zu viele Schützen in Wertung!\",\" \")","v":"Es sind zu viele Schützen in Wertung!"}]
[10,{"$f":"'Wettkampf 1'!B11","v":"Verein X"},null,{"$f":"Y76","v":{"v":0,"d":"0.0"}},{"$f":"IF(Z76>4,\"Es sind zu viele Schützen in Wertung!\",\" \")","v":"Es sind zu viele Schützen in Wertung!"}]
[11,{"$f":"'Wettkampf 1'!B12","v":"Verein XI"},null,{"$f":"AA76","v":{"v":0,"d":"0.0"}},{"$f":"IF(AB76>4,\"Es sind zu viele Schützen in Wertung!\",\" \")","v":"Es sind zu viele Schützen in Wertung!"}]
[12,{"$f":"'Wettkampf 1'!B13","v":"Verein XII"},null,{"$f":"AC76","v":{"v":0,"d":"0.0"}},{"$f":"IF(AD76>4,\"Es sind zu viele Schützen in Wertung!\",\" \")","v":"Es sind zu viele Schützen in Wertung!"}]
[]
[null,"Einzelergebnisse:","Verein / Gruppe","Ergebnisse (mindestens 0 eintragen)","AW? Dann x eintippen",null,"Verein 1",null,"Verein 2",null,"Verein 3",null,"Verein 4",null,"Verein 5",null,"Verein 6",null,"Verein 7",null,"Verein 8",null,"Verein 9",null,"Verein 10",null,"Verein 11",null,"Verein 12",{"$nulls":3},"Proberechnung bei Streifen:"]
[1,{"$f":"'Wettkampf 1'!B16","v":"Wotte Lia"},{"$f":"'Wettkampf 1'!C16","v":"Lorup"},166.8,null,{"$f":"IF(E16=\"x\",\"0\",D16)","v":166.8},{"$f":"IF(C16=$B$2,F16,0)","v":166.8},{"$f":"(IF(AND($E16=\"\",$C16=$B$2),1,0))","v":1},{"$f":"IF($C16=$B$3,$F16,0)","v":0},{"$f":"(IF(AND($E16=\"\",$C16=$B$3),1,0))","v":0},{"$f":"IF($C16=$B$4,F16,0)","v":0},{"$f":"(IF(AND($E16=\"\",$C16=$B$4),1,0))","v":0},{"$f":"IF($C16=$B$5,F16,0)","v":0},{"$f":"(IF(AND($E16=\"\",$C16=$B$5),1,0))","v":0},{"$f":"IF($C16=$B$6,F16,0)","v":0},{"$f":"(IF(AND($E16=\"\",$C16=$B$6),1,0))","v":0},{"$f":"IF($C16=$B$7,F16,0)","v":0},{"$f":"(IF(AND($E16=\"\",$C16=$B$7),1,0))","v":0},{"$f":"IF($C16=$B$8,$F16,0)","v":0},{"$f":"(IF(AND($E16=\"\",$C16=$B$8),1,0))","v":0},{"$f":"IF($C16=$B$9,$F16,0)","v":0},{"$f":"(IF(AND($E16=\"\",$C16=$B$9),1,0))","v":0},{"$f":"IF($C16=$B$10,$F16,0)","v":0},{"$f":"(IF(AND($E16=\"\",$C16=$B$10),1,0))","v":0},{"$f":"IF($C16=$B$11,$F16,0)","v":0},{"$f":"(IF(AND($E16=\"\",$C16=$B$11),1,0))","v":0},{"$f":"IF($C16=$B$12,$F16,0)","v":0},{"$f":"(IF(AND($E16=\"\",$C16=$B$12),1,0))","v":0},{"$f":"IF($C16=$B$13,$F16,0)","v":0},{"$f":"(IF(AND($E16=\"\",$C16=$B$13),1,0))","v":0},{"$nulls":5},{"$f":"SUM(AG16:AI16)","v":{"v":0,"d":"0.0"}},{"$f":"IF(AJ16=D16,1,0)","v":0},{"$f":"IF(AJ16=0,0,1)","v":0},{"$f":"IF(AK16+AL16=2,\"Korrekt\",\"\")","v":""}]
[2,{"$f":"'Wettkampf 1'!B17","v":"Wotte Hannes"},{"$f":"'Wettkampf 1'!C17","v":"Lorup"},125.8,null,{"$f":"IF(E17=\"x\",\"0\",D17)","v":125.8},{"$f":"IF(C17=$B$2,F17,0)","v":125.8},{"$f":"(IF(AND($E17=\"\",$C17=$B$2),1,0))","v":1},{"$f":"IF($C17=$B$3,F17,0)","v":0},{"$f":"(IF(AND($E17=\"\",$C17=$B$3),1,0))","v":0},{"$f":"IF($C17=$B$4,F17,0)","v":0},{"$f":"(IF(AND($E17=\"\",$C17=$B$4),1,0))","v":0},{"$f":"IF($C17=$B$5,F17,0)","v":0},{"$f":"(IF(AND($E17=\"\",$C17=$B$5),1,0))","v":0},{"$f":"IF($C17=$B$6,F17,0)","v":0},{"$f":"(IF(AND($E17=\"\",$C17=$B$6),1,0))","v":0},{"$f":"IF($C17=$B$7,F17,0)","v":0},{"$f":"(IF(AND($E17=\"\",$C17=$B$7),1,0))","v":0},{"$f":"IF($C17=$B$8,$F17,0)","v":0},{"$f":"(IF(AND($E17=\"\",$C17=$B$8),1,0))","v":0},{"$f":"IF($C17=$B$9,$F17,0)","v":0},{"$f":"(IF(AND($E17=\"\",$C17=$B$9),1,0))","v":0},{"$f":"IF($C17=$B$10,$F17,0)","v":0},{"$f":"(IF(AND($E17=\"\",$C17=$B$10),1,0))","v":0},{"$f":"IF($C17=$B$11,$F17,0)","v":0},{"$f":"(IF(AND($E17=\"\",$C17=$B$11),1,0))","v":0},{"$f":"IF($C17=$B$12,$F17,0)","v":0},{"$f":"(IF(AND($E17=\"\",$C17=$B$12),1,0))","v":0},{"$f":"IF($C17=$B$13,$F17,0)","v":0},{"$f":"(IF(AND($E17=\"\",$C17=$B$13),1,0))","v":0},{"$nulls":5},{"$f":"SUM(AG17:AI17)","v":{"v":0,"d":"0.0"}},{"$f":"IF(AJ17=D17,1,0)","v":0},{"$f":"IF(AJ17=0,0,1)","v":0},{"$f":"IF(AK17+AL17=2,\"Korrekt\",\"\")","v":""}]
[3,{"$f":"'Wettkampf 1'!B18","v":"Gretenabeln Elias"},{"$f":"'Wettkampf 1'!C18","v":"Lorup"},111.9,null,111.9,111.9,1,0,0,0,0,0,0,0,0,0,0,0,0,0,0,0,0,0,0,0,0,0,0,{"$nulls":5},{"v":0,"d":"0.0"},0,0,""]
[4,{"$f":"'Wettkampf 1'!B19","v":"Helmer Maike"},{"$f":"'Wettkampf 1'!C19","v":"Lorup"},101.8,"x","0","0",0,0,0,0,0,0,0,0,0,0,0,0,0,0,0,0,0,0,0,0,0,0,0,{"$nulls":5},{"v":0,"d":"0.0"},0,0,""]
[5,{"$f":"'Wettkampf 1'!B20","v":"Többen Jannes"},{"$f":"'Wettkampf 1'!C20","v":"Lorup"},{"v":91,"d":"91.0"},"x","0","0",0,0,0,0,0,0,0,0,0,0,0,0,0,0,0,0,0,0,0,0,0,0,0,{"$nulls":5},{"v":0,"d":"0.0"},0,0,""]
[6,{"$f":"'Wettkampf 1'!B21","v":"Lüken Arne"},{"$f":"'Wettkampf 1'!C21","v":"Lorup"},107.8,null,107.8,107.8,1,0,0,0,0,0,0,0,0,0,0,0,0,0,0,0,0,0,0,0,0,0,0,{"$nulls":5},{"v":0,"d":"0.0"},0,0,""]
[7,{"$f":"'Wettkampf 1'!B22","v":"Schütze 7"},{"$f":"'Wettkampf 1'!C22","v":"Sögel"},null,null,{"v":0,"d":"0.0"},0,0,0,1,0,0,0,0,0,0,0,0,0,0,0,0,0,0,0,0,0,0,0,0,{"$nulls":5},{"v":0,"d":"0.0"},1,0,""]
[8,{"$f":"'Wettkampf 1'!B23","v":"Schütze 8"},{"$f":"'Wettkampf 1'!C23","v":"Sögel"},null,null,{"v":0,"d":"0.0"},0,0,0,1,0,0,0,0,0,0,0,0,0,0,0,0,0,0,0,0,0,0,0,0,{"$nulls":5},{"v":0,"d":"0.0"},1,0,""]
[9,{"$f":"'Wettkampf 1'!B24","v":"Schütze 9"},{"$f":"'Wettkampf 1'!C24","v":"Sögel"},null,null,{"v":0,"d":"0.0"},0,0,0,1,0,0,0,0,0,0,0,0,0,0,0,0,0,0,0,0,0,0,0,0,{"$nulls":5},{"v":0,"d":"0.0"},1,0,""]
[10,{"$f":"'Wettkampf 1'!B25","v":"Schütze 10"},{"$f":"'Wettkampf 1'!C25","v":"Sögel"},null,null,{"v":0,"d":"0.0"},0,0,0,1,0,0,0,0,0,0,0,0,0,0,0,0,0,0,0,0,0,0,0,0,{"$nulls":5},{"v":0,"d":"0.0"},1,0,""]
[11,{"$f":"'Wettkampf 1'!B26","v":"Engbers Hannes"},{"$f":"'Wettkampf 1'!C26","v":"Spahnharenstätte"},54.2,null,54.2,0,0,0,0,54.2,1,0,0,0,0,0,0,0,0,0,0,0,0,0,0,0,0,0,0,{"$nulls":5},{"v":0,"d":"0.0"},0,0,""]
[12,{"$f":"'Wettkampf 1'!B27","v":"Runde Marcel"},{"$f":"'Wettkampf 1'!C27","v":"Spahnharenstätte"},150.7,null,150.7,0,0,0,0,150.7,1,0,0,0,0,0,0,0,0,0,0,0,0,0,0,0,0,0,0,{"$nulls":5},{"v":0,"d":"0.0"},0,0,""]
[13,{"$f":"'Wettkampf 1'!B28","v":"Jansen Lars"},{"$f":"'Wettkampf 1'!C28","v":"Spahnharenstätte"},144.2,null,144.2,0,0,0,0,144.2,1,0,0,0,0,0,0,0,0,0,0,0,0,0,0,0,0,0,0,{"$nulls":5},{"v":0,"d":"0.0"},0,0,""]
[14,{"$f":"'Wettkampf 1'!B29","v":"Schütze 14"},{"$f":"'Wettkampf 1'!C29","v":"Spahnharenstätte"},null,null,{"v":0,"d":"0.0"},0,0,0,0,0,1,0,0,0,0,0,0,0,0,0,0,0,0,0,0,0,0,0,0,{"$nulls":5},{"v":0,"d":"0.0"},1,0,""]
[15,{"$f":"'Wettkampf 1'!B30","v":"Schütze 15"},{"$f":"'Wettkampf 1'!C30","v":"Spahnharenstätte"},null,null,{"v":0,"d":"0.0"},0,0,0,0,0,1,0,0,0,0,0,0,0,0,0,0,0,0,0,0,0,0,0,0,{"$nulls":5},{"v":0,"d":"0.0"},1,0,""]
[16,{"$f":"'Wettkampf 1'!B31","v":"Suhle Annalena"},{"$f":"'Wettkampf 1'!C31","v":"Esterwegen"},175.9,null,175.9,0,0,0,0,0,0,175.9,1,0,0,0,0,0,0,0,0,0,0,0,0,0,0,0,0,{"$nulls":5},{"v":0,"d":"0.0"},0,0,""]
[17,{"$f":"'Wettkampf 1'!B32","v":"Gäken Lena"},{"$f":"'Wettkampf 1'!C32","v":"Esterwegen"},170.4,null,170.4,0,0,0,0,0,0,170.4,1,0,0,0,0,0,0,0,0,0,0,0,0,0,0,0,0,{"$nulls":5},{"v":0,"d":"0.0"},0,0,""]
[18,{"$f":"'Wettkampf 1'!B33","v":"Jansen Daniel"},{"$f":"'Wettkampf 1'!C33","v":"Esterwegen"},132.3,null,132.3,0,0,0,0,0,0,132.3,1,0,0,0,0,0,0,0,0,0,0,0,0,0,0,0,0,{"$nulls":5},{"v":0,"d":"0.0"},0,0,""]
[19,{"$f":"'Wettkampf 1'!B34","v":"Pieper Jonas"},{"$f":"'Wettkampf 1'!C34","v":"Esterwegen"},null,"x","0",0,0,0,0,0,0,"0",0,0,0,0,0,0,0,0,0,0,0,0,0,0,0,0,0,{"$nulls":5},{"v":0,"d":"0.0"},1,0,""]
[20,{"$f":"'Wettkampf 1'!B35","v":"Schütze 20"},{"$f":"'Wettkampf 1'!C35","v":"Esterwegen"},null,"x","0",0,0,0,0,0,0,"0",0,0,0,0,0,0,0,0,0,0,0,0,0,0,0,0,0,{"$nulls":5},{"v":0,"d":"0.0"},1,0,""]
[21,{"$f":"'Wettkampf 1'!B36","v":"Hellweg Thea"},{"$f":"'Wettkampf 1'!C36","v":"Lähden"},174.2,null,174.2,0,0,0,0,0,0,0,0,174.2,1,0,0,0,0,0,0,0,0,0,0,0,0,0,0,{"$nulls":5},{"v":0,"d":"0.0"},0,0,""]
[22,{"$f":"'Wettkampf 1'!B37","v":"Bruns Henrik"},{"$f":"'Wettkampf 1'!C37","v":"Lähden"},180.2,null,180.2,0,0,0,0,0,0,0,0,180.2,1,0,0,0,0,0,0,0,0,0,0,0,0,0,0,{"$nulls":5},{"v":0,"d":"0.0"},0,0,""]
[23,{"$f":"'Wettkampf 1'!B38","v":"Buschen Johann "},{"$f":"'Wettkampf 1'!C38","v":"Lähden"},190.9,null,190.9,0,0,0,0,0,0,0,0,190.9,1,0,0,0,0,0,0,0,0,0,0,0,0,0,0,{"$nulls":5},{"v":0,"d":"0.0"},0,0,""]
[24,{"$f":"'Wettkampf 1'!B39","v":"Preut Jannis"},{"$f":"'Wettkampf 1'!C39","v":"Lähden"},null,null,{"v":0,"d":"0.0"},0,0,0,0,0,0,0,0,0,1,0,0,0,0,0,0,0,0,0,0,0,0,0,0,{"$nulls":5},{"v":0,"d":"0.0"},1,0,""]
[25,{"$f":"'Wettkampf 1'!B40","v":"Fleschenberg Jana"},{"$f":"'Wettkampf 1'!C40","v":"Lähden"},null,null,{"v":0,"d":"0.0"},0,0,0,0,0,0,0,0,0,1,0,0,0,0,0,0,0,0,0,0,0,0,0,0,{"$nulls":5},{"v":0,"d":"0.0"},1,0,""]
[26,{"$f":"'Wettkampf 1'!B41","v":"von Seggern Moritz"},{"$f":"'Wettkampf 1'!C41","v":"Lähden"},null,null,{"v":0,"d":"0.0"},0,0,0,0,0,0,0,0,0,1,0,0,0,0,0,0,0,0,0,0,0,0,0,0,{"$nulls":5},{"v":0,"d":"0.0"},1,0,""]
[27,{"$f":"'Wettkampf 1'!B42","v":"Kohnen Saskia"},{"$f":"'Wettkampf 1'!C42","v":"Börgermoor"},139.4,null,139.4,0,0,0,0,0,0,0,0,0,0,139.4,1,0,0,0,0,0,0,0,0,0,0,0,0,{"$nulls":5},{"v":0,"d":"0.0"},0,0,""]
[28,{"$f":"'Wettkampf 1'!B43","v":"Niemann Paul"},{"$f":"'Wettkampf 1'!C43","v":"Börgermoor"},61.7,null,61.7,0,0,0,0,0,0,0,0,0,0,61.7,1,0,0,0,0,0,0,0,0,0,0,0,0,{"$nulls":5},{"v":0,"d":"0.0"},0,0,""]
[29,{"$f":"'Wettkampf 1'!B44","v":"Schütze 29"},{"$f":"'Wettkampf 1'!C44","v":"Börgermoor"},null,null,{"v":0,"d":"0.0"},0,0,0,0,0,0,0,0,0,0,0,1,0,0,0,0,0,0,0,0,0,0,0,0,{"$nulls":5},{"v":0,"d":"0.0"},1,0,""]
[30,{"$f":"'Wettkampf 1'!B45","v":"Schütze 30"},{"$f":"'Wettkampf 1'!C45","v":"Börgermoor"},null,null,{"v":0,"d":"0.0"},0,0,0,0,0,0,0,0,0,0,0,1,0,0,0,0,0,0,0,0,0,0,0,0,{"$nulls":5},{"v":0,"d":"0.0"},1,0,""]
[31,{"$f":"'Wettkampf 1'!B46","v":"Stümpler Jan Luka "},{"$f":"'Wettkampf 1'!C46","v":"Lähden"},null,null,{"v":0,"d":"0.0"},0,0,0,0,0,0,0,0,0,1,0,0,0,0,0,0,0,0,0,0,0,0,0,0,{"$nulls":5},{"v":0,"d":"0.0"},{"$f":"IF(AJ46=D46,1,0)","v":1},{"$f":"IF(AJ46=0,0,1)","v":0},{"$f":"IF(AK46+AL46=2,\"Korrekt\",\"\")","v":""}]
[32,{"$f":"'Wettkampf 1'!B47","v":"Helmer, Nils"},{"$f":"'Wettkampf 1'!C47","v":"Lorup"},null,null,{"v":0,"d":"0.0"},0,1,0,0,0,0,0,0,0,0,0,0,0,0,0,0,0,0,0,0,0,0,0,0,{"$nulls":5},{"v":0,"d":"0.0"},1,0,""]
[33,{"$f":"'Wettkampf 1'!B48","v":"Schütze 33"},{"$f":"'Wettkampf 1'!C48","v":"Verein VII"},null,null,{"v":0,"d":"0.0"},0,0,0,0,0,0,0,0,0,0,0,0,0,1,0,0,0,0,0,0,0,0,0,0,{"$nulls":5},{"v":0,"d":"0.0"},1,0,""]
[34,{"$f":"'Wettkampf 1'!B49","v":"Schütze 34"},{"$f":"'Wettkampf 1'!C49","v":"Verein VII"},null,null,{"v":0,"d":"0.0"},0,0,0,0,0,0,0,0,0,0,0,0,0,1,0,0,0,0,0,0,0,0,0,0,{"$nulls":5},{"v":0,"d":"0.0"},1,0,""]
[35,{"$f":"'Wettkampf 1'!B50","v":"Schütze 35"},{"$f":"'Wettkampf 1'!C50","v":"Verein VII"},null,null,{"v":0,"d":"0.0"},0,0,0,0,0,0,0,0,0,0,0,0,0,1,0,0,0,0,0,0,0,0,0,0,{"$nulls":5},{"v":0,"d":"0.0"},1,0,""]
[36,{"$f":"'Wettkampf 1'!B51","v":"Schütze 36"},{"$f":"'Wettkampf 1'!C51","v":"Verein VII"},null,null,{"v":0,"d":"0.0"},0,0,0,0,0,0,0,0,0,0,0,0,0,1,0,0,0,0,0,0,0,0,0,0,{"$nulls":5},{"v":0,"d":"0.0"},{"$f":"IF(AJ51=D51,1,0)","v":1},{"$f":"IF(AJ51=0,0,1)","v":0},{"$f":"IF(AK51+AL51=2,\"Korrekt\",\"\")","v":""}]
[37,{"$f":"'Wettkampf 1'!B52","v":"Schütze 37"},{"$f":"'Wettkampf 1'!C52","v":"Verein VII"},null,null,{"v":0,"d":"0.0"},0,0,0,0,{"$f":"IF($C52=$B$4,F52,0)","v":0},0,{"$f":"IF($C52=$B$5,F52,0)","v":0},0,{"$f":"IF($C52=$B$6,F52,0)","v":0},0,{"$f":"IF($C52=$B$7,F52,0)","v":0},0,0,1,0,0,0,0,0,0,0,0,0,0,{"$nulls":5},{"v":0,"d":"0.0"}]
[38,{"$f":"'Wettkampf 1'!B53","v":"Schütze 38"},{"$f":"'Wettkampf 1'!C53","v":"Verein VIII"},null,null,{"v":0,"d":"0.0"},0,0,0,0,0,0,0,0,0,0,0,0,0,0,0,1,0,0,0,0,0,0,0,0,{"$nulls":5},{"v":0,"d":"0.0"}]
[39,{"$f":"'Wettkampf 1'!B54","v":"Schütze 39"},{"$f":"'Wettkampf 1'!C54","v":"Verein VIII"},null,null,{"v":0,"d":"0.0"},0,0,0,0,0,0,0,0,0,0,0,0,{"$f":"IF($C54=$B$8,$F54,0)","v":0},{"$f":"(IF(AND($E54=\"\",$C54=$B$8),1,0))","v":0},{"$f":"IF($C54=$B$9,$F54,0)","v":0},{"$f":"(IF(AND($E54=\"\",$C54=$B$9),1,0))","v":1},{"$f":"IF($C54=$B$10,$F54,0)","v":0},{"$f":"(IF(AND($E54=\"\",$C54=$B$10),1,0))","v":0},{"$f":"IF($C54=$B$11,$F54,0)","v":0},{"$f":"(IF(AND($E54=\"\",$C54=$B$11),1,0))","v":0},{"$f":"IF($C54=$B$12,$F54,0)","v":0},{"$f":"(IF(AND($E54=\"\",$C54=$B$12),1,0))","v":0},{"$f":"IF($C54=$B$13,$F54,0)","v":0},{"$f":"(IF(AND($E54=\"\",$C54=$B$13),1,0))","v":0},{"$nulls":5},{"v":0,"d":"0.0"}]
[40,{"$f":"'Wettkampf 1'!B55","v":"Schütze 40"},{"$f":"'Wettkampf 1'!C55","v":"Verein VIII"},null,null,{"v":0,"d":"0.0"},0,0,0,0,0,0,0,0,0,0,0,0,0,0,0,1,0,0,0,0,0,0,0,0,{"$nulls":5},{"v":0,"d":"0.0"}]
[41,{"$f":"'Wettkampf 1'!B56","v":"Schütze 41"},{"$f":"'Wettkampf 1'!C56","v":"Verein IX"},null,null,{"v":0,"d":"0.0"},0,0,0,0,0,0,0,0,0,0,0,0,0,0,0,0,0,1,0,0,0,0,0,0,{"$nulls":5},{"v":0,"d":"0.0"}]
[42,{"$f":"'Wettkampf 1'!B57","v":"Schütze 42"},{"$f":"'Wettkampf 1'!C57","v":"Verein IX"},null,null,{"v":0,"d":"0.0"},0,0,0,0,0,0,0,0,0,0,0,0,0,0,0,0,0,1,0,0,0,0,0,0,{"$nulls":5},{"v":0,"d":"0.0"}]
[43,{"$f":"'Wettkampf 1'!B58","v":"Schütze 43"},{"$f":"'Wettkampf 1'!C58","v":"Verein IX"},null,null,{"v":0,"d":"0.0"},0,0,0,0,0,0,0,0,0,0,0,0,0,0,0,0,0,1,0,0,0,0,0,0,{"$nulls":5},{"v":0,"d":"0.0"}]
[44,{"$f":"'Wettkampf 1'!B59","v":"Schütze 44"},{"$f":"'Wettkampf 1'!C59","v":"Verein IX"},null,null,{"v":0,"d":"0.0"},0,0,0,0,0,0,0,0,0,0,0,0,0,0,0,0,0,1,0,0,0,0,0,0,{"$nulls":5},{"v":0,"d":"0.0"}]
[45,{"$f":"'Wettkampf 1'!B60","v":"Schütze 45"},{"$f":"'Wettkampf 1'!C60","v":"Verein IX"},null,null,{"v":0,"d":"0.0"},0,0,0,0,0,0,0,0,0,0,0,0,0,0,0,0,0,1,0,0,0,0,0,0,{"$nulls":5},{"v":0,"d":"0.0"}]
[46,{"$f":"'Wettkampf 1'!B61","v":"Schütze 46"},{"$f":"'Wettkampf 1'!C61","v":"Verein X"},null,null,{"v":0,"d":"0.0"},0,0,0,0,0,0,0,0,0,0,0,0,0,0,0,0,0,0,0,1,0,0,0,0,{"$nulls":5},{"v":0,"d":"0.0"}]
[47,{"$f":"'Wettkampf 1'!B62","v":"Schütze 47"},{"$f":"'Wettkampf 1'!C62","v":"Verein X"},null,null,{"v":0,"d":"0.0"},0,0,0,0,0,0,0,0,0,0,0,0,0,0,0,0,0,0,0,1,0,0,0,0,{"$nulls":5},{"v":0,"d":"0.0"}]
[48,{"$f":"'Wettkampf 1'!B63","v":"Schütze 48"},{"$f":"'Wettkampf 1'!C63","v":"Verein X"},null,null,{"v":0,"d":"0.0"},0,0,0,0,0,0,0,0,0,0,0,0,0,0,0,0,0,0,0,1,0,0,0,0,{"$nulls":5},{"v":0,"d":"0.0"}]
[49,{"$f":"'Wettkampf 1'!B64","v":"Schütze 49"},{"$f":"'Wettkampf 1'!C64","v":"Verein X"},null,null,{"v":0,"d":"0.0"},0,0,0,0,0,0,0,0,0,0,0,0,0,0,0,0,0,0,0,1,0,0,0,0,{"$nulls":5},{"v":0,"d":"0.0"}]
[50,{"$f":"'Wettkampf 1'!B65","v":"Schütze 50"},{"$f":"'Wettkampf 1'!C65","v":"Verein X"},null,null,{"v":0,"d":"0.0"},0,0,0,0,0,0,0,0,0,0,0,0,0,0,0,0,0,0,0,1,0,0,0,0,{"$nulls":5},{"v":0,"d":"0.0"}]
[51,{"$f":"'Wettkampf 1'!B66","v":"Schütze 51"},{"$f":"'Wettkampf 1'!C66","v":"Verein XI"},null,null,{"v":0,"d":"0.0"},0,0,0,0,0,0,0,0,0,0,0,0,0,0,0,0,0,0,0,0,0,1,0,0,{"$nulls":5},{"v":0,"d":"0.0"}]
[52,{"$f":"'Wettkampf 1'!B67","v":"Schütze 52"},{"$f":"'Wettkampf 1'!C67","v":"Verein XI"},null,null,{"v":0,"d":"0.0"},0,0,0,0,0,0,0,0,0,0,0,0,0,0,0,0,0,0,0,0,0,1,0,0,{"$nulls":5},{"v":0,"d":"0.0"}]
[53,{"$f":"'Wettkampf 1'!B68","v":"Schütze 53"},{"$f":"'Wettkampf 1'!C68","v":"Verein XI"},null,null,{"v":0,"d":"0.0"},0,0,0,0,0,0,0,0,0,0,0,0,0,0,0,0,0,0,0,0,0,1,0,0,{"$nulls":5},{"v":0,"d":"0.0"}]
[54,{"$f":"'Wettkampf 1'!B69","v":"Schütze 54"},{"$f":"'Wettkampf 1'!C69","v":"Verein XI"},null,null,{"v":0,"d":"0.0"},0,0,0,0,0,0,0,0,0,0,0,0,0,0,0,0,0,0,0,0,0,1,0,0,{"$nulls":5},{"v":0,"d":"0.0"}]
[55,{"$f":"'Wettkampf 1'!B70","v":"Schütze 55"},{"$f":"'Wettkampf 1'!C70","v":"Verein XI"},null,null,{"v":0,"d":"0.0"},0,0,0,0,0,0,0,0,0,0,0,0,0,0,0,0,0,0,0,0,0,1,0,0,{"$nulls":5},{"v":0,"d":"0.0"}]
[56,{"$f":"'Wettkampf 1'!B71","v":"Schütze 56"},{"$f":"'Wettkampf 1'!C71","v":"Verein XII"},null,null,{"v":0,"d":"0.0"},0,0,0,0,0,0,0,0,0,0,0,0,0,0,0,0,0,0,0,0,0,0,0,1,{"$nulls":5},{"v":0,"d":"0.0"}]
[57,{"$f":"'Wettkampf 1'!B72","v":"Schütze 57"},{"$f":"'Wettkampf 1'!C72","v":"Verein XII"},null,null,{"v":0,"d":"0.0"},0,0,0,0,0,0,0,0,0,0,0,0,0,0,0,0,0,0,0,0,0,0,0,1,{"$nulls":5},{"v":0,"d":"0.0"}]
[58,{"$f":"'Wettkampf 1'!B73","v":"Schütze 58"},{"$f":"'Wettkampf 1'!C73","v":"Verein XII"},null,null,{"v":0,"d":"0.0"},0,0,0,0,0,0,0,0,0,0,0,0,0,0,0,0,0,0,0,0,0,0,0,1,{"$nulls":5},{"v":0,"d":"0.0"}]
[59,{"$f":"'Wettkampf 1'!B74","v":"Schütze 59"},{"$f":"'Wettkampf 1'!C74","v":"Verein XII"},null,null,{"v":0,"d":"0.0"},0,0,0,0,0,0,0,0,0,0,0,0,0,0,0,0,0,0,0,0,0,0,0,1,{"$nulls":5},{"v":0,"d":"0.0"}]
[60,{"$f":"'Wettkampf 1'!B75","v":"Schütze 60"},{"$f":"'Wettkampf 1'!C75","v":"Verein XII"},null,null,{"v":0,"d":"0.0"},0,0,0,0,0,0,0,0,0,0,0,0,0,0,0,0,0,0,0,0,0,0,0,1,{"$nulls":5},{"v":0,"d":"0.0"}]
[{"$nulls":6},{"$f":"LARGE(G16:G75,1)+LARGE(G16:G75,2)+LARGE(G16:G75,3)","v":404.5},{"$f":"SUM(H16:H75)","v":5},{"$f":"LARGE(I16:I75,1)+LARGE(I16:I75,2)+LARGE(I16:I75,3)","v":0},{"$f":"SUM(J16:J75)","v":4},{"$f":"LARGE(K16:K75,1)+LARGE(K16:K75,2)+LARGE(K16:K75,3)","v":349.09999999999997},{"$f":"SUM(L16:L75)","v":5},{"$f":"LARGE(M16:M75,1)+LARGE(M16:M75,2)+LARGE(M16:M75,3)","v":478.6},{"$f":"SUM(N16:N75)","v":3},{"$f":"LARGE(O16:O75,1)+LARGE(O16:O75,2)+LARGE(O16:O75,3)","v":545.3},{"$f":"SUM(P16:P75)","v":7},{"$f":"LARGE(Q16:Q75,1)+LARGE(Q16:Q75,2)+LARGE(Q16:Q75,3)","v":201.10000000000002},{"$f":"SUM(R16:R75)","v":4},{"$f":"LARGE(S16:S75,1)+LARGE(S16:S75,2)+LARGE(S16:S75,3)","v":0},{"$f":"SUM(T16:T75)","v":5},{"$f":"LARGE(U16:U75,1)+LARGE(U16:U75,2)+LARGE(U16:U75,3)","v":0},{"$f":"SUM(V16:V75)","v":3},{"$f":"LARGE(W16:W75,1)+LARGE(W16:W75,2)+LARGE(W16:W75,3)","v":0},{"$f":"SUM(X16:X75)","v":5},{"$f":"LARGE(Y16:Y75,1)+LARGE(Y16:Y75,2)+LARGE(Y16:Y75,3)","v":0},{"$f":"SUM(Z16:Z75)","v":5},{"$f":"LARGE(AA16:AA75,1)+LARGE(AA16:AA75,2)+LARGE(AA16:AA75,3)","v":0},{"$f":"SUM(AB16:AB75)","v":5},{"$f":"LARGE(AC16:AC75,1)+LARGE(AC16:AC75,2)+LARGE(AC16:AC75,3)","v":0},{"$f":"SUM(AD16:AD75)","v":5}]
[null,null,"per Email an: sk-huemmling@gmx.de"]

{"sheet":"3","index":3,"n_rows":77,"n_cols":39,"rows_kept":77,"merged":[[0,34,0,35],[1,34,1,35],[4,34,4,35],[5,34,5,35],[6,34,6,35],[14,32,14,35]]}
[null,"Verein / Gruppe",null,"Ergebnisse",{"$nulls":29},"Austragungsort:",{"$f":"Übersicht!F4","v":"Lahn"}]
[1,{"$f":"'Wettkampf 1'!B2","v":"Lorup"},null,{"$f":"G76","v":436.5},{"$f":"IF(H76>4,\"Es sind zu viele Schützen in Wertung!\",\" \")","v":"Es sind zu viele Schützen in Wertung!"},{"$nulls":28},"Wettkampftag:",{"$f":"Übersicht!F3","v":"04.11."}]
[2,{"$f":"'Wettkampf 1'!B3","v":"Sögel"},null,{"$f":"I76","v":{"v":0,"d":"0.0"}},{"$f":"IF(J76>4,\"Es sind zu viele Schützen in Wertung!\",\" \")","v":" "}]
[3,{"$f":"'Wettkampf 1'!B4","v":"Spahnharenstätte"},null,{"$f":"K76","v":263.5},{"$f":"IF(L76>4,\"Es sind zu viele Schützen in Wertung!\",\" \")","v":"Es sind zu viele Schützen in Wertung!"},{"$nulls":30},"Ansprechpartner für Rückfragen:"]
[4,{"$f":"'Wettkampf 1'!B5","v":"Esterwegen"},null,{"$f":"M76","v":{"v":515,"d":"515.0"}},{"$f":"IF(N76>4,\"Es sind zu viele Schützen in Wertung!\",\" \")","v":"Es sind zu viele Schützen in Wertung!"},{"$nulls":28},"Name:"]
[5,{"$f":"'Wettkampf 1'!B6","v":"Lähden"},null,{"$f":"O76","v":564.7},{"$f":"IF(P76>4,\"Es sind zu viele Schützen in Wertung!\",\" \")","v":"Es sind zu viele Schützen in Wertung!"},{"$nulls":28},"Tel:"]
[6,{"$f":"'Wettkampf 1'!B7","v":"Börgermoor"},null,{"$f":"Q76","v":227.3},{"$f":"IF(R76>4,\"Es sind zu viele Schützen in Wertung!\",\" \")","v":" "},{"$nulls":28},"Standaufsicht:","eintragen"]
[7,{"$f":"'Wettkampf 1'!B8","v":"Verein VII"},null,{"$f":"S76","v":{"v":0,"d":"0.0"}},{"$f":"IF(T76>4,\"Es sind zu viele Schützen in Wertung!\",\" \")","v":"Es sind zu viele Schützen in Wertung!"}]
[8,{"$f":"'Wettkampf 1'!B9","v":"Verein VIII"},null,{"$f":"U76","v":{"v":0,"d":"0.0"}},{"$f":"IF(V76>4,\"Es sind zu viele Schützen in Wertung!\",\" \")","v":" "}]
[9,{"$f":"'Wettkampf 1'!B10","v":"Verein IX"},null,{"$f":"W76","v":{"v":0,"d":"0.0"}},{"$f":"IF(X76>4,\"Es sind zu viele Schützen in Wertung!\",\" \")","v":"Es sind zu viele Schützen in Wertung!"}]
[10,{"$f":"'Wettkampf 1'!B11","v":"Verein X"},null,{"$f":"Y76","v":{"v":0,"d":"0.0"}},{"$f":"IF(Z76>4,\"Es sind zu viele Schützen in Wertung!\",\" \")","v":"Es sind zu viele Schützen in Wertung!"}]
[11,{"$f":"'Wettkampf 1'!B12","v":"Verein XI"},null,{"$f":"AA76","v":{"v":0,"d":"0.0"}},{"$f":"IF(AB76>4,\"Es sind zu viele Schützen in Wertung!\",\" \")","v":"Es sind zu viele Schützen in Wertung!"}]
[12,{"$f":"'Wettkampf 1'!B13","v":"Verein XII"},null,{"$f":"AC76","v":{"v":0,"d":"0.0"}},{"$f":"IF(AD76>4,\"Es sind zu viele Schützen in Wertung!\",\" \")","v":"Es sind zu viele Schützen in Wertung!"}]
[]
[null,"Einzelergebnisse:","Verein / Gruppe","Ergebnisse (mindestens 0 eintragen)","AW? Dann x eintippen",null,"Verein 1",null,"Verein 2",null,"Verein 3",null,"Verein 4",null,"Verein 5",null,"Verein 6",null,"Verein 7",null,"Verein 8",null,"Verein 9",null,"Verein 10",null,"Verein 11",null,"Verein 12",{"$nulls":3},"Proberechnung bei Streifen:"]
[1,{"$f":"'Wettkampf 1'!B16","v":"Wotte Lia"},{"$f":"'Wettkampf 1'!C16","v":"Lorup"},165.9,null,{"$f":"IF(E16=\"x\",\"0\",D16)","v":165.9},{"$f":"IF(C16=$B$2,F16,0)","v":165.9},{"$f":"(IF(AND($E16=\"\",$C16=$B$2),1,0))","v":1},{"$f":"IF($C16=$B$3,$F16,0)","v":0},{"$f":"(IF(AND($E16=\"\",$C16=$B$3),1,0))","v":0},{"$f":"IF($C16=$B$4,F16,0)","v":0},{"$f":"(IF(AND($E16=\"\",$C16=$B$4),1,0))","v":0},{"$f":"IF($C16=$B$5,F16,0)","v":0},{"$f":"(IF(AND($E16=\"\",$C16=$B$5),1,0))","v":0},{"$f":"IF($C16=$B$6,F16,0)","v":0},{"$f":"(IF(AND($E16=\"\",$C16=$B$6),1,0))","v":0},{"$f":"IF($C16=$B$7,F16,0)","v":0},{"$f":"(IF(AND($E16=\"\",$C16=$B$7),1,0))","v":0},{"$f":"IF($C16=$B$8,$F16,0)","v":0},{"$f":"(IF(AND($E16=\"\",$C16=$B$8),1,0))","v":0},{"$f":"IF($C16=$B$9,$F16,0)","v":0},{"$f":"(IF(AND($E16=\"\",$C16=$B$9),1,0))","v":0},{"$f":"IF($C16=$B$10,$F16,0)","v":0},{"$f":"(IF(AND($E16=\"\",$C16=$B$10),1,0))","v":0},{"$f":"IF($C16=$B$11,$F16,0)","v":0},{"$f":"(IF(AND($E16=\"\",$C16=$B$11),1,0))","v":0},{"$f":"IF($C16=$B$12,$F16,0)","v":0},{"$f":"(IF(AND($E16=\"\",$C16=$B$12),1,0))","v":0},{"$f":"IF($C16=$B$13,$F16,0)","v":0},{"$f":"(IF(AND($E16=\"\",$C16=$B$13),1,0))","v":0},{"$nulls":5},{"$f":"SUM(AG16:AI16)","v":{"v":0,"d":"0.0"}},{"$f":"IF(AJ16=D16,1,0)","v":0},{"$f":"IF(AJ16=0,0,1)","v":0},{"$f":"IF(AK16+AL16=2,\"Korrekt\",\"\")","v":""}]
[2,{"$f":"'Wettkampf 1'!B17","v":"Wotte Hannes"},{"$f":"'Wettkampf 1'!C17","v":"Lorup"},139.7,null,{"$f":"IF(E17=\"x\",\"0\",D17)","v":139.7},{"$f":"IF(C17=$B$2,F17,0)","v":139.7},{"$f":"(IF(AND($E17=\"\",$C17=$B$2),1,0))","v":1},{"$f":"IF($C17=$B$3,F17,0)","v":0},{"$f":"(IF(AND($E17=\"\",$C17=$B$3),1,0))","v":0},{"$f":"IF($C17=$B$4,F17,0)","v":0},{"$f":"(IF(AND($E17=\"\",$C17=$B$4),1,0))","v":0},{"$f":"IF($C17=$B$5,F17,0)","v":0},{"$f":"(IF(AND($E17=\"\",$C17=$B$5),1,0))","v":0},{"$f":"IF($C17=$B$6,F17,0)","v":0},{"$f":"(IF(AND($E17=\"\",$C17=$B$6),1,0))","v":0},{"$f":"IF($C17=$B$7,F17,0)","v":0},{"$f":"(IF(AND($E17=\"\",$C17=$B$7),1,0))","v":0},{"$f":"IF($C17=$B$8,$F17,0)","v":0},{"$f":"(IF(AND($E17=\"\",$C17=$B$8),1,0))","v":0},{"$f":"IF($C17=$B$9,$F17,0)","v":0},{"$f":"(IF(AND($E17=\"\",$C17=$B$9),1,0))","v":0},{"$f":"IF($C17=$B$10,$F17,0)","v":0},{"$f":"(IF(AND($E17=\"\",$C17=$B$10),1,0))","v":0},{"$f":"IF($C17=$B$11,$F17,0)","v":0},{"$f":"(IF(AND($E17=\"\",$C17=$B$11),1,0))","v":0},{"$f":"IF($C17=$B$12,$F17,0)","v":0},{"$f":"(IF(AND($E17=\"\",$C17=$B$12),1,0))","v":0},{"$f":"IF($C17=$B$13,$F17,0)","v":0},{"$f":"(IF(AND($E17=\"\",$C17=$B$13),1,0))","v":0},{"$nulls":5},{"$f":"SUM(AG17:AI17)","v":{"v":0,"d":"0.0"}},{"$f":"IF(AJ17=D17,1,0)","v":0},{"$f":"IF(AJ17=0,0,1)","v":0},{"$f":"IF(AK17+AL17=2,\"Korrekt\",\"\")","v":""}]
[3,{"$f":"'Wettkampf 1'!B18","v":"Gretenabeln Elias"},{"$f":"'Wettkampf 1'!C18","v":"Lorup"},82.6,"x","0","0",0,0,0,0,0,0,0,0,0,0,0,0,0,0,0,0,0,0,0,0,0,0,0,{"$nulls":5},{"v":0,"d":"0.0"},0,0,""]
[4,{"$f":"'Wettkampf 1'!B19","v":"Helmer Maike"},{"$f":"'Wettkampf 1'!C19","v":"Lorup"},130.9,null,130.9,130.9,1,0,0,0,0,0,0,0,0,0,0,0,0,0,0,0,0,0,0,0,0,0,0,{"$nulls":5},{"v":0,"d":"0.0"},0,0,""]
[5,{"$f":"'Wettkampf 1'!B20","v":"Többen Jannes"},{"$f":"'Wettkampf 1'!C20","v":"Lorup"},{"v":76,"d":"76.0"},"x","0","0",0,0,0,0,0,0,0,0,0,0,0,0,0,0,0,0,0,0,0,0,0,0,0,{"$nulls":5},{"v":0,"d":"0.0"},0,0,""]
[6,{"$f":"'Wettkampf 1'!B21","v":"Lüken Arne"},{"$f":"'Wettkampf 1'!C21","v":"Lorup"},114.4,null,114.4,114.4,1,0,0,0,0,0,0,0,0,0,0,0,0,0,0,0,0,0,0,0,0,0,0,{"$nulls":5},{"v":0,"d":"0.0"},0,0,""]
[7,{"$f":"'Wettkampf 1'!B22","v":"Schütze 7"},{"$f":"'Wettkampf 1'!C22","v":"Sögel"},null,null,{"v":0,"d":"0.0"},0,0,0,1,0,0,0,0,0,0,0,0,0,0,0,0,0,0,0,0,0,0,0,0,{"$nulls":5},{"v":0,"d":"0.0"},1,0,""]
[8,{"$f":"'Wettkampf 1'!B23","v":"Schütze 8"},{"$f":"'Wettkampf 1'!C23","v":"Sögel"},null,null,{"v":0,"d":"0.0"},0,0,0,1,0,0,0,0,0,0,0,0,0,0,0,0,0,0,0,0,0,0,0,0,{"$nulls":5},{"v":0,"d":"0.0"},1,0,""]
[9,{"$f":"'Wettkampf 1'!B24","v":"Schütze 9"},{"$f":"'Wettkampf 1'!C24","v":"Sögel"},null,null,{"v":0,"d":"0.0"},0,0,0,1,0,0,0,0,0,0,0,0,0,0,0,0,0,0,0,0,0,0,0,0,{"$nulls":5},{"v":0,"d":"0.0"},1,0,""]
[10,{"$f":"'Wettkampf 1'!B25","v":"Schütze 10"},{"$f":"'Wettkampf 1'!C25","v":"Sögel"},null,null,{"v":0,"d":"0.0"},0,0,0,1,0,0,0,0,0,0,0,0,0,0,0,0,0,0,0,0,0,0,0,0,{"$nulls":5},{"v":0,"d":"0.0"},1,0,""]
[11,{"$f":"'Wettkampf 1'!B26","v":"Engbers Hannes"},{"$f":"'Wettkampf 1'!C26","v":"Spahnharenstätte"},null,null,{"v":0,"d":"0.0"},0,0,0,0,0,1,0,0,0,0,0,0,0,0,0,0,0,0,0,0,0,0,0,0,{"$nulls":5},{"v":0,"d":"0.0"},1,0,""]
[12,{"$f":"'Wettkampf 1'!B27","v":"Runde Marcel"},{"$f":"'Wettkampf 1'!C27","v":"Spahnharenstätte"},144.5,null,144.5,0,0,0,0,144.5,1,0,0,0,0,0,0,0,0,0,0,0,0,0,0,0,0,0,0,{"$nulls":5},{"v":0,"d":"0.0"},0,0,""]
[13,{"$f":"'Wettkampf 1'!B28","v":"Jansen Lars"},{"$f":"'Wettkampf 1'!C28","v":"Spahnharenstätte"},{"v":119,"d":"119.0"},null,{"v":119,"d":"119.0"},0,0,0,0,119,1,0,0,0,0,0,0,0,0,0,0,0,0,0,0,0,0,0,0,{"$nulls":5},{"v":0,"d":"0.0"},0,0,""]
[14,{"$f":"'Wettkampf 1'!B29","v":"Schütze 14"},{"$f":"'Wettkampf 1'!C29","v":"Spahnharenstätte"},null,null,{"v":0,"d":"0.0"},0,0,0,0,0,1,0,0,0,0,0,0,0,0,0,0,0,0,0,0,0,0,0,0,{"$nulls":5},{"v":0,"d":"0.0"},1,0,""]
[15,{"$f":"'Wettkampf 1'!B30","v":"Schütze 15"},{"$f":"'Wettkampf 1'!C30","v":"Spahnharenstätte"},null,null,{"v":0,"d":"0.0"},0,0,0,0,0,1,0,0,0,0,0,0,0,0,0,0,0,0,0,0,0,0,0,0,{"$nulls":5},{"v":0,"d":"0.0"},1,0,""]
[16,{"$f":"'Wettkampf 1'!B31","v":"Suhle Annalena"},{"$f":"'Wettkampf 1'!C31","v":"Esterwegen"},184.4,null,184.4,0,0,0,0,0,0,184.4,1,0,0,0,0,0,0,0,0,0,0,0,0,0,0,0,0,{"$nulls":5},{"v":0,"d":"0.0"},0,0,""]
[17,{"$f":"'Wettkampf 1'!B32","v":"Gäken Lena"},{"$f":"'Wettkampf 1'!C32","v":"Esterwegen"},175.5,null,175.5,0,0,0,0,0,0,175.5,1,0,0,0,0,0,0,0,0,0,0,0,0,0,0,0,0,{"$nulls":5},{"v":0,"d":"0.0"},0,0,""]
[18,{"$f":"'Wettkampf 1'!B33","v":"Jansen Daniel"},{"$f":"'Wettkampf 1'!C33","v":"Esterwegen"},155.1,null,155.1,0,0,0,0,0,0,155.1,1,0,0,0,0,0,0,0,0,0,0,0,0,0,0,0,0,{"$nulls":5},{"v":0,"d":"0.0"},0,0,""]
[19,{"$f":"'Wettkampf 1'!B34","v":"Pieper Jonas"},{"$f":"'Wettkampf 1'!C34","v":"Esterwegen"},null,null,{"v":0,"d":"0.0"},0,0,0,0,0,0,0,1,0,0,0,0,0,0,0,0,0,0,0,0,0,0,0,0,{"$nulls":5},{"v":0,"d":"0.0"},1,0,""]
[20,{"$f":"'Wettkampf 1'!B35","v":"Schütze 20"},{"$f":"'Wettkampf 1'!C35","v":"Esterwegen"},null,null,{"v":0,"d":"0.0"},0,0,0,0,0,0,0,1,0,0,0,0,0,0,0,0,0,0,0,0,0,0,0,0,{"$nulls":5},{"v":0,"d":"0.0"},1,0,""]
[21,{"$f":"'Wettkampf 1'!B36","v":"Hellweg Thea"},{"$f":"'Wettkampf 1'!C36","v":"Lähden"},181.9,null,181.9,0,0,0,0,0,0,0,0,181.9,1,0,0,0,0,0,0,0,0,0,0,0,0,0,0,{"$nulls":5},{"v":0,"d":"0.0"},0,0,""]
[22,{"$f":"'Wettkampf 1'!B37","v":"Bruns Henrik"},{"$f":"'Wettkampf 1'!C37","v":"Lähden"},187.9,null,187.9,0,0,0,0,0,0,0,0,187.9,1,0,0,0,0,0,0,0,0,0,0,0,0,0,0,{"$nulls":5},{"v":0,"d":"0.0"},0,0,""]
[23,{"$f":"'Wettkampf 1'!B38","v":"Buschen Johann "},{"$f":"'Wettkampf 1'!C38","v":"Lähden"},194.9,null,194.9,0,0,0,0,0,0,0,0,194.9,1,0,0,0,0,0,0,0,0,0,0,0,0,0,0,{"$nulls":5},{"v":0,"d":"0.0"},0,0,""]
[24,{"$f":"'Wettkampf 1'!B39","v":"Preut Jannis"},{"$f":"'Wettkampf 1'!C39","v":"Lähden"},{"v":173,"d":"173.0"},null,{"v":173,"d":"173.0"},0,0,0,0,0,0,0,0,173,1,0,0,0,0,0,0,0,0,0,0,0,0,0,0,{"$nulls":5},{"v":0,"d":"0.0"},0,0,""]
[25,{"$f":"'Wettkampf 1'!B40","v":"Fleschenberg Jana"},{"$f":"'Wettkampf 1'!C40","v":"Lähden"},178.6,"x","0",0,0,0,0,0,0,0,0,"0",0,0,0,0,0,0,0,0,0,0,0,0,0,0,0,{"$nulls":5},{"v":0,"d":"0.0"},0,0,""]
[26,{"$f":"'Wettkampf 1'!B41","v":"von Seggern Moritz"},{"$f":"'Wettkampf 1'!C41","v":"Lähden"},null,"x","0",0,0,0,0,0,0,0,0,"0",0,0,0,0,0,0,0,0,0,0,0,0,0,0,0,{"$nulls":5},{"v":0,"d":"0.0"},1,0,""]
[27,{"$f":"'Wettkampf 1'!B42","v":"Kohnen Saskia"},{"$f":"'Wettkampf 1'!C42","v":"Börgermoor"},135.8,null,135.8,0,0,0,0,0,0,0,0,0,0,135.8,1,0,0,0,0,0,0,0,0,0,0,0,0,{"$nulls":5},{"v":0,"d":"0.0"},0,0,""]
[28,{"$f":"'Wettkampf 1'!B43","v":"Niemann Paul"},{"$f":"'Wettkampf 1'!C43","v":"Börgermoor"},91.5,null,91.5,0,0,0,0,0,0,0,0,0,0,91.5,1,0,0,0,0,0,0,0,0,0,0,0,0,{"$nulls":5},{"v":0,"d":"0.0"},0,0,""]
[29,{"$f":"'Wettkampf 1'!B44","v":"Schütze 29"},{"$f":"'Wettkampf 1'!C44","v":"Börgermoor"},null,null,{"v":0,"d":"0.0"},0,0,0,0,0,0,0,0,0,0,0,1,0,0,0,0,0,0,0,0,0,0,0,0,{"$nulls":5},{"v":0,"d":"0.0"},1,0,""]
[30,{"$f":"'Wettkampf 1'!B45","v":"Schütze 30"},{"$f":"'Wettkampf 1'!C45","v":"Börgermoor"},null,null,{"v":0,"d":"0.0"},0,0,0,0,0,0,0,0,0,0,0,1,0,0,0,0,0,0,0,0,0,0,0,0,{"$nulls":5},{"v":0,"d":"0.0"},1,0,""]
[31,{"$f":"'Wettkampf 1'!B46","v":"Stümpler Jan Luka "},{"$f":"'Wettkampf 1'!C46","v":"Lähden"},null,null,{"v":0,"d":"0.0"},0,0,0,0,0,0,0,0,0,1,0,0,0,0,0,0,0,0,0,0,0,0,0,0,{"$nulls":5},{"v":0,"d":"0.0"},1,0,""]
[32,{"$f":"'Wettkampf 1'!B47","v":"Helmer, Nils"},{"$f":"'Wettkampf 1'!C47","v":"Lorup"},null,null,{"v":0,"d":"0.0"},0,1,0,0,0,0,0,0,0,0,0,0,0,0,0,0,0,0,0,0,0,0,0,0,{"$nulls":5},{"v":0,"d":"0.0"},1,0,""]
[33,{"$f":"'Wettkampf 1'!B48","v":"Schütze 33"},{"$f":"'Wettkampf 1'!C48","v":"Verein VII"},null,null,{"v":0,"d":"0.0"},0,0,0,0,0,0,0,0,0,0,0,0,0,1,0,0,0,0,0,0,0,0,0,0,{"$nulls":5},{"v":0,"d":"0.0"},1,0,""]
[34,{"$f":"'Wettkampf 1'!B49","v":"Schütze 34"},{"$f":"'Wettkampf 1'!C49","v":"Verein VII"},null,null,{"v":0,"d":"0.0"},0,0,0,0,0,0,0,0,0,0,0,0,0,1,0,0,0,0,0,0,0,0,0,0,{"$nulls":5},{"v":0,"d":"0.0"},1,0,""]
[35,{"$f":"'Wettkampf 1'!B50","v":"Schütze 35"},{"$f":"'Wettkampf 1'!C50","v":"Verein VII"},null,null,{"v":0,"d":"0.0"},0,0,0,0,0,0,0,0,0,0,0,0,0,1,0,0,0,0,0,0,0,0,0,0,{"$nulls":5},{"v":0,"d":"0.0"},1,0,""]
[36,{"$f":"'Wettkampf 1'!B51","v":"Schütze 36"},{"$f":"'Wettkampf 1'!C51","v":"Verein VII"},null,null,{"v":0,"d":"0.0"},0,0,0,0,0,0,0,0,0,0,0,0,0,1,0,0,0,0,0,0,0,0,0,0,{"$nulls":5},{"v":0,"d":"0.0"},1,0,""]
[37,{"$f":"'Wettkampf 1'!B52","v":"Schütze 37"},{"$f":"'Wettkampf 1'!C52","v":"Verein VII"},null,null,{"v":0,"d":"0.0"},0,0,0,0,0,0,0,0,0,0,0,0,0,1,0,0,0,0,0,0,0,0,0,0,{"$nulls":5},{"v":0,"d":"0.0"}]
[38,{"$f":"'Wettkampf 1'!B53","v":"Schütze 38"},{"$f":"'Wettkampf 1'!C53","v":"Verein VIII"},null,null,{"v":0,"d":"0.0"},0,0,0,0,0,0,0,0,0,0,0,0,0,0,0,1,0,0,0,0,0,0,0,0,{"$nulls":5},{"v":0,"d":"0.0"}]
[39,{"$f":"'Wettkampf 1'!B54","v":"Schütze 39"},{"$f":"'Wettkampf 1'!C54","v":"Verein VIII"},null,null,{"v":0,"d":"0.0"},0,0,0,0,0,0,0,0,0,0,0,0,{"$f":"IF($C54=$B$8,$F54,0)","v":0},{"$f":"(IF(AND($E54=\"\",$C54=$B$8),1,0))","v":0},{"$f":"IF($C54=$B$9,$F54,0)","v":0},{"$f":"(IF(AND($E54=\"\",$C54=$B$9),1,0))","v":1},{"$f":"IF($C54=$B$10,$F54,0)","v":0},{"$f":"(IF(AND($E54=\"\",$C54=$B$10),1,0))","v":0},{"$f":"IF($C54=$B$11,$F54,0)","v":0},{"$f":"(IF(AND($E54=\"\",$C54=$B$11),1,0))","v":0},{"$f":"IF($C54=$B$12,$F54,0)","v":0},{"$f":"(IF(AND($E54=\"\",$C54=$B$12),1,0))","v":0},{"$f":"IF($C54=$B$13,$F54,0)","v":0},{"$f":"(IF(AND($E54=\"\",$C54=$B$13),1,0))","v":0},{"$nulls":5},{"v":0,"d":"0.0"}]
[40,{"$f":"'Wettkampf 1'!B55","v":"Schütze 40"},{"$f":"'Wettkampf 1'!C55","v":"Verein VIII"},null,null,{"v":0,"d":"0.0"},0,0,0,0,0,0,0,0,0,0,0,0,0,0,0,1,0,0,0,0,0,0,0,0,{"$nulls":5},{"v":0,"d":"0.0"}]
[41,{"$f":"'Wettkampf 1'!B56","v":"Schütze 41"},{"$f":"'Wettkampf 1'!C56","v":"Verein IX"},null,null,{"v":0,"d":"0.0"},0,0,0,0,0,0,0,0,0,0,0,0,0,0,0,0,0,1,0,0,0,0,0,0,{"$nulls":5},{"v":0,"d":"0.0"}]
[42,{"$f":"'Wettkampf 1'!B57","v":"Schütze 42"},{"$f":"'Wettkampf 1'!C57","v":"Verein IX"},null,null,{"v":0,"d":"0.0"},0,0,0,0,0,0,0,0,0,0,0,0,0,0,0,0,0,1,0,0,0,0,0,0,{"$nulls":5},{"v":0,"d":"0.0"}]
[43,{"$f":"'Wettkampf 1'!B58","v":"Schütze 43"},{"$f":"'Wettkampf 1'!C58","v":"Verein IX"},null,null,{"v":0,"d":"0.0"},0,0,0,0,0,0,0,0,0,0,0,0,0,0,0,0,0,1,0,0,0,0,0,0,{"$nulls":5},{"v":0,"d":"0.0"}]
[44,{"$f":"'Wettkampf 1'!B59","v":"Schütze 44"},{"$f":"'Wettkampf 1'!C59","v":"Verein IX"},null,null,{"v":0,"d":"0.0"},0,0,0,0,0,0,0,0,0,0,0,0,0,0,0,0,0,1,0,0,0,0,0,0,{"$nulls":5},{"v":0,"d":"0.0"}]
[45,{"$f":"'Wettkampf 1'!B60","v":"Schütze 45"},{"$f":"'Wettkampf 1'!C60","v":"Verein IX"},null,null,{"v":0,"d":"0.0"},0,0,0,0,0,0,0,0,0,0,0,0,0,0,0,0,0,1,0,0,0,0,0,0,{"$nulls":5},{"v":0,"d":"0.0"}]
[46,{"$f":"'Wettkampf 1'!B61","v":"Schütze 46"},{"$f":"'Wettkampf 1'!C61","v":"Verein X"},null,null,{"v":0,"d":"0.0"},0,0,0,0,0,0,0,0,0,0,0,0,0,0,0,0,0,0,0,1,0,0,0,0,{"$nulls":5},{"v":0,"d":"0.0"}]
[47,{"$f":"'Wettkampf 1'!B62","v":"Schütze 47"},{"$f":"'Wettkampf 1'!C62","v":"Verein X"},null,null,{"v":0,"d":"0.0"},0,0,0,0,0,0,0,0,0,0,0,0,0,0,0,0,0,0,0,1,0,0,0,0,{"$nulls":5},{"v":0,"d":"0.0"}]
[48,{"$f":"'Wettkampf 1'!B63","v":"Schütze 48"},{"$f":"'Wettkampf 1'!C63","v":"Verein X"},null,null,{"v":0,"d":"0.0"},0,0,0,0,0,0,0,0,0,0,0,0,0,0,0,0,0,0,0,1,0,0,0,0,{"$nulls":5},{"v":0,"d":"0.0"}]
[49,{"$f":"'Wettkampf 1'!B64","v":"Schütze 49"},{"$f":"'Wettkampf 1'!C64","v":"Verein X"},null,null,{"v":0,"d":"0.0"},0,0,0,0,0,0,0,0,0,0,0,0,0,0,0,0,0,0,0,1,0,0,0,0,{"$nulls":5},{"v":0,"d":"0.0"}]
[50,{"$f":"'Wettkampf 1'!B65","v":"Schütze 50"},{"$f":"'Wettkampf 1'!C65","v":"Verein X"},null,null,{"v":0,"d":"0.0"},0,0,0,0,0,0,0,0,0,0,0,0,0,0,0,0,0,0,0,1,0,0,0,0,{"$nulls":5},{"v":0,"d":"0.0"}]
[51,{"$f":"'Wettkampf 1'!B66","v":"Schütze 51"},{"$f":"'Wettkampf 1'!C66","v":"Verein XI"},null,null,{"v":0,"d":"0.0"},0,0,0,0,0,0,0,0,0,0,0,0,0,0,0,0,0,0,0,0,0,1,0,0,{"$nulls":5},{"v":0,"d":"0.0"}]
[52,{"$f":"'Wettkampf 1'!B67","v":"Schütze 52"},{"$f":"'Wettkampf 1'!C67","v":"Verein XI"},null,null,{"v":0,"d":"0.0"},0,0,0,0,0,0,0,0,0,0,0,0,0,0,0,0,0,0,0,0,0,1,0,0,{"$nulls":5},{"v":0,"d":"0.0"}]
[53,{"$f":"'Wettkampf 1'!B68","v":"Schütze 53"},{"$f":"'Wettkampf 1'!C68","v":"Verein XI"},null,null,{"v":0,"d":"0.0"},0,0,0,0,0,0,0,0,0,0,0,0,0,0,0,0,0,0,0,0,0,1,0,0,{"$nulls":5},{"v":0,"d":"0.0"}]
[54,{"$f":"'Wettkampf 1'!B69","v":"Schütze 54"},{"$f":"'Wettkampf 1'!C69","v":"Verein XI"},null,null,{"v":0,"d":"0.0"},0,0,0,0,0,0,0,0,0,0,0,0,0,0,0,0,0,0,0,0,0,1,0,0,{"$nulls":5},{"v":0,"d":"0.0"}]
[55,{"$f":"'Wettkampf 1'!B70","v":"Schütze 55"},{"$f":"'Wettkampf 1'!C70","v":"Verein XI"},null,null,{"v":0,"d":"0.0"},0,0,0,0,0,0,0,0,0,0,0,0,0,0,0,0,0,0,0,0,0,1,0,0,{"$nulls":5},{"v":0,"d":"0.0"}]
[56,{"$f":"'Wettkampf 1'!B71","v":"Schütze 56"},{"$f":"'Wettkampf 1'!C71","v":"Verein XII"},null,null,{"v":0,"d":"0.0"},0,0,0,0,0,0,0,0,0,0,0,0,0,0,0,0,0,0,0,0,0,0,0,1,{"$nulls":5},{"v":0,"d":"0.0"}]
[57,{"$f":"'Wettkampf 1'!B72","v":"Schütze 57"},{"$f":"'Wettkampf 1'!C72","v":"Verein XII"},null,null,{"v":0,"d":"0.0"},0,0,0,0,0,0,0,0,0,0,0,0,0,0,0,0,0,0,0,0,0,0,0,1,{"$nulls":5},{"v":0,"d":"0.0"}]
[58,{"$f":"'Wettkampf 1'!B73","v":"Schütze 58"},{"$f":"'Wettkampf 1'!C73","v":"Verein XII"},null,null,{"v":0,"d":"0.0"},0,0,0,0,0,0,0,0,0,0,0,0,0,0,0,0,0,0,0,0,0,0,0,1,{"$nulls":5},{"v":0,"d":"0.0"}]
[59,{"$f":"'Wettkampf 1'!B74","v":"Schütze 59"},{"$f":"'Wettkampf 1'!C74","v":"Verein XII"},null,null,{"v":0,"d":"0.0"},0,0,0,0,0,0,0,0,0,0,0,0,0,0,0,0,0,0,0,0,0,0,0,1,{"$nulls":5},{"v":0,"d":"0.0"}]
[60,{"$f":"'Wettkampf 1'!B75","v":"Schütze 60"},{"$f":"'Wettkampf 1'!C75","v":"Verein XII"},null,null,{"v":0,"d":"0.0"},0,0,0,0,0,0,0,0,0,0,0,0,0,0,0,0,0,0,0,0,0,0,0,1,{"$nulls":5},{"v":0,"d":"0.0"}]
[{"$nulls":6},{"$f":"LARGE(G16:G75,1)+LARGE(G16:G75,2)+LARGE(G16:G75,3)","v":436.5},{"$f":"SUM(H16:H75)","v":5},{"$f":"LARGE(I16:I75,1)+LARGE(I16:I75,2)+LARGE(I16:I75,3)","v":0},{"$f":"SUM(J16:J75)","v":4},{"$f":"LARGE(K16:K75,1)+LARGE(K16:K75,2)+LARGE(K16:K75,3)","v":263.5},{"$f":"SUM(L16:L75)","v":5},{"$f":"LARGE(M16:M75,1)+LARGE(M16:M75,2)+LARGE(M16:M75,3)","v":515},{"$f":"SUM(N16:N75)","v":5},{"$f":"LARGE(O16:O75,1)+LARGE(O16:O75,2)+LARGE(O16:O75,3)","v":564.7},{"$f":"SUM(P16:P75)","v":5},{"$f":"LARGE(Q16:Q75,1)+LARGE(Q16:Q75,2)+LARGE(Q16:Q75,3)","v":227.3},{"$f":"SUM(R16:R75)","v":4},{"$f":"LARGE(S16:S75,1)+LARGE(S16:S75,2)+LARGE(S16:S75,3)","v":0},{"$f":"SUM(T16:T75)","v":5},{"$f":"LARGE(U16:U75,1)+LARGE(U16:U75,2)+LARGE(U16:U75,3)","v":0},{"$f":"SUM(V16:V75)","v":3},{"$f":"LARGE(W16:W75,1)+LARGE(W16:W75,2)+LARGE(W16:W75,3)","v":0},{"$f":"SUM(X16:X75)","v":5},{"$f":"LARGE(Y16:Y75,1)+LARGE(Y16:Y75,2)+LARGE(Y16:Y75,3)","v":0},{"$f":"SUM(Z16:Z75)","v":5},{"$f":"LARGE(AA16:AA75,1)+LARGE(AA16:AA75,2)+LARGE(AA16:AA75,3)","v":0},{"$f":"SUM(AB16:AB75)","v":5},{"$f":"LARGE(AC16:AC75,1)+LARGE(AC16:AC75,2)+LARGE(AC16:AC75,3)","v":0},{"$f":"SUM(AD16:AD75)","v":5}]
[null,null,"per Email an: sk-huemmling@gmx.de"]

{"sheet":"4","index":4,"n_rows":77,"n_cols":39,"rows_kept":77,"merged":[[0,34,0,35],[1,34,1,35],[4,34,4,35],[5,34,5,35],[6,34,6,35],[14,32,14,35]]}
[null,"Verein / Gruppe",null,"Ergebnisse",{"$nulls":29},"Austragungsort:",{"$f":"Übersicht!G4","v":"Spahnharrenstätte"}]
[1,{"$f":"'Wettkampf 1'!B2","v":"Lorup"},null,{"$f":"G76","v":443.2},{"$f":"IF(H76>4,\"Es sind zu viele Schützen in Wertung!\",\" \")","v":"Es sind zu viele Schützen in Wertung!"},{"$nulls":28},"Wettkampftag:",{"$f":"Übersicht!G3","v":"02.12."}]
[2,{"$f":"'Wettkampf 1'!B3","v":"Sögel"},null,{"$f":"I76","v":{"v":0,"d":"0.0"}},{"$f":"IF(J76>4,\"Es sind zu viele Schützen in Wertung!\",\" \")","v":" "}]
[3,{"$f":"'Wettkampf 1'!B4","v":"Spahnharenstätte"},null,{"$f":"K76","v":344.4},{"$f":"IF(L76>4,\"Es sind zu viele Schützen in Wertung!\",\" \")","v":"Es sind zu viele Schützen in Wertung!"},{"$nulls":30},"Ansprechpartner für Rückfragen:"]
[4,{"$f":"'Wettkampf 1'!B5","v":"Esterwegen"},null,{"$f":"M76","v":492.8},{"$f":"IF(N76>4,\"Es sind zu viele Schützen in Wertung!\",\" \")","v":"Es sind zu viele Schützen in Wertung!"},{"$nulls":28},"Name:"]
[5,{"$f":"'Wettkampf 1'!B6","v":"Lähden"},null,{"$f":"O76","v":539.2},{"$f":"IF(P76>4,\"Es sind zu viele Schützen in Wertung!\",\" \")","v":"Es sind zu viele Schützen in Wertung!"},{"$nulls":28},"Tel:"]
[6,{"$f":"'Wettkampf 1'!B7","v":"Börgermoor"},null,{"$f":"Q76","v":134.2},{"$f":"IF(R76>4,\"Es sind zu viele Schützen in Wertung!\",\" \")","v":" "},{"$nulls":28},"Standaufsicht:","eintragen"]
[7,{"$f":"'Wettkampf 1'!B8","v":"Verein VII"},null,{"$f":"S76","v":{"v":0,"d":"0.0"}},{"$f":"IF(T76>4,\"Es sind zu viele Schützen in Wertung!\",\" \")","v":"Es sind zu viele Schützen in Wertung!"}]
[8,{"$f":"'Wettkampf 1'!B9","v":"Verein VIII"},null,{"$f":"U76","v":{"v":0,"d":"0.0"}},{"$f":"IF(V76>4,\"Es sind zu viele Schützen in Wertung!\",\" \")","v":" "}]
[9,{"$f":"'Wettkampf 1'!B10","v":"Verein IX"},null,{"$f":"W76","v":{"v":0,"d":"0.0"}},{"$f":"IF(X76>4,\"Es sind zu viele Schützen in Wertung!\",\" \")","v":"Es sind zu viele Schützen in Wertung!"}]
[10,{"$f":"'Wettkampf 1'!B11","v":"Verein X"},null,{"$f":"Y76","v":{"v":0,"d":"0.0"}},{"$f":"IF(Z76>4,\"Es sind zu viele Schützen in Wertung!\",\" \")","v":"Es sind zu viele Schützen in Wertung!"}]
[11,{"$f":"'Wettkampf 1'!B12","v":"Verein XI"},null,{"$f":"AA76","v":{"v":0,"d":"0.0"}},{"$f":"IF(AB76>4,\"Es sind zu viele Schützen in Wertung!\",\" \")","v":"Es sind zu viele Schützen in Wertung!"}]
[12,{"$f":"'Wettkampf 1'!B13","v":"Verein XII"},null,{"$f":"AC76","v":{"v":0,"d":"0.0"}},{"$f":"IF(AD76>4,\"Es sind zu viele Schützen in Wertung!\",\" \")","v":"Es sind zu viele Schützen in Wertung!"}]
[]
[null,"Einzelergebnisse:","Verein / Gruppe","Ergebnisse (mindestens 0 eintragen)","AW? Dann x eintippen",null,"Verein 1",null,"Verein 2",null,"Verein 3",null,"Verein 4",null,"Verein 5",null,"Verein 6",null,"Verein 7",null,"Verein 8",null,"Verein 9",null,"Verein 10",null,"Verein 11",null,"Verein 12",{"$nulls":3},"Proberechnung bei Streifen:"]
[1,{"$f":"'Wettkampf 1'!B16","v":"Wotte Lia"},{"$f":"'Wettkampf 1'!C16","v":"Lorup"},170.3,null,{"$f":"IF(E16=\"x\",\"0\",D16)","v":170.3},{"$f":"IF(C16=$B$2,F16,0)","v":170.3},{"$f":"(IF(AND($E16=\"\",$C16=$B$2),1,0))","v":1},{"$f":"IF($C16=$B$3,$F16,0)","v":0},{"$f":"(IF(AND($E16=\"\",$C16=$B$3),1,0))","v":0},{"$f":"IF($C16=$B$4,F16,0)","v":0},{"$f":"(IF(AND($E16=\"\",$C16=$B$4),1,0))","v":0},{"$f":"IF($C16=$B$5,F16,0)","v":0},{"$f":"(IF(AND($E16=\"\",$C16=$B$5),1,0))","v":0},{"$f":"IF($C16=$B$6,F16,0)","v":0},{"$f":"(IF(AND($E16=\"\",$C16=$B$6),1,0))","v":0},{"$f":"IF($C16=$B$7,F16,0)","v":0},{"$f":"(IF(AND($E16=\"\",$C16=$B$7),1,0))","v":0},{"$f":"IF($C16=$B$8,$F16,0)","v":0},{"$f":"(IF(AND($E16=\"\",$C16=$B$8),1,0))","v":0},{"$f":"IF($C16=$B$9,$F16,0)","v":0},{"$f":"(IF(AND($E16=\"\",$C16=$B$9),1,0))","v":0},{"$f":"IF($C16=$B$10,$F16,0)","v":0},{"$f":"(IF(AND($E16=\"\",$C16=$B$10),1,0))","v":0},{"$f":"IF($C16=$B$11,$F16,0)","v":0},{"$f":"(IF(AND($E16=\"\",$C16=$B$11),1,0))","v":0},{"$f":"IF($C16=$B$12,$F16,0)","v":0},{"$f":"(IF(AND($E16=\"\",$C16=$B$12),1,0))","v":0},{"$f":"IF($C16=$B$13,$F16,0)","v":0},{"$f":"(IF(AND($E16=\"\",$C16=$B$13),1,0))","v":0},{"$nulls":5},{"$f":"SUM(AG16:AI16)","v":{"v":0,"d":"0.0"}},{"$f":"IF(AJ16=D16,1,0)","v":0},{"$f":"IF(AJ16=0,0,1)","v":0},{"$f":"IF(AK16+AL16=2,\"Korrekt\",\"\")","v":""}]
[2,{"$f":"'Wettkampf 1'!B17","v":"Wotte Hannes"},{"$f":"'Wettkampf 1'!C17","v":"Lorup"},144.1,null,{"$f":"IF(E17=\"x\",\"0\",D17)","v":144.1},{"$f":"IF(C17=$B$2,F17,0)","v":144.1},{"$f":"(IF(AND($E17=\"\",$C17=$B$2),1,0))","v":1},{"$f":"IF($C17=$B$3,F17,0)","v":0},{"$f":"(IF(AND($E17=\"\",$C17=$B$3),1,0))","v":0},{"$f":"IF($C17=$B$4,F17,0)","v":0},{"$f":"(IF(AND($E17=\"\",$C17=$B$4),1,0))","v":0},{"$f":"IF($C17=$B$5,F17,0)","v":0},{"$f":"(IF(AND($E17=\"\",$C17=$B$5),1,0))","v":0},{"$f":"IF($C17=$B$6,F17,0)","v":0},{"$f":"(IF(AND($E17=\"\",$C17=$B$6),1,0))","v":0},{"$f":"IF($C17=$B$7,F17,0)","v":0},{"$f":"(IF(AND($E17=\"\",$C17=$B$7),1,0))","v":0},{"$f":"IF($C17=$B$8,$F17,0)","v":0},{"$f":"(IF(AND($E17=\"\",$C17=$B$8),1,0))","v":0},{"$f":"IF($C17=$B$9,$F17,0)","v":0},{"$f":"(IF(AND($E17=\"\",$C17=$B$9),1,0))","v":0},{"$f":"IF($C17=$B$10,$F17,0)","v":0},{"$f":"(IF(AND($E17=\"\",$C17=$B$10),1,0))","v":0},{"$f":"IF($C17=$B$11,$F17,0)","v":0},{"$f":"(IF(AND($E17=\"\",$C17=$B$11),1,0))","v":0},{"$f":"IF($C17=$B$12,$F17,0)","v":0},{"$f":"(IF(AND($E17=\"\",$C17=$B$12),1,0))","v":0},{"$f":"IF($C17=$B$13,$F17,0)","v":0},{"$f":"(IF(AND($E17=\"\",$C17=$B$13),1,0))","v":0},{"$nulls":5},{"$f":"SUM(AG17:AI17)","v":{"v":0,"d":"0.0"}},{"$f":"IF(AJ17=D17,1,0)","v":0},{"$f":"IF(AJ17=0,0,1)","v":0},{"$f":"IF(AK17+AL17=2,\"Korrekt\",\"\")","v":""}]
[3,{"$f":"'Wettkampf 1'!B18","v":"Gretenabeln Elias"},{"$f":"'Wettkampf 1'!C18","v":"Lorup"},128.8,null,128.8,128.8,1,0,0,0,0,0,0,0,0,0,0,0,0,0,0,0,0,0,0,0,0,0,0,{"$nulls":5},{"v":0,"d":"0.0"},0,0,""]
[4,{"$f":"'Wettkampf 1'!B19","v":"Helmer Maike"},{"$f":"'Wettkampf 1'!C19","v":"Lorup"},118.8,null,118.8,118.8,1,0,0,0,0,0,0,0,0,0,0,0,0,0,0,0,0,0,0,0,0,0,0,{"$nulls":5},{"v":0,"d":"0.0"},0,0,""]
[5,{"$f":"'Wettkampf 1'!B20","v":"Többen Jannes"},{"$f":"'Wettkampf 1'!C20","v":"Lorup"},105.4,"x","0","0",0,0,0,0,0,0,0,0,0,0,0,0,0,0,0,0,0,0,0,0,0,0,0,{"$nulls":5},{"v":0,"d":"0.0"},0,0,""]
[6,{"$f":"'Wettkampf 1'!B21","v":"Lüken Arne"},{"$f":"'Wettkampf 1'!C21","v":"Lorup"},null,null,{"v":0,"d":"0.0"},0,1,0,0,0,0,0,0,0,0,0,0,0,0,0,0,0,0,0,0,0,0,0,0,{"$nulls":5},{"v":0,"d":"0.0"},1,0,""]
[7,{"$f":"'Wettkampf 1'!B22","v":"Schütze 7"},{"$f":"'Wettkampf 1'!C22","v":"Sögel"},null,null,{"v":0,"d":"0.0"},0,0,0,1,0,0,0,0,0,0,0,0,0,0,0,0,0,0,0,0,0,0,0,0,{"$nulls":5},{"v":0,"d":"0.0"},1,0,""]
[8,{"$f":"'Wettkampf 1'!B23","v":"Schütze 8"},{"$f":"'Wettkampf 1'!C23","v":"Sögel"},null,null,{"v":0,"d":"0.0"},0,0,0,1,0,0,0,0,0,0,0,0,0,0,0,0,0,0,0,0,0,0,0,0,{"$nulls":5},{"v":0,"d":"0.0"},1,0,""]
[9,{"$f":"'Wettkampf 1'!B24","v":"Schütze 9"},{"$f":"'Wettkampf 1'!C24","v":"Sögel"},null,null,{"v":0,"d":"0.0"},0,0,0,1,0,0,0,0,0,0,0,0,0,0,0,0,0,0,0,0,0,0,0,0,{"$nulls":5},{"v":0,"d":"0.0"},1,0,""]
[10,{"$f":"'Wettkampf 1'!B25","v":"Schütze 10"},{"$f":"'Wettkampf 1'!C25","v":"Sögel"},null,null,{"v":0,"d":"0.0"},0,0,0,1,0,0,0,0,0,0,0,0,0,0,0,0,0,0,0,0,0,0,0,0,{"$nulls":5},{"v":0,"d":"0.0"},1,0,""]
[11,{"$f":"'Wettkampf 1'!B26","v":"Engbers Hannes"},{"$f":"'Wettkampf 1'!C26","v":"Spahnharenstätte"},78.5,null,78.5,0,0,0,0,78.5,1,0,0,0,0,0,0,0,0,0,0,0,0,0,0,0,0,0,0,{"$nulls":5},{"v":0,"d":"0.0"},0,0,""]
[12,{"$f":"'Wettkampf 1'!B27","v":"Runde Marcel"},{"$f":"'Wettkampf 1'!C27","v":"Spahnharenstätte"},140.6,null,140.6,0,0,0,0,140.6,1,0,0,0,0,0,0,0,0,0,0,0,0,0,0,0,0,0,0,{"$nulls":5},{"v":0,"d":"0.0"},0,0,""]
[13,{"$f":"'Wettkampf 1'!B28","v":"Jansen Lars"},{"$f":"'Wettkampf 1'!C28","v":"Spahnharenstätte"},125.3,null,125.3,0,0,0,0,125.3,1,0,0,0,0,0,0,0,0,0,0,0,0,0,0,0,0,0,0,{"$nulls":5},{"v":0,"d":"0.0"},0,0,""]
[14,{"$f":"'Wettkampf 1'!B29","v":"Schütze 14"},{"$f":"'Wettkampf 1'!C29","v":"Spahnharenstätte"},null,null,{"v":0,"d":"0.0"},0,0,0,0,0,1,0,0,0,0,0,0,0,0,0,0,0,0,0,0,0,0,0,0,{"$nulls":5},{"v":0,"d":"0.0"},1,0,""]
[15,{"$f":"'Wettkampf 1'!B30","v":"Schütze 15"},{"$f":"'Wettkampf 1'!C30","v":"Spahnharenstätte"},null,null,{"v":0,"d":"0.0"},0,0,0,0,0,1,0,0,0,0,0,0,0,0,0,0,0,0,0,0,0,0,0,0,{"$nulls":5},{"v":0,"d":"0.0"},1,0,""]
[16,{"$f":"'Wettkampf 1'!B31","v":"Suhle Annalena"},{"$f":"'Wettkampf 1'!C31","v":"Esterwegen"},179.3,null,179.3,0,0,0,0,0,0,179.3,1,0,0,0,0,0,0,0,0,0,0,0,0,0,0,0,0,{"$nulls":5},{"v":0,"d":"0.0"},0,0,""]
[17,{"$f":"'Wettkampf 1'!B32","v":"Gäken Lena"},{"$f":"'Wettkampf 1'!C32","v":"Esterwegen"},179.5,null,179.5,0,0,0,0,0,0,179.5,1,0,0,0,0,0,0,0,0,0,0,0,0,0,0,0,0,{"$nulls":5},{"v":0,"d":"0.0"},0,0,""]
[18,{"$f":"'Wettkampf 1'!B33","v":"Jansen Daniel"},{"$f":"'Wettkampf 1'!C33","v":"Esterwegen"},{"v":134,"d":"134.0"},null,{"v":134,"d":"134.0"},0,0,0,0,0,0,134,1,0,0,0,0,0,0,0,0,0,0,0,0,0,0,0,0,{"$nulls":5},{"v":0,"d":"0.0"},0,0,""]
[19,{"$f":"'Wettkampf 1'!B34","v":"Pieper Jonas"},{"$f":"'Wettkampf 1'!C34","v":"Esterwegen"},null,null,{"v":0,"d":"0.0"},0,0,0,0,0,0,0,1,0,0,0,0,0,0,0,0,0,0,0,0,0,0,0,0,{"$nulls":5},{"v":0,"d":"0.0"},1,0,""]
[20,{"$f":"'Wettkampf 1'!B35","v":"Schütze 20"},{"$f":"'Wettkampf 1'!C35","v":"Esterwegen"},null,null,{"v":0,"d":"0.0"},0,0,0,0,0,0,0,1,0,0,0,0,0,0,0,0,0,0,0,0,0,0,0,0,{"$nulls":5},{"v":0,"d":"0.0"},1,0,""]
[21,{"$f":"'Wettkampf 1'!B36","v":"Hellweg Thea"},{"$f":"'Wettkampf 1'!C36","v":"Lähden"},182.2,null,182.2,0,0,0,0,0,0,0,0,182.2,1,0,0,0,0,0,0,0,0,0,0,0,0,0,0,{"$nulls":5},{"v":0,"d":"0.0"},0,0,""]
[22,{"$f":"'Wettkampf 1'!B37","v":"Bruns Henrik"},{"$f":"'Wettkampf 1'!C37","v":"Lähden"},172.1,null,172.1,0,0,0,0,0,0,0,0,172.1,1,0,0,0,0,0,0,0,0,0,0,0,0,0,0,{"$nulls":5},{"v":0,"d":"0.0"},0,0,""]
[23,{"$f":"'Wettkampf 1'!B38","v":"Buschen Johann "},{"$f":"'Wettkampf 1'!C38","v":"Lähden"},184.9,null,184.9,0,0,0,0,0,0,0,0,184.9,1,0,0,0,0,0,0,0,0,0,0,0,0,0,0,{"$nulls":5},{"v":0,"d":"0.0"},0,0,""]
[24,{"$f":"'Wettkampf 1'!B39","v":"Preut Jannis"},{"$f":"'Wettkampf 1'!C39","v":"Lähden"},164.2,null,164.2,0,0,0,0,0,0,0,0,164.2,1,0,0,0,0,0,0,0,0,0,0,0,0,0,0,{"$nulls":5},{"v":0,"d":"0.0"},0,0,""]
[25,{"$f":"'Wettkampf 1'!B40","v":"Fleschenberg Jana"},{"$f":"'Wettkampf 1'!C40","v":"Lähden"},null,null,{"v":0,"d":"0.0"},0,0,0,0,0,0,0,0,0,1,0,0,0,0,0,0,0,0,0,0,0,0,0,0,{"$nulls":5},{"v":0,"d":"0.0"},1,0,""]
[26,{"$f":"'Wettkampf 1'!B41","v":"von Seggern Moritz"},{"$f":"'Wettkampf 1'!C41","v":"Lähden"},142.7,null,142.7,0,0,0,0,0,0,0,0,142.7,1,0,0,0,0,0,0,0,0,0,0,0,0,0,0,{"$nulls":5},{"v":0,"d":"0.0"},0,0,""]
[27,{"$f":"'Wettkampf 1'!B42","v":"Kohnen Saskia"},{"$f":"'Wettkampf 1'!C42","v":"Börgermoor"},134.2,null,134.2,0,0,0,0,0,0,0,0,0,0,134.2,1,0,0,0,0,0,0,0,0,0,0,0,0,{"$nulls":5},{"v":0,"d":"0.0"},0,0,""]
[28,{"$f":"'Wettkampf 1'!B43","v":"Niemann Paul"},{"$f":"'Wettkampf 1'!C43","v":"Börgermoor"},null,null,{"v":0,"d":"0.0"},0,0,0,0,0,0,0,0,0,0,0,1,0,0,0,0,0,0,0,0,0,0,0,0,{"$nulls":5},{"v":0,"d":"0.0"},1,0,""]
[29,{"$f":"'Wettkampf 1'!B44","v":"Schütze 29"},{"$f":"'Wettkampf 1'!C44","v":"Börgermoor"},null,null,{"v":0,"d":"0.0"},0,0,0,0,0,0,0,0,0,0,0,1,0,0,0,0,0,0,0,0,0,0,0,0,{"$nulls":5},{"v":0,"d":"0.0"},1,0,""]
[30,{"$f":"'Wettkampf 1'!B45","v":"Schütze 30"},{"$f":"'Wettkampf 1'!C45","v":"Börgermoor"},null,null,{"v":0,"d":"0.0"},0,0,0,0,0,0,0,0,0,0,0,1,0,0,0,0,0,0,0,0,0,0,0,0,{"$nulls":5},{"v":0,"d":"0.0"},1,0,""]
[31,{"$f":"'Wettkampf 1'!B46","v":"Stümpler Jan Luka "},{"$f":"'Wettkampf 1'!C46","v":"Lähden"},null,null,{"v":0,"d":"0.0"},0,0,0,0,0,0,0,0,0,1,0,0,0,0,0,0,0,0,0,0,0,0,0,0,{"$nulls":5},{"v":0,"d":"0.0"},1,0,""]
[32,{"$f":"'Wettkampf 1'!B47","v":"Helmer, Nils"},{"$f":"'Wettkampf 1'!C47","v":"Lorup"},null,null,{"v":0,"d":"0.0"},0,1,0,0,0,0,0,0,0,0,0,0,0,0,0,0,0,0,0,0,0,0,0,0,{"$nulls":5},{"v":0,"d":"0.0"},1,0,""]
[33,{"$f":"'Wettkampf 1'!B48","v":"Schütze 33"},{"$f":"'Wettkampf 1'!C48","v":"Verein VII"},null,null,{"v":0,"d":"0.0"},0,0,0,0,0,0,0,0,0,0,0,0,0,1,0,0,0,0,0,0,0,0,0,0,{"$nulls":5},{"v":0,"d":"0.0"},1,0,""]
[34,{"$f":"'Wettkampf 1'!B49","v":"Schütze 34"},{"$f":"'Wettkampf 1'!C49","v":"Verein VII"},null,null,{"v":0,"d":"0.0"},0,0,0,0,0,0,0,0,0,0,0,0,0,1,0,0,0,0,0,0,0,0,0,0,{"$nulls":5},{"v":0,"d":"0.0"},1,0,""]
[35,{"$f":"'Wettkampf 1'!B50","v":"Schütze 35"},{"$f":"'Wettkampf 1'!C50","v":"Verein VII"},null,null,{"v":0,"d":"0.0"},0,0,0,0,0,0,0,0,0,0,0,0,0,1,0,0,0,0,0,0,0,0,0,0,{"$nulls":5},{"v":0,"d":"0.0"},1,0,""]
[36,{"$f":"'Wettkampf 1'!B51","v":"Schütze 36"},{"$f":"'Wettkampf 1'!C51","v":"Verein VII"},null,null,{"v":0,"d":"0.0"},0,0,0,0,0,0,0,0,0,0,0,0,0,1,0,0,0,0,0,0,0,0,0,0,{"$nulls":5},{"v":0,"d":"0.0"},1,0,""]
[37,{"$f":"'Wettkampf 1'!B52","v":"Schütze 37"},{"$f":"'Wettkampf 1'!C52","v":"Verein VII"},null,null,{"v":0,"d":"0.0"},0,0,0,0,0,0,0,0,0,0,0,0,0,1,0,0,0,0,0,0,0,0,0,0,{"$nulls":5},{"v":0,"d":"0.0"}]
[38,{"$f":"'Wettkampf 1'!B53","v":"Schütze 38"},{"$f":"'Wettkampf 1'!C53","v":"Verein VIII"},null,null,{"v":0,"d":"0.0"},0,0,0,0,0,0,0,0,0,0,0,0,0,0,0,1,0,0,0,0,0,0,0,0,{"$nulls":5},{"v":0,"d":"0.0"}]
[39,{"$f":"'Wettkampf 1'!B54","v":"Schütze 39"},{"$f":"'Wettkampf 1'!C54","v":"Verein VIII"},null,null,{"v":0,"d":"0.0"},0,0,0,0,0,0,0,0,0,0,0,0,{"$f":"IF($C54=$B$8,$F54,0)","v":0},{"$f":"(IF(AND($E54=\"\",$C54=$B$8),1,0))","v":0},{"$f":"IF($C54=$B$9,$F54,0)","v":0},{"$f":"(IF(AND($E54=\"\",$C54=$B$9),1,0))","v":1},{"$f":"IF($C54=$B$10,$F54,0)","v":0},{"$f":"(IF(AND($E54=\"\",$C54=$B$10),1,0))","v":0},{"$f":"IF($C54=$B$11,$F54,0)","v":0},{"$f":"(IF(AND($E54=\"\",$C54=$B$11),1,0))","v":0},{"$f":"IF($C54=$B$12,$F54,0)","v":0},{"$f":"(IF(AND($E54=\"\",$C54=$B$12),1,0))","v":0},{"$f":"IF($C54=$B$13,$F54,0)","v":0},{"$f":"(IF(AND($E54=\"\",$C54=$B$13),1,0))","v":0},{"$nulls":5},{"v":0,"d":"0.0"}]
[40,{"$f":"'Wettkampf 1'!B55","v":"Schütze 40"},{"$f":"'Wettkampf 1'!C55","v":"Verein VIII"},null,null,{"v":0,"d":"0.0"},0,0,0,0,0,0,0,0,0,0,0,0,0,0,0,1,0,0,0,0,0,0,0,0,{"$nulls":5},{"v":0,"d":"0.0"}]
[41,{"$f":"'Wettkampf 1'!B56","v":"Schütze 41"},{"$f":"'Wettkampf 1'!C56","v":"Verein IX"},null,null,{"v":0,"d":"0.0"},0,0,0,0,0,0,0,0,0,0,0,0,0,0,0,0,0,1,0,0,0,0,0,0,{"$nulls":5},{"v":0,"d":"0.0"}]
[42,{"$f":"'Wettkampf 1'!B57","v":"Schütze 42"},{"$f":"'Wettkampf 1'!C57","v":"Verein IX"},null,null,{"v":0,"d":"0.0"},0,0,0,0,0,0,0,0,0,0,0,0,0,0,0,0,0,1,0,0,0,0,0,0,{"$nulls":5},{"v":0,"d":"0.0"}]
[43,{"$f":"'Wettkampf 1'!B58","v":"Schütze 43"},{"$f":"'Wettkampf 1'!C58","v":"Verein IX"},null,null,{"v":0,"d":"0.0"},0,0,0,0,0,0,0,0,0,0,0,0,0,0,0,0,0,1,0,0,0,0,0,0,{"$nulls":5},{"v":0,"d":"0.0"}]
[44,{"$f":"'Wettkampf 1'!B59","v":"Schütze 44"},{"$f":"'Wettkampf 1'!C59","v":"Verein IX"},null,null,{"v":0,"d":"0.0"},0,0,0,0,0,0,0,0,0,0,0,0,0,0,0,0,0,1,0,0,0,0,0,0,{"$nulls":5},{"v":0,"d":"0.0"}]
[45,{"$f":"'Wettkampf 1'!B60","v":"Schütze 45"},{"$f":"'Wettkampf 1'!C60","v":"Verein IX"},null,null,{"v":0,"d":"0.0"},0,0,0,0,0,0,0,0,0,0,0,0,0,0,0,0,0,1,0,0,0,0,0,0,{"$nulls":5},{"v":0,"d":"0.0"}]
[46,{"$f":"'Wettkampf 1'!B61","v":"Schütze 46"},{"$f":"'Wettkampf 1'!C61","v":"Verein X"},null,null,{"v":0,"d":"0.0"},0,0,0,0,0,0,0,0,0,0,0,0,0,0,0,0,0,0,0,1,0,0,0,0,{"$nulls":5},{"v":0,"d":"0.0"}]
[47,{"$f":"'Wettkampf 1'!B62","v":"Schütze 47"},{"$f":"'Wettkampf 1'!C62","v":"Verein X"},null,null,{"v":0,"d":"0.0"},0,0,0,0,0,0,0,0,0,0,0,0,0,0,0,0,0,0,0,1,0,0,0,0,{"$nulls":5},{"v":0,"d":"0.0"}]
[48,{"$f":"'Wettkampf 1'!B63","v":"Schütze 48"},{"$f":"'Wettkampf 1'!C63","v":"Verein X"},null,null,{"v":0,"d":"0.0"},0,0,0,0,0,0,0,0,0,0,0,0,0,0,0,0,0,0,0,1,0,0,0,0,{"$nulls":5},{"v":0,"d":"0.0"}]
[49,{"$f":"'Wettkampf 1'!B64","v":"Schütze 49"},{"$f":"'Wettkampf 1'!C64","v":"Verein X"},null,null,{"v":0,"d":"0.0"},0,0,0,0,0,0,0,0,0,0,0,0,0,0,0,0,0,0,0,1,0,0,0,0,{"$nulls":5},{"v":0,"d":"0.0"}]
[50,{"$f":"'Wettkampf 1'!B65","v":"Schütze 50"},{"$f":"'Wettkampf 1'!C65","v":"Verein X"},null,null,{"v":0,"d":"0.0"},0,0,0,0,0,0,0,0,0,0,0,0,0,0,0,0,0,0,0,1,0,0,0,0,{"$nulls":5},{"v":0,"d":"0.0"}]
[51,{"$f":"'Wettkampf 1'!B66","v":"Schütze 51"},{"$f":"'Wettkampf 1'!C66","v":"Verein XI"},null,null,{"v":0,"d":"0.0"},0,0,0,0,0,0,0,0,0,0,0,0,0,0,0,0,0,0,0,0,0,1,0,0,{"$nulls":5},{"v":0,"d":"0.0"}]
[52,{"$f":"'Wettkampf 1'!B67","v":"Schütze 52"},{"$f":"'Wettkampf 1'!C67","v":"Verein XI"},null,null,{"v":0,"d":"0.0"},0,0,0,0,0,0,0,0,0,0,0,0,0,0,0,0,0,0,0,0,0,1,0,0,{"$nulls":5},{"v":0,"d":"0.0"}]
[53,{"$f":"'Wettkampf 1'!B68","v":"Schütze 53"},{"$f":"'Wettkampf 1'!C68","v":"Verein XI"},null,null,{"v":0,"d":"0.0"},0,0,0,0,0,0,0,0,0,0,0,0,0,0,0,0,0,0,0,0,0,1,0,0,{"$nulls":5},{"v":0,"d":"0.0"}]
[54,{"$f":"'Wettkampf 1'!B69","v":"Schütze 54"},{"$f":"'Wettkampf 1'!C69","v":"Verein XI"},null,null,{"v":0,"d":"0.0"},0,0,0,0,0,0,0,0,0,0,0,0,0,0,0,0,0,0,0,0,0,1,0,0,{"$nulls":5},{"v":0,"d":"0.0"}]
[55,{"$f":"'Wettkampf 1'!B70","v":"Schütze 55"},{"$f":"'Wettkampf 1'!C70","v":"Verein XI"},null,null,{"v":0,"d":"0.0"},0,0,0,0,0,0,0,0,0,0,0,0,0,0,0,0,0,0,0,0,0,1,0,0,{"$nulls":5},{"v":0,"d":"0.0"}]
[56,{"$f":"'Wettkampf 1'!B71","v":"Schütze 56"},{"$f":"'Wettkampf 1'!C71","v":"Verein XII"},null,null,{"v":0,"d":"0.0"},0,0,0,0,0,0,0,0,0,0,0,0,0,0,0,0,0,0,0,0,0,0,0,1,{"$nulls":5},{"v":0,"d":"0.0"}]
[57,{"$f":"'Wettkampf 1'!B72","v":"Schütze 57"},{"$f":"'Wettkampf 1'!C72","v":"Verein XII"},null,null,{"v":0,"d":"0.0"},0,0,0,0,0,0,0,0,0,0,0,0,0,0,0,0,0,0,0,0,0,0,0,1,{"$nulls":5},{"v":0,"d":"0.0"}]
[58,{"$f":"'Wettkampf 1'!B73","v":"Schütze 58"},{"$f":"'Wettkampf 1'!C73","v":"Verein XII"},null,null,{"v":0,"d":"0.0"},0,0,0,0,0,0,0,0,0,0,0,0,0,0,0,0,0,0,0,0,0,0,0,1,{"$nulls":5},{"v":0,"d":"0.0"}]
[59,{"$f":"'Wettkampf 1'!B74","v":"Schütze 59"},{"$f":"'Wettkampf 1'!C74","v":"Verein XII"},null,null,{"v":0,"d":"0.0"},0,0,0,0,0,0,0,0,0,0,0,0,0,0,0,0,0,0,0,0,0,0,0,1,{"$nulls":5},{"v":0,"d":"0.0"}]
[60,{"$f":"'Wettkampf 1'!B75","v":"Schütze 60"},{"$f":"'Wettkampf 1'!C75","v":"Verein XII"},null,null,{"v":0,"d":"0.0"},0,0,0,0,0,0,0,0,0,0,0,0,0,0,0,0,0,0,0,0,0,0,0,1,{"$nulls":5},{"v":0,"d":"0.0"}]
[{"$nulls":6},{"$f":"LARGE(G16:G75,1)+LARGE(G16:G75,2)+LARGE(G16:G75,3)","v":443.2},{"$f":"SUM(H16:H75)","v":6},{"$f":"LARGE(I16:I75,1)+LARGE(I16:I75,2)+LARGE(I16:I75,3)","v":0},{"$f":"SUM(J16:J75)","v":4},{"$f":"LARGE(K16:K75,1)+LARGE(K16:K75,2)+LARGE(K16:K75,3)","v":344.4},{"$f":"SUM(L16:L75)","v":5},{"$f":"LARGE(M16:M75,1)+LARGE(M16:M75,2)+LARGE(M16:M75,3)","v":492.8},{"$f":"SUM(N16:N75)","v":5},{"$f":"LARGE(O16:O75,1)+LARGE(O16:O75,2)+LARGE(O16:O75,3)","v":539.2},{"$f":"SUM(P16:P75)","v":7},{"$f":"LARGE(Q16:Q75,1)+LARGE(Q16:Q75,2)+LARGE(Q16:Q75,3)","v":134.2},{"$f":"SUM(R16:R75)","v":4},{"$f":"LARGE(S16:S75,1)+LARGE(S16:S75,2)+LARGE(S16:S75,3)","v":0},{"$f":"SUM(T16:T75)","v":5},{"$f":"LARGE(U16:U75,1)+LARGE(U16:U75,2)+LARGE(U16:U75,3)","v":0},{"$f":"SUM(V16:V75)","v":3},{"$f":"LARGE(W16:W75,1)+LARGE(W16:W75,2)+LARGE(W16:W75,3)","v":0},{"$f":"SUM(X16:X75)","v":5},{"$f":"LARGE(Y16:Y75,1)+LARGE(Y16:Y75,2)+LARGE(Y16:Y75,3)","v":0},{"$f":"SUM(Z16:Z75)","v":5},{"$f":"LARGE(AA16:AA75,1)+LARGE(AA16:AA75,2)+LARGE(AA16:AA75,3)","v":0},{"$f":"SUM(AB16:AB75)","v":5},{"$f":"LARGE(AC16:AC75,1)+LARGE(AC16:AC75,2)+LARGE(AC16:AC75,3)","v":0},{"$f":"SUM(AD16:AD75)","v":5}]
[null,null,"per Email an: sk-huemmling@gmx.de"]

{"sheet":"5","index":5,"n_rows":77,"n_cols":39,"rows_kept":77,"merged":[[0,34,0,35],[1,34,1,35],[4,34,4,35],[5,34,5,35],[6,34,6,35],[14,32,14,35]]}
[null,"Verein / Gruppe",null,"Ergebnisse",{"$nulls":29},"Austragungsort:",{"$f":"Übersicht!H4","v":0}]
[1,{"$f":"'Wettkampf 1'!B2","v":"Lorup"},null,{"$f":"G76","v":{"v":0,"d":"0.0"}},{"$f":"IF(H76>4,\"Es sind zu viele Schützen in Wertung!\",\" \")","v":"Es sind zu viele Schützen in Wertung!"},{"$nulls":28},"Wettkampftag:",{"$f":"Übersicht!H3","v":0}]
[2,{"$f":"'Wettkampf 1'!B3","v":"Sögel"},null,{"$f":"I76","v":{"v":0,"d":"0.0"}},{"$f":"IF(J76>4,\"Es sind zu viele Schützen in Wertung!\",\" \")","v":" "}]
[3,{"$f":"'Wettkampf 1'!B4","v":"Spahnharenstätte"},null,{"$f":"K76","v":{"v":0,"d":"0.0"}},{"$f":"IF(L76>4,\"Es sind zu viele Schützen in Wertung!\",\" \")","v":"Es sind zu viele Schützen in Wertung!"},{"$nulls":30},"Ansprechpartner für Rückfragen:"]
[4,{"$f":"'Wettkampf 1'!B5","v":"Esterwegen"},null,{"$f":"M76","v":{"v":0,"d":"0.0"}},{"$f":"IF(N76>4,\"Es sind zu viele Schützen in Wertung!\",\" \")","v":"Es sind zu viele Schützen in Wertung!"},{"$nulls":28},"Name:"]
[5,{"$f":"'Wettkampf 1'!B6","v":"Lähden"},null,{"$f":"O76","v":{"v":0,"d":"0.0"}},{"$f":"IF(P76>4,\"Es sind zu viele Schützen in Wertung!\",\" \")","v":"Es sind zu viele Schützen in Wertung!"},{"$nulls":28},"Tel:"]
[6,{"$f":"'Wettkampf 1'!B7","v":"Börgermoor"},null,{"$f":"Q76","v":{"v":0,"d":"0.0"}},{"$f":"IF(R76>4,\"Es sind zu viele Schützen in Wertung!\",\" \")","v":" "},{"$nulls":28},"Standaufsicht:","eintragen"]
[7,{"$f":"'Wettkampf 1'!B8","v":"Verein VII"},null,{"$f":"S76","v":{"v":0,"d":"0.0"}},{"$f":"IF(T76>4,\"Es sind zu viele Schützen in Wertung!\",\" \")","v":"Es sind zu viele Schützen in Wertung!"}]
[8,{"$f":"'Wettkampf 1'!B9","v":"Verein VIII"},null,{"$f":"U76","v":{"v":0,"d":"0.0"}},{"$f":"IF(V76>4,\"Es sind zu viele Schützen in Wertung!\",\" \")","v":" "}]
[9,{"$f":"'Wettkampf 1'!B10","v":"Verein IX"},null,{"$f":"W76","v":{"v":0,"d":"0.0"}},{"$f":"IF(X76>4,\"Es sind zu viele Schützen in Wertung!\",\" \")","v":"Es sind zu viele Schützen in Wertung!"}]
[10,{"$f":"'Wettkampf 1'!B11","v":"Verein X"},null,{"$f":"Y76","v":{"v":0,"d":"0.0"}},{"$f":"IF(Z76>4,\"Es sind zu viele Schützen in Wertung!\",\" \")","v":"Es sind zu viele Schützen in Wertung!"}]
[11,{"$f":"'Wettkampf 1'!B12","v":"Verein XI"},null,{"$f":"AA76","v":{"v":0,"d":"0.0"}},{"$f":"IF(AB76>4,\"Es sind zu viele Schützen in Wertung!\",\" \")","v":"Es sind zu viele Schützen in Wertung!"}]
[12,{"$f":"'Wettkampf 1'!B13","v":"Verein XII"},null,{"$f":"AC76","v":{"v":0,"d":"0.0"}},{"$f":"IF(AD76>4,\"Es sind zu viele Schützen in Wertung!\",\" \")","v":"Es sind zu viele Schützen in Wertung!"}]
[]
[null,"Einzelergebnisse:","Verein / Gruppe","Ergebnisse (mindestens 0 eintragen)","AW? Dann x eintippen",null,"Verein 1",null,"Verein 2",null,"Verein 3",null,"Verein 4",null,"Verein 5",null,"Verein 6",null,"Verein 7",null,"Verein 8",null,"Verein 9",null,"Verein 10",null,"Verein 11",null,"Verein 12",{"$nulls":3},"Proberechnung bei Streifen:"]
[1,{"$f":"'Wettkampf 1'!B16","v":"Wotte Lia"},{"$f":"'Wettkampf 1'!C16","v":"Lorup"},null,null,{"$f":"IF(E16=\"x\",\"0\",D16)","v":{"v":0,"d":"0.0"}},{"$f":"IF(C16=$B$2,F16,0)","v":0},{"$f":"(IF(AND($E16=\"\",$C16=$B$2),1,0))","v":1},{"$f":"IF($C16=$B$3,$F16,0)","v":0},{"$f":"(IF(AND($E16=\"\",$C16=$B$3),1,0))","v":0},{"$f":"IF($C16=$B$4,F16,0)","v":0},{"$f":"(IF(AND($E16=\"\",$C16=$B$4),1,0))","v":0},{"$f":"IF($C16=$B$5,F16,0)","v":0},{"$f":"(IF(AND($E16=\"\",$C16=$B$5),1,0))","v":0},{"$f":"IF($C16=$B$6,F16,0)","v":0},{"$f":"(IF(AND($E16=\"\",$C16=$B$6),1,0))","v":0},{"$f":"IF($C16=$B$7,F16,0)","v":0},{"$f":"(IF(AND($E16=\"\",$C16=$B$7),1,0))","v":0},{"$f":"IF($C16=$B$8,$F16,0)","v":0},{"$f":"(IF(AND($E16=\"\",$C16=$B$8),1,0))","v":0},{"$f":"IF($C16=$B$9,$F16,0)","v":0},{"$f":"(IF(AND($E16=\"\",$C16=$B$9),1,0))","v":0},{"$f":"IF($C16=$B$10,$F16,0)","v":0},{"$f":"(IF(AND($E16=\"\",$C16=$B$10),1,0))","v":0},{"$f":"IF($C16=$B$11,$F16,0)","v":0},{"$f":"(IF(AND($E16=\"\",$C16=$B$11),1,0))","v":0},{"$f":"IF($C16=$B$12,$F16,0)","v":0},{"$f":"(IF(AND($E16=\"\",$C16=$B$12),1,0))","v":0},{"$f":"IF($C16=$B$13,$F16,0)","v":0},{"$f":"(IF(AND($E16=\"\",$C16=$B$13),1,0))","v":0},{"$nulls":5},{"$f":"SUM(AG16:AI16)","v":{"v":0,"d":"0.0"}},{"$f":"IF(AJ16=D16,1,0)","v":1},{"$f":"IF(AJ16=0,0,1)","v":0},{"$f":"IF(AK16+AL16=2,\"Korrekt\",\"\")","v":""}]
[2,{"$f":"'Wettkampf 1'!B17","v":"Wotte Hannes"},{"$f":"'Wettkampf 1'!C17","v":"Lorup"},null,null,{"$f":"IF(E17=\"x\",\"0\",D17)","v":{"v":0,"d":"0.0"}},{"$f":"IF(C17=$B$2,F17,0)","v":0},{"$f":"(IF(AND($E17=\"\",$C17=$B$2),1,0))","v":1},{"$f":"IF($C17=$B$3,F17,0)","v":0},{"$f":"(IF(AND($E17=\"\",$C17=$B$3),1,0))","v":0},{"$f":"IF($C17=$B$4,F17,0)","v":0},{"$f":"(IF(AND($E17=\"\",$C17=$B$4),1,0))","v":0},{"$f":"IF($C17=$B$5,F17,0)","v":0},{"$f":"(IF(AND($E17=\"\",$C17=$B$5),1,0))","v":0},{"$f":"IF($C17=$B$6,F17,0)","v":0},{"$f":"(IF(AND($E17=\"\",$C17=$B$6),1,0))","v":0},{"$f":"IF($C17=$B$7,F17,0)","v":0},{"$f":"(IF(AND($E17=\"\",$C17=$B$7),1,0))","v":0},{"$f":"IF($C17=$B$8,$F17,0)","v":0},{"$f":"(IF(AND($E17=\"\",$C17=$B$8),1,0))","v":0},{"$f":"IF($C17=$B$9,$F17,0)","v":0},{"$f":"(IF(AND($E17=\"\",$C17=$B$9),1,0))","v":0},{"$f":"IF($C17=$B$10,$F17,0)","v":0},{"$f":"(IF(AND($E17=\"\",$C17=$B$10),1,0))","v":0},{"$f":"IF($C17=$B$11,$F17,0)","v":0},{"$f":"(IF(AND($E17=\"\",$C17=$B$11),1,0))","v":0},{"$f":"IF($C17=$B$12,$F17,0)","v":0},{"$f":"(IF(AND($E17=\"\",$C17=$B$12),1,0))","v":0},{"$f":"IF($C17=$B$13,$F17,0)","v":0},{"$f":"(IF(AND($E17=\"\",$C17=$B$13),1,0))","v":0},{"$nulls":5},{"$f":"SUM(AG17:AI17)","v":{"v":0,"d":"0.0"}},{"$f":"IF(AJ17=D17,1,0)","v":1},{"$f":"IF(AJ17=0,0,1)","v":0},{"$f":"IF(AK17+AL17=2,\"Korrekt\",\"\")","v":""}]
[3,{"$f":"'Wettkampf 1'!B18","v":"Gretenabeln Elias"},{"$f":"'Wettkampf 1'!C18","v":"Lorup"},null,null,{"v":0,"d":"0.0"},0,1,0,0,0,0,0,0,0,0,0,0,0,0,0,0,0,0,0,0,0,0,0,0,{"$nulls":5},{"v":0,"d":"0.0"},1,0,""]
[4,{"$f":"'Wettkampf 1'!B19","v":"Helmer Maike"},{"$f":"'Wettkampf 1'!C19","v":"Lorup"},null,null,{"v":0,"d":"0.0"},0,1,0,0,0,0,0,0,0,0,0,0,0,0,0,0,0,0,0,0,0,0,0,0,{"$nulls":5},{"v":0,"d":"0.0"},1,0,""]
[5,{"$f":"'Wettkampf 1'!B20","v":"Többen Jannes"},{"$f":"'Wettkampf 1'!C20","v":"Lorup"},null,null,{"v":0,"d":"0.0"},0,1,0,0,0,0,0,0,0,0,0,0,0,0,0,0,0,0,0,0,0,0,0,0,{"$nulls":5},{"v":0,"d":"0.0"},1,0,""]
[6,{"$f":"'Wettkampf 1'!B21","v":"Lüken Arne"},{"$f":"'Wettkampf 1'!C21","v":"Lorup"},null,null,{"v":0,"d":"0.0"},0,1,0,0,0,0,0,0,0,0,0,0,0,0,0,0,0,0,0,0,0,0,0,0,{"$nulls":5},{"v":0,"d":"0.0"},1,0,""]
[7,{"$f":"'Wettkampf 1'!B22","v":"Schütze 7"},{"$f":"'Wettkampf 1'!C22","v":"Sögel"},null,null,{"v":0,"d":"0.0"},0,0,0,1,0,0,0,0,0,0,0,0,0,0,0,0,0,0,0,0,0,0,0,0,{"$nulls":5},{"v":0,"d":"0.0"},1,0,""]
[8,{"$f":"'Wettkampf 1'!B23","v":"Schütze 8"},{"$f":"'Wettkampf 1'!C23","v":"Sögel"},null,null,{"v":0,"d":"0.0"},0,0,0,1,0,0,0,0,0,0,0,0,0,0,0,0,0,0,0,0,0,0,0,0,{"$nulls":5},{"v":0,"d":"0.0"},1,0,""]
[9,{"$f":"'Wettkampf 1'!B24","v":"Schütze 9"},{"$f":"'Wettkampf 1'!C24","v":"Sögel"},null,null,{"v":0,"d":"0.0"},0,0,0,1,0,0,0,0,0,0,0,0,0,0,0,0,0,0,0,0,0,0,0,0,{"$nulls":5},{"v":0,"d":"0.0"},1,0,""]
[10,{"$f":"'Wettkampf 1'!B25","v":"Schütze 10"},{"$f":"'Wettkampf 1'!C25","v":"Sögel"},null,null,{"v":0,"d":"0.0"},0,0,0,1,0,0,0,0,0,0,0,0,0,0,0,0,0,0,0,0,0,0,0,0,{"$nulls":5},{"v":0,"d":"0.0"},1,0,""]
[11,{"$f":"'Wettkampf 1'!B26","v":"Engbers Hannes"},{"$f":"'Wettkampf 1'!C26","v":"Spahnharenstätte"},null,null,{"v":0,"d":"0.0"},0,0,0,0,0,1,0,0,0,0,0,0,0,0,0,0,0,0,0,0,0,0,0,0,{"$nulls":5},{"v":0,"d":"0.0"},1,0,""]
[12,{"$f":"'Wettkampf 1'!B27","v":"Runde Marcel"},{"$f":"'Wettkampf 1'!C27","v":"Spahnharenstätte"},null,null,{"v":0,"d":"0.0"},0,0,0,0,0,1,0,0,0,0,0,0,0,0,0,0,0,0,0,0,0,0,0,0,{"$nulls":5},{"v":0,"d":"0.0"},1,0,""]
[13,{"$f":"'Wettkampf 1'!B28","v":"Jansen Lars"},{"$f":"'Wettkampf 1'!C28","v":"Spahnharenstätte"},null,null,{"v":0,"d":"0.0"},0,0,0,0,0,1,0,0,0,0,0,0,0,0,0,0,0,0,0,0,0,0,0,0,{"$nulls":5},{"v":0,"d":"0.0"},1,0,""]
[14,{"$f":"'Wettkampf 1'!B29","v":"Schütze 14"},{"$f":"'Wettkampf 1'!C29","v":"Spahnharenstätte"},null,null,{"v":0,"d":"0.0"},0,0,0,0,0,1,0,0,0,0,0,0,0,0,0,0,0,0,0,0,0,0,0,0,{"$nulls":5},{"v":0,"d":"0.0"},1,0,""]
[15,{"$f":"'Wettkampf 1'!B30","v":"Schütze 15"},{"$f":"'Wettkampf 1'!C30","v":"Spahnharenstätte"},null,null,{"v":0,"d":"0.0"},0,0,0,0,0,1,0,0,0,0,0,0,0,0,0,0,0,0,0,0,0,0,0,0,{"$nulls":5},{"v":0,"d":"0.0"},1,0,""]
[16,{"$f":"'Wettkampf 1'!B31","v":"Suhle Annalena"},{"$f":"'Wettkampf 1'!C31","v":"Esterwegen"},null,null,{"v":0,"d":"0.0"},0,0,0,0,0,0,0,1,0,0,0,0,0,0,0,0,0,0,0,0,0,0,0,0,{"$nulls":5},{"v":0,"d":"0.0"},1,0,""]
[17,{"$f":"'Wettkampf 1'!B32","v":"Gäken Lena"},{"$f":"'Wettkampf 1'!C32","v":"Esterwegen"},null,null,{"v":0,"d":"0.0"},0,0,0,0,0,0,0,1,0,0,0,0,0,0,0,0,0,0,0,0,0,0,0,0,{"$nulls":5},{"v":0,"d":"0.0"},1,0,""]
[18,{"$f":"'Wettkampf 1'!B33","v":"Jansen Daniel"},{"$f":"'Wettkampf 1'!C33","v":"Esterwegen"},null,null,{"v":0,"d":"0.0"},0,0,0,0,0,0,0,1,0,0,0,0,0,0,0,0,0,0,0,0,0,0,0,0,{"$nulls":5},{"v":0,"d":"0.0"},1,0,""]
[19,{"$f":"'Wettkampf 1'!B34","v":"Pieper Jonas"},{"$f":"'Wettkampf 1'!C34","v":"Esterwegen"},null,null,{"v":0,"d":"0.0"},0,0,0,0,0,0,0,1,0,0,0,0,0,0,0,0,0,0,0,0,0,0,0,0,{"$nulls":5},{"v":0,"d":"0.0"},1,0,""]
[20,{"$f":"'Wettkampf 1'!B35","v":"Schütze 20"},{"$f":"'Wettkampf 1'!C35","v":"Esterwegen"},null,null,{"v":0,"d":"0.0"},0,0,0,0,0,0,0,1,0,0,0,0,0,0,0,0,0,0,0,0,0,0,0,0,{"$nulls":5},{"v":0,"d":"0.0"},1,0,""]
[21,{"$f":"'Wettkampf 1'!B36","v":"Hellweg Thea"},{"$f":"'Wettkampf 1'!C36","v":"Lähden"},null,null,{"v":0,"d":"0.0"},0,0,0,0,0,0,0,0,0,1,0,0,0,0,0,0,0,0,0,0,0,0,0,0,{"$nulls":5},{"v":0,"d":"0.0"},1,0,""]
[22,{"$f":"'Wettkampf 1'!B37","v":"Bruns Henrik"},{"$f":"'Wettkampf 1'!C37","v":"Lähden"},null,null,{"v":0,"d":"0.0"},0,0,0,0,0,0,0,0,0,1,0,0,0,0,0,0,0,0,0,0,0,0,0,0,{"$nulls":5},{"v":0,"d":"0.0"},1,0,""]
[23,{"$f":"'Wettkampf 1'!B38","v":"Buschen Johann "},{"$f":"'Wettkampf 1'!C38","v":"Lähden"},null,null,{"v":0,"d":"0.0"},0,0,0,0,0,0,0,0,0,1,0,0,0,0,0,0,0,0,0,0,0,0,0,0,{"$nulls":5},{"v":0,"d":"0.0"},1,0,""]
[24,{"$f":"'Wettkampf 1'!B39","v":"Preut Jannis"},{"$f":"'Wettkampf 1'!C39","v":"Lähden"},null,null,{"v":0,"d":"0.0"},0,0,0,0,0,0,0,0,0,1,0,0,0,0,0,0,0,0,0,0,0,0,0,0,{"$nulls":5},{"v":0,"d":"0.0"},1,0,""]
[25,{"$f":"'Wettkampf 1'!B40","v":"Fleschenberg Jana"},{"$f":"'Wettkampf 1'!C40","v":"Lähden"},null,null,{"v":0,"d":"0.0"},0,0,0,0,0,0,0,0,0,1,0,0,0,0,0,0,0,0,0,0,0,0,0,0,{"$nulls":5},{"v":0,"d":"0.0"},1,0,""]
[26,{"$f":"'Wettkampf 1'!B41","v":"von Seggern Moritz"},{"$f":"'Wettkampf 1'!C41","v":"Lähden"},null,null,{"v":0,"d":"0.0"},0,0,0,0,0,0,0,0,0,1,0,0,0,0,0,0,0,0,0,0,0,0,0,0,{"$nulls":5},{"v":0,"d":"0.0"},1,0,""]
[27,{"$f":"'Wettkampf 1'!B42","v":"Kohnen Saskia"},{"$f":"'Wettkampf 1'!C42","v":"Börgermoor"},null,null,{"v":0,"d":"0.0"},0,0,0,0,0,0,0,0,0,0,0,1,0,0,0,0,0,0,0,0,0,0,0,0,{"$nulls":5},{"v":0,"d":"0.0"},1,0,""]
[28,{"$f":"'Wettkampf 1'!B43","v":"Niemann Paul"},{"$f":"'Wettkampf 1'!C43","v":"Börgermoor"},null,null,{"v":0,"d":"0.0"},0,0,0,0,0,0,0,0,0,0,0,1,0,0,0,0,0,0,0,0,0,0,0,0,{"$nulls":5},{"v":0,"d":"0.0"},1,0,""]
[29,{"$f":"'Wettkampf 1'!B44","v":"Schütze 29"},{"$f":"'Wettkampf 1'!C44","v":"Börgermoor"},null,null,{"v":0,"d":"0.0"},0,0,0,0,0,0,0,0,0,0,0,1,0,0,0,0,0,0,0,0,0,0,0,0,{"$nulls":5},{"v":0,"d":"0.0"},1,0,""]
[30,{"$f":"'Wettkampf 1'!B45","v":"Schütze 30"},{"$f":"'Wettkampf 1'!C45","v":"Börgermoor"},null,null,{"v":0,"d":"0.0"},0,0,0,0,0,0,0,0,0,0,0,1,0,0,0,0,0,0,0,0,0,0,0,0,{"$nulls":5},{"v":0,"d":"0.0"},1,0,""]
[31,{"$f":"'Wettkampf 1'!B46","v":"Stümpler Jan Luka "},{"$f":"'Wettkampf 1'!C46","v":"Lähden"},null,null,{"v":0,"d":"0.0"},0,0,0,0,0,0,0,0,0,1,0,0,0,0,0,0,0,0,0,0,0,0,0,0,{"$nulls":5},{"v":0,"d":"0.0"},1,0,""]
[32,{"$f":"'Wettkampf 1'!B47","v":"Helmer, Nils"},{"$f":"'Wettkampf 1'!C47","v":"Lorup"},null,null,{"v":0,"d":"0.0"},0,1,0,0,0,0,0,0,0,0,0,0,0,0,0,0,0,0,0,0,0,0,0,0,{"$nulls":5},{"v":0,"d":"0.0"},1,0,""]
[33,{"$f":"'Wettkampf 1'!B48","v":"Schütze 33"},{"$f":"'Wettkampf 1'!C48","v":"Verein VII"},null,null,{"v":0,"d":"0.0"},0,0,0,0,0,0,0,0,0,0,0,0,0,1,0,0,0,0,0,0,0,0,0,0,{"$nulls":5},{"v":0,"d":"0.0"},1,0,""]
[34,{"$f":"'Wettkampf 1'!B49","v":"Schütze 34"},{"$f":"'Wettkampf 1'!C49","v":"Verein VII"},null,null,{"v":0,"d":"0.0"},0,0,0,0,0,0,0,0,0,0,0,0,0,1,0,0,0,0,0,0,0,0,0,0,{"$nulls":5},{"v":0,"d":"0.0"},1,0,""]
[35,{"$f":"'Wettkampf 1'!B50","v":"Schütze 35"},{"$f":"'Wettkampf 1'!C50","v":"Verein VII"},null,null,{"v":0,"d":"0.0"},0,0,0,0,0,0,0,0,0,0,0,0,0,1,0,0,0,0,0,0,0,0,0,0,{"$nulls":5},{"v":0,"d":"0.0"},1,0,""]
[36,{"$f":"'Wettkampf 1'!B51","v":"Schütze 36"},{"$f":"'Wettkampf 1'!C51","v":"Verein VII"},null,null,{"v":0,"d":"0.0"},0,0,0,0,0,0,0,0,0,0,0,0,0,1,0,0,0,0,0,0,0,0,0,0,{"$nulls":5},{"v":0,"d":"0.0"},1,0,""]
[37,{"$f":"'Wettkampf 1'!B52","v":"Schütze 37"},{"$f":"'Wettkampf 1'!C52","v":"Verein VII"},null,null,{"v":0,"d":"0.0"},0,0,0,0,0,0,0,0,0,0,0,0,0,1,0,0,0,0,0,0,0,0,0,0,{"$nulls":5},{"v":0,"d":"0.0"}]
[38,{"$f":"'Wettkampf 1'!B53","v":"Schütze 38"},{"$f":"'Wettkampf 1'!C53","v":"Verein VIII"},null,null,{"v":0,"d":"0.0"},0,0,0,0,0,0,0,0,0,0,0,0,0,0,0,1,0,0,0,0,0,0,0,0,{"$nulls":5},{"v":0,"d":"0.0"}]
[39,{"$f":"'Wettkampf 1'!B54","v":"Schütze 39"},{"$f":"'Wettkampf 1'!C54","v":"Verein VIII"},null,null,{"v":0,"d":"0.0"},0,0,0,0,0,0,0,0,0,0,0,0,{"$f":"IF($C54=$B$8,$F54,0)","v":0},{"$f":"(IF(AND($E54=\"\",$C54=$B$8),1,0))","v":0},{"$f":"IF($C54=$B$9,$F54,0)","v":0},{"$f":"(IF(AND($E54=\"\",$C54=$B$9),1,0))","v":1},{"$f":"IF($C54=$B$10,$F54,0)","v":0},{"$f":"(IF(AND($E54=\"\",$C54=$B$10),1,0))","v":0},{"$f":"IF($C54=$B$11,$F54,0)","v":0},{"$f":"(IF(AND($E54=\"\",$C54=$B$11),1,0))","v":0},{"$f":"IF($C54=$B$12,$F54,0)","v":0},{"$f":"(IF(AND($E54=\"\",$C54=$B$12),1,0))","v":0},{"$f":"IF($C54=$B$13,$F54,0)","v":0},{"$f":"(IF(AND($E54=\"\",$C54=$B$13),1,0))","v":0},{"$nulls":5},{"v":0,"d":"0.0"}]
[40,{"$f":"'Wettkampf 1'!B55","v":"Schütze 40"},{"$f":"'Wettkampf 1'!C55","v":"Verein VIII"},null,null,{"v":0,"d":"0.0"},0,0,0,0,0,0,0,0,0,0,0,0,0,0,0,1,0,0,0,0,0,0,0,0,{"$nulls":5},{"v":0,"d":"0.0"}]
[41,{"$f":"'Wettkampf 1'!B56","v":"Schütze 41"},{"$f":"'Wettkampf 1'!C56","v":"Verein IX"},null,null,{"v":0,"d":"0.0"},0,0,0,0,0,0,0,0,0,0,0,0,0,0,0,0,0,1,0,0,0,0,0,0,{"$nulls":5},{"v":0,"d":"0.0"}]
[42,{"$f":"'Wettkampf 1'!B57","v":"Schütze 42"},{"$f":"'Wettkampf 1'!C57","v":"Verein IX"},null,null,{"v":0,"d":"0.0"},0,0,0,0,0,0,0,0,0,0,0,0,0,0,0,0,0,1,0,0,0,0,0,0,{"$nulls":5},{"v":0,"d":"0.0"}]
[43,{"$f":"'Wettkampf 1'!B58","v":"Schütze 43"},{"$f":"'Wettkampf 1'!C58","v":"Verein IX"},null,null,{"v":0,"d":"0.0"},0,0,0,0,0,0,0,0,0,0,0,0,0,0,0,0,0,1,0,0,0,0,0,0,{"$nulls":5},{"v":0,"d":"0.0"}]
[44,{"$f":"'Wettkampf 1'!B59","v":"Schütze 44"},{"$f":"'Wettkampf 1'!C59","v":"Verein IX"},null,null,{"v":0,"d":"0.0"},0,0,0,0,0,0,0,0,0,0,0,0,0,0,0,0,0,1,0,0,0,0,0,0,{"$nulls":5},{"v":0,"d":"0.0"}]
[45,{"$f":"'Wettkampf 1'!B60","v":"Schütze 45"},{"$f":"'Wettkampf 1'!C60","v":"Verein IX"},null,null,{"v":0,"d":"0.0"},0,0,0,0,0,0,0,0,0,0,0,0,0,0,0,0,0,1,0,0,0,0,0,0,{"$nulls":5},{"v":0,"d":"0.0"}]
[46,{"$f":"'Wettkampf 1'!B61","v":"Schütze 46"},{"$f":"'Wettkampf 1'!C61","v":"Verein X"},null,null,{"v":0,"d":"0.0"},0,0,0,0,0,0,0,0,0,0,0,0,0,0,0,0,0,0,0,1,0,0,0,0,{"$nulls":5},{"v":0,"d":"0.0"}]
[47,{"$f":"'Wettkampf 1'!B62","v":"Schütze 47"},{"$f":"'Wettkampf 1'!C62","v":"Verein X"},null,null,{"v":0,"d":"0.0"},0,0,0,0,0,0,0,0,0,0,0,0,0,0,0,0,0,0,0,1,0,0,0,0,{"$nulls":5},{"v":0,"d":"0.0"}]
[48,{"$f":"'Wettkampf 1'!B63","v":"Schütze 48"},{"$f":"'Wettkampf 1'!C63","v":"Verein X"},null,null,{"v":0,"d":"0.0"},0,0,0,0,0,0,0,0,0,0,0,0,0,0,0,0,0,0,0,1,0,0,0,0,{"$nulls":5},{"v":0,"d":"0.0"}]
[49,{"$f":"'Wettkampf 1'!B64","v":"Schütze 49"},{"$f":"'Wettkampf 1'!C64","v":"Verein X"},null,null,{"v":0,"d":"0.0"},0,0,0,0,0,0,0,0,0,0,0,0,0,0,0,0,0,0,0,1,0,0,0,0,{"$nulls":5},{"v":0,"d":"0.0"}]
[50,{"$f":"'Wettkampf 1'!B65","v":"Schütze 50"},{"$f":"'Wettkampf 1'!C65","v":"Verein X"},null,null,{"v":0,"d":"0.0"},0,0,0,0,0,0,0,0,0,0,0,0,0,0,0,0,0,0,0,1,0,0,0,0,{"$nulls":5},{"v":0,"d":"0.0"}]
[51,{"$f":"'Wettkampf 1'!B66","v":"Schütze 51"},{"$f":"'Wettkampf 1'!C66","v":"Verein XI"},null,null,{"v":0,"d":"0.0"},0,0,0,0,0,0,0,0,0,0,0,0,0,0,0,0,0,0,0,0,0,1,0,0,{"$nulls":5},{"v":0,"d":"0.0"}]
[52,{"$f":"'Wettkampf 1'!B67","v":"Schütze 52"},{"$f":"'Wettkampf 1'!C67","v":"Verein XI"},null,null,{"v":0,"d":"0.0"},0,0,0,0,0,0,0,0,0,0,0,0,0,0,0,0,0,0,0,0,0,1,0,0,{"$nulls":5},{"v":0,"d":"0.0"}]
[53,{"$f":"'Wettkampf 1'!B68","v":"Schütze 53"},{"$f":"'Wettkampf 1'!C68","v":"Verein XI"},null,null,{"v":0,"d":"0.0"},0,0,0,0,0,0,0,0,0,0,0,0,0,0,0,0,0,0,0,0,0,1,0,0,{"$nulls":5},{"v":0,"d":"0.0"}]
[54,{"$f":"'Wettkampf 1'!B69","v":"Schütze 54"},{"$f":"'Wettkampf 1'!C69","v":"Verein XI"},null,null,{"v":0,"d":"0.0"},0,0,0,0,0,0,0,0,0,0,0,0,0,0,0,0,0,0,0,0,0,1,0,0,{"$nulls":5},{"v":0,"d":"0.0"}]
[55,{"$f":"'Wettkampf 1'!B70","v":"Schütze 55"},{"$f":"'Wettkampf 1'!C70","v":"Verein XI"},null,null,{"v":0,"d":"0.0"},0,0,0,0,0,0,0,0,0,0,0,0,0,0,0,0,0,0,0,0,0,1,0,0,{"$nulls":5},{"v":0,"d":"0.0"}]
[56,{"$f":"'Wettkampf 1'!B71","v":"Schütze 56"},{"$f":"'Wettkampf 1'!C71","v":"Verein XII"},null,null,{"v":0,"d":"0.0"},0,0,0,0,0,0,0,0,0,0,0,0,0,0,0,0,0,0,0,0,0,0,0,1,{"$nulls":5},{"v":0,"d":"0.0"}]
[57,{"$f":"'Wettkampf 1'!B72","v":"Schütze 57"},{"$f":"'Wettkampf 1'!C72","v":"Verein XII"},null,null,{"v":0,"d":"0.0"},0,0,0,0,0,0,0,0,0,0,0,0,0,0,0,0,0,0,0,0,0,0,0,1,{"$nulls":5},{"v":0,"d":"0.0"}]
[58,{"$f":"'Wettkampf 1'!B73","v":"Schütze 58"},{"$f":"'Wettkampf 1'!C73","v":"Verein XII"},null,null,{"v":0,"d":"0.0"},0,0,0,0,0,0,0,0,0,0,0,0,0,0,0,0,0,0,0,0,0,0,0,1,{"$nulls":5},{"v":0,"d":"0.0"}]
[59,{"$f":"'Wettkampf 1'!B74","v":"Schütze 59"},{"$f":"'Wettkampf 1'!C74","v":"Verein XII"},null,null,{"v":0,"d":"0.0"},0,0,0,0,0,0,0,0,0,0,0,0,0,0,0,0,0,0,0,0,0,0,0,1,{"$nulls":5},{"v":0,"d":"0.0"}]
[60,{"$f":"'Wettkampf 1'!B75","v":"Schütze 60"},{"$f":"'Wettkampf 1'!C75","v":"Verein XII"},null,null,{"v":0,"d":"0.0"},0,0,0,0,0,0,0,0,0,0,0,0,0,0,0,0,0,0,0,0,0,0,0,1,{"$nulls":5},{"v":0,"d":"0.0"}]
[{"$nulls":6},{"$f":"LARGE(G16:G75,1)+LARGE(G16:G75,2)+LARGE(G16:G75,3)","v":0},{"$f":"SUM(H16:H75)","v":7},{"$f":"LARGE(I16:I75,1)+LARGE(I16:I75,2)+LARGE(I16:I75,3)","v":0},{"$f":"SUM(J16:J75)","v":4},{"$f":"LARGE(K16:K75,1)+LARGE(K16:K75,2)+LARGE(K16:K75,3)","v":0},{"$f":"SUM(L16:L75)","v":5},{"$f":"LARGE(M16:M75,1)+LARGE(M16:M75,2)+LARGE(M16:M75,3)","v":0},{"$f":"SUM(N16:N75)","v":5},{"$f":"LARGE(O16:O75,1)+LARGE(O16:O75,2)+LARGE(O16:O75,3)","v":0},{"$f":"SUM(P16:P75)","v":7},{"$f":"LARGE(Q16:Q75,1)+LARGE(Q16:Q75,2)+LARGE(Q16:Q75,3)","v":0},{"$f":"SUM(R16:R75)","v":4},{"$f":"LARGE(S16:S75,1)+LARGE(S16:S75,2)+LARGE(S16:S75,3)","v":0},{"$f":"SUM(T16:T75)","v":5},{"$f":"LARGE(U16:U75,1)+LARGE(U16:U75,2)+LARGE(U16:U75,3)","v":0},{"$f":"SUM(V16:V75)","v":3},{"$f":"LARGE(W16:W75,1)+LARGE(W16:W75,2)+LARGE(W16:W75,3)","v":0},{"$f":"SUM(X16:X75)","v":5},{"$f":"LARGE(Y16:Y75,1)+LARGE(Y16:Y75,2)+LARGE(Y16:Y75,3)","v":0},{"$f":"SUM(Z16:Z75)","v":5},{"$f":"LARGE(AA16:AA75,1)+LARGE(AA16:AA75,2)+LARGE(AA16:AA75,3)","v":0},{"$f":"SUM(AB16:AB75)","v":5},{"$f":"LARGE(AC16:AC75,1)+LARGE(AC16:AC75,2)+LARGE(AC16:AC75,3)","v":0},{"$f":"SUM(AD16:AD75)","v":5}]
[null,null,"per Email an: sk-huemmling@gmx.de"]

{"sheet":"6","index":6,"n_rows":77,"n_cols":39,"rows_kept":77,"merged":[[0,34,0,35],[1,34,1,35],[4,34,4,35],[5,34,5,35],[6,34,6,35],[14,32,14,35]]}
[null,"Verein / Gruppe",null,"Ergebnisse",{"$nulls":29},"Austragungsort:",{"$f":"Übersicht!I4","v":0}]
[1,{"$f":"'Wettkampf 1'!B2","v":"Lorup"},null,{"$f":"G76","v":{"v":0,"d":"0.0"}},{"$f":"IF(H76>4,\"Es sind zu viele Schützen in Wertung!\",\" \")","v":"Es sind zu viele Schützen in Wertung!"},{"$nulls":28},"Wettkampftag:",{"$f":"Übersicht!I3","v":0}]
[2,{"$f":"'Wettkampf 1'!B3","v":"Sögel"},null,{"$f":"I76","v":{"v":0,"d":"0.0"}},{"$f":"IF(J76>4,\"Es sind zu viele Schützen in Wertung!\",\" \")","v":" "}]
[3,{"$f":"'Wettkampf 1'!B4","v":"Spahnharenstätte"},null,{"$f":"K76","v":{"v":0,"d":"0.0"}},{"$f":"IF(L76>4,\"Es sind zu viele Schützen in Wertung!\",\" \")","v":"Es sind zu viele Schützen in Wertung!"},{"$nulls":30},"Ansprechpartner für Rückfragen:"]
[4,{"$f":"'Wettkampf 1'!B5","v":"Esterwegen"},null,{"$f":"M76","v":{"v":0,"d":"0.0"}},{"$f":"IF(N76>4,\"Es sind zu viele Schützen in Wertung!\",\" \")","v":"Es sind zu viele Schützen in Wertung!"},{"$nulls":28},"Name:"]
[5,{"$f":"'Wettkampf 1'!B6","v":"Lähden"},null,{"$f":"O76","v":{"v":0,"d":"0.0"}},{"$f":"IF(P76>4,\"Es sind zu viele Schützen in Wertung!\",\" \")","v":"Es sind zu viele Schützen in Wertung!"},{"$nulls":28},"Tel:"]
[6,{"$f":"'Wettkampf 1'!B7","v":"Börgermoor"},null,{"$f":"Q76","v":{"v":0,"d":"0.0"}},{"$f":"IF(R76>4,\"Es sind zu viele Schützen in Wertung!\",\" \")","v":" "},{"$nulls":28},"Standaufsicht:","eintragen"]
[7,{"$f":"'Wettkampf 1'!B8","v":"Verein VII"},null,{"$f":"S76","v":{"v":0,"d":"0.0"}},{"$f":"IF(T76>4,\"Es sind zu viele Schützen in Wertung!\",\" \")","v":"Es sind zu viele Schützen in Wertung!"}]
[8,{"$f":"'Wettkampf 1'!B9","v":"Verein VIII"},null,{"$f":"U76","v":{"v":0,"d":"0.0"}},{"$f":"IF(V76>4,\"Es sind zu viele Schützen in Wertung!\",\" \")","v":" "}]
[9,{"$f":"'Wettkampf 1'!B10","v":"Verein IX"},null,{"$f":"W76","v":{"v":0,"d":"0.0"}},{"$f":"IF(X76>4,\"Es sind zu viele Schützen in Wertung!\",\" \")","v":"Es sind zu viele Schützen in Wertung!"}]
[10,{"$f":"'Wettkampf 1'!B11","v":"Verein X"},null,{"$f":"Y76","v":{"v":0,"d":"0.0"}},{"$f":"IF(Z76>4,\"Es sind zu viele Schützen in Wertung!\",\" \")","v":"Es sind zu viele Schützen in Wertung!"}]
[11,{"$f":"'Wettkampf 1'!B12","v":"Verein XI"},null,{"$f":"AA76","v":{"v":0,"d":"0.0"}},{"$f":"IF(AB76>4,\"Es sind zu viele Schützen in Wertung!\",\" \")","v":"Es sind zu viele Schützen in Wertung!"}]
[12,{"$f":"'Wettkampf 1'!B13","v":"Verein XII"},null,{"$f":"AC76","v":{"v":0,"d":"0.0"}},{"$f":"IF(AD76>4,\"Es sind zu viele Schützen in Wertung!\",\" \")","v":"Es sind zu viele Schützen in Wertung!"}]
[]
[null,"Einzelergebnisse:","Verein / Gruppe","Ergebnisse (mindestens 0 eintragen)","AW? Dann x eintippen",null,"Verein 1",null,"Verein 2",null,"Verein 3",null,"Verein 4",null,"Verein 5",null,"Verein 6",null,"Verein 7",null,"Verein 8",null,"Verein 9",null,"Verein 10",null,"Verein 11",null,"Verein 12",{"$nulls":3},"Proberechnung bei Streifen:"]
[1,{"$f":"'Wettkampf 1'!B16","v":"Wotte Lia"},{"$f":"'Wettkampf 1'!C16","v":"Lorup"},null,null,{"$f":"IF(E16=\"x\",\"0\",D16)","v":{"v":0,"d":"0.0"}},{"$f":"IF(C16=$B$2,F16,0)","v":0},{"$f":"(IF(AND($E16=\"\",$C16=$B$2),1,0))","v":1},{"$f":"IF($C16=$B$3,$F16,0)","v":0},{"$f":"(IF(AND($E16=\"\",$C16=$B$3),1,0))","v":0},{"$f":"IF($C16=$B$4,F16,0)","v":0},{"$f":"(IF(AND($E16=\"\",$C16=$B$4),1,0))","v":0},{"$f":"IF($C16=$B$5,F16,0)","v":0},{"$f":"(IF(AND($E16=\"\",$C16=$B$5),1,0))","v":0},{"$f":"IF($C16=$B$6,F16,0)","v":0},{"$f":"(IF(AND($E16=\"\",$C16=$B$6),1,0))","v":0},{"$f":"IF($C16=$B$7,F16,0)","v":0},{"$f":"(IF(AND($E16=\"\",$C16=$B$7),1,0))","v":0},{"$f":"IF($C16=$B$8,$F16,0)","v":0},{"$f":"(IF(AND($E16=\"\",$C16=$B$8),1,0))","v":0},{"$f":"IF($C16=$B$9,$F16,0)","v":0},{"$f":"(IF(AND($E16=\"\",$C16=$B$9),1,0))","v":0},{"$f":"IF($C16=$B$10,$F16,0)","v":0},{"$f":"(IF(AND($E16=\"\",$C16=$B$10),1,0))","v":0},{"$f":"IF($C16=$B$11,$F16,0)","v":0},{"$f":"(IF(AND($E16=\"\",$C16=$B$11),1,0))","v":0},{"$f":"IF($C16=$B$12,$F16,0)","v":0},{"$f":"(IF(AND($E16=\"\",$C16=$B$12),1,0))","v":0},{"$f":"IF($C16=$B$13,$F16,0)","v":0},{"$f":"(IF(AND($E16=\"\",$C16=$B$13),1,0))","v":0},{"$nulls":5},{"$f":"SUM(AG16:AI16)","v":{"v":0,"d":"0.0"}},{"$f":"IF(AJ16=D16,1,0)","v":1},{"$f":"IF(AJ16=0,0,1)","v":0},{"$f":"IF(AK16+AL16=2,\"Korrekt\",\"\")","v":""}]
[2,{"$f":"'Wettkampf 1'!B17","v":"Wotte Hannes"},{"$f":"'Wettkampf 1'!C17","v":"Lorup"},null,null,{"$f":"IF(E17=\"x\",\"0\",D17)","v":{"v":0,"d":"0.0"}},{"$f":"IF(C17=$B$2,F17,0)","v":0},{"$f":"(IF(AND($E17=\"\",$C17=$B$2),1,0))","v":1},{"$f":"IF($C17=$B$3,F17,0)","v":0},{"$f":"(IF(AND($E17=\"\",$C17=$B$3),1,0))","v":0},{"$f":"IF($C17=$B$4,F17,0)","v":0},{"$f":"(IF(AND($E17=\"\",$C17=$B$4),1,0))","v":0},{"$f":"IF($C17=$B$5,F17,0)","v":0},{"$f":"(IF(AND($E17=\"\",$C17=$B$5),1,0))","v":0},{"$f":"IF($C17=$B$6,F17,0)","v":0},{"$f":"(IF(AND($E17=\"\",$C17=$B$6),1,0))","v":0},{"$f":"IF($C17=$B$7,F17,0)","v":0},{"$f":"(IF(AND($E17=\"\",$C17=$B$7),1,0))","v":0},{"$f":"IF($C17=$B$8,$F17,0)","v":0},{"$f":"(IF(AND($E17=\"\",$C17=$B$8),1,0))","v":0},{"$f":"IF($C17=$B$9,$F17,0)","v":0},{"$f":"(IF(AND($E17=\"\",$C17=$B$9),1,0))","v":0},{"$f":"IF($C17=$B$10,$F17,0)","v":0},{"$f":"(IF(AND($E17=\"\",$C17=$B$10),1,0))","v":0},{"$f":"IF($C17=$B$11,$F17,0)","v":0},{"$f":"(IF(AND($E17=\"\",$C17=$B$11),1,0))","v":0},{"$f":"IF($C17=$B$12,$F17,0)","v":0},{"$f":"(IF(AND($E17=\"\",$C17=$B$12),1,0))","v":0},{"$f":"IF($C17=$B$13,$F17,0)","v":0},{"$f":"(IF(AND($E17=\"\",$C17=$B$13),1,0))","v":0},{"$nulls":5},{"$f":"SUM(AG17:AI17)","v":{"v":0,"d":"0.0"}},{"$f":"IF(AJ17=D17,1,0)","v":1},{"$f":"IF(AJ17=0,0,1)","v":0},{"$f":"IF(AK17+AL17=2,\"Korrekt\",\"\")","v":""}]
[3,{"$f":"'Wettkampf 1'!B18","v":"Gretenabeln Elias"},{"$f":"'Wettkampf 1'!C18","v":"Lorup"},null,null,{"v":0,"d":"0.0"},0,1,0,0,0,0,0,0,0,0,0,0,0,0,0,0,0,0,0,0,0,0,0,0,{"$nulls":5},{"v":0,"d":"0.0"},1,0,""]
[4,{"$f":"'Wettkampf 1'!B19","v":"Helmer Maike"},{"$f":"'Wettkampf 1'!C19","v":"Lorup"},null,null,{"v":0,"d":"0.0"},0,1,0,0,0,0,0,0,0,0,0,0,0,0,0,0,0,0,0,0,0,0,0,0,{"$nulls":5},{"v":0,"d":"0.0"},1,0,""]
[5,{"$f":"'Wettkampf 1'!B20","v":"Többen Jannes"},{"$f":"'Wettkampf 1'!C20","v":"Lorup"},null,null,{"v":0,"d":"0.0"},0,1,0,0,0,0,0,0,0,0,0,0,0,0,0,0,0,0,0,0,0,0,0,0,{"$nulls":5},{"v":0,"d":"0.0"},1,0,""]
[6,{"$f":"'Wettkampf 1'!B21","v":"Lüken Arne"},{"$f":"'Wettkampf 1'!C21","v":"Lorup"},null,null,{"v":0,"d":"0.0"},0,1,0,0,0,0,0,0,0,0,0,0,0,0,0,0,0,0,0,0,0,0,0,0,{"$nulls":5},{"v":0,"d":"0.0"},1,0,""]
[7,{"$f":"'Wettkampf 1'!B22","v":"Schütze 7"},{"$f":"'Wettkampf 1'!C22","v":"Sögel"},null,null,{"v":0,"d":"0.0"},0,0,0,1,0,0,0,0,0,0,0,0,0,0,0,0,0,0,0,0,0,0,0,0,{"$nulls":5},{"v":0,"d":"0.0"},1,0,""]
[8,{"$f":"'Wettkampf 1'!B23","v":"Schütze 8"},{"$f":"'Wettkampf 1'!C23","v":"Sögel"},null,null,{"v":0,"d":"0.0"},0,0,0,1,0,0,0,0,0,0,0,0,0,0,0,0,0,0,0,0,0,0,0,0,{"$nulls":5},{"v":0,"d":"0.0"},1,0,""]
[9,{"$f":"'Wettkampf 1'!B24","v":"Schütze 9"},{"$f":"'Wettkampf 1'!C24","v":"Sögel"},null,null,{"v":0,"d":"0.0"},0,0,0,1,0,0,0,0,0,0,0,0,0,0,0,0,0,0,0,0,0,0,0,0,{"$nulls":5},{"v":0,"d":"0.0"},1,0,""]
[10,{"$f":"'Wettkampf 1'!B25","v":"Schütze 10"},{"$f":"'Wettkampf 1'!C25","v":"Sögel"},null,null,{"v":0,"d":"0.0"},0,0,0,1,0,0,0,0,0,0,0,0,0,0,0,0,0,0,0,0,0,0,0,0,{"$nulls":5},{"v":0,"d":"0.0"},1,0,""]
[11,{"$f":"'Wettkampf 1'!B26","v":"Engbers Hannes"},{"$f":"'Wettkampf 1'!C26","v":"Spahnharenstätte"},null,null,{"v":0,"d":"0.0"},0,0,0,0,0,1,0,0,0,0,0,0,0,0,0,0,0,0,0,0,0,0,0,0,{"$nulls":5},{"v":0,"d":"0.0"},1,0,""]
[12,{"$f":"'Wettkampf 1'!B27","v":"Runde Marcel"},{"$f":"'Wettkampf 1'!C27","v":"Spahnharenstätte"},null,null,{"v":0,"d":"0.0"},0,0,0,0,0,1,0,0,0,0,0,0,0,0,0,0,0,0,0,0,0,0,0,0,{"$nulls":5},{"v":0,"d":"0.0"},1,0,""]
[13,{"$f":"'Wettkampf 1'!B28","v":"Jansen Lars"},{"$f":"'Wettkampf 1'!C28","v":"Spahnharenstätte"},null,null,{"v":0,"d":"0.0"},0,0,0,0,0,1,0,0,0,0,0,0,0,0,0,0,0,0,0,0,0,0,0,0,{"$nulls":5},{"v":0,"d":"0.0"},1,0,""]
[14,{"$f":"'Wettkampf 1'!B29","v":"Schütze 14"},{"$f":"'Wettkampf 1'!C29","v":"Spahnharenstätte"},null,null,{"v":0,"d":"0.0"},0,0,0,0,0,1,0,0,0,0,0,0,0,0,0,0,0,0,0,0,0,0,0,0,{"$nulls":5},{"v":0,"d":"0.0"},1,0,""]
[15,{"$f":"'Wettkampf 1'!B30","v":"Schütze 15"},{"$f":"'Wettkampf 1'!C30","v":"Spahnharenstätte"},null,null,{"v":0,"d":"0.0"},0,0,0,0,0,1,0,0,0,0,0,0,0,0,0,0,0,0,0,0,0,0,0,0,{"$nulls":5},{"v":0,"d":"0.0"},1,0,""]
[16,{"$f":"'Wettkampf 1'!B31","v":"Suhle Annalena"},{"$f":"'Wettkampf 1'!C31","v":"Esterwegen"},null,null,{"v":0,"d":"0.0"},0,0,0,0,0,0,0,1,0,0,0,0,0,0,0,0,0,0,0,0,0,0,0,0,{"$nulls":5},{"v":0,"d":"0.0"},1,0,""]
[17,{"$f":"'Wettkampf 1'!B32","v":"Gäken Lena"},{"$f":"'Wettkampf 1'!C32","v":"Esterwegen"},null,null,{"v":0,"d":"0.0"},0,0,0,0,0,0,0,1,0,0,0,0,0,0,0,0,0,0,0,0,0,0,0,0,{"$nulls":5},{"v":0,"d":"0.0"},1,0,""]
[18,{"$f":"'Wettkampf 1'!B33","v":"Jansen Daniel"},{"$f":"'Wettkampf 1'!C33","v":"Esterwegen"},null,null,{"v":0,"d":"0.0"},0,0,0,0,0,0,0,1,0,0,0,0,0,0,0,0,0,0,0,0,0,0,0,0,{"$nulls":5},{"v":0,"d":"0.0"},1,0,""]
[19,{"$f":"'Wettkampf 1'!B34","v":"Pieper Jonas"},{"$f":"'Wettkampf 1'!C34","v":"Esterwegen"},null,null,{"v":0,"d":"0.0"},0,0,0,0,0,0,0,1,0,0,0,0,0,0,0,0,0,0,0,0,0,0,0,0,{"$nulls":5},{"v":0,"d":"0.0"},1,0,""]
[20,{"$f":"'Wettkampf 1'!B35","v":"Schütze 20"},{"$f":"'Wettkampf 1'!C35","v":"Esterwegen"},null,null,{"v":0,"d":"0.0"},0,0,0,0,0,0,0,1,0,0,0,0,0,0,0,0,0,0,0,0,0,0,0,0,{"$nulls":5},{"v":0,"d":"0.0"},1,0,""]
[21,{"$f":"'Wettkampf 1'!B36","v":"Hellweg Thea"},{"$f":"'Wettkampf 1'!C36","v":"Lähden"},null,null,{"v":0,"d":"0.0"},0,0,0,0,0,0,0,0,0,1,0,0,0,0,0,0,0,0,0,0,0,0,0,0,{"$nulls":5},{"v":0,"d":"0.0"},1,0,""]
[22,{"$f":"'Wettkampf 1'!B37","v":"Bruns Henrik"},{"$f":"'Wettkampf 1'!C37","v":"Lähden"},null,null,{"v":0,"d":"0.0"},0,0,0,0,0,0,0,0,0,1,0,0,0,0,0,0,0,0,0,0,0,0,0,0,{"$nulls":5},{"v":0,"d":"0.0"},1,0,""]
[23,{"$f":"'Wettkampf 1'!B38","v":"Buschen Johann "},{"$f":"'Wettkampf 1'!C38","v":"Lähden"},null,null,{"v":0,"d":"0.0"},0,0,0,0,0,0,0,0,0,1,0,0,0,0,0,0,0,0,0,0,0,0,0,0,{"$nulls":5},{"v":0,"d":"0.0"},1,0,""]
[24,{"$f":"'Wettkampf 1'!B39","v":"Preut Jannis"},{"$f":"'Wettkampf 1'!C39","v":"Lähden"},null,null,{"v":0,"d":"0.0"},0,0,0,0,0,0,0,0,0,1,0,0,0,0,0,0,0,0,0,0,0,0,0,0,{"$nulls":5},{"v":0,"d":"0.0"},1,0,""]
[25,{"$f":"'Wettkampf 1'!B40","v":"Fleschenberg Jana"},{"$f":"'Wettkampf 1'!C40","v":"Lähden"},null,null,{"v":0,"d":"0.0"},0,0,0,0,0,0,0,0,0,1,0,0,0,0,0,0,0,0,0,0,0,0,0,0,{"$nulls":5},{"v":0,"d":"0.0"},1,0,""]
[26,{"$f":"'Wettkampf 1'!B41","v":"von Seggern Moritz"},{"$f":"'Wettkampf 1'!C41","v":"Lähden"},null,null,{"v":0,"d":"0.0"},0,0,0,0,0,0,0,0,0,1,0,0,0,0,0,0,0,0,0,0,0,0,0,0,{"$nulls":5},{"v":0,"d":"0.0"},1,0,""]
[27,{"$f":"'Wettkampf 1'!B42","v":"Kohnen Saskia"},{"$f":"'Wettkampf 1'!C42","v":"Börgermoor"},null,null,{"v":0,"d":"0.0"},0,0,0,0,0,0,0,0,0,0,0,1,0,0,0,0,0,0,0,0,0,0,0,0,{"$nulls":5},{"v":0,"d":"0.0"},1,0,""]
[28,{"$f":"'Wettkampf 1'!B43","v":"Niemann Paul"},{"$f":"'Wettkampf 1'!C43","v":"Börgermoor"},null,null,{"v":0,"d":"0.0"},0,0,0,0,0,0,0,0,0,0,0,1,0,0,0,0,0,0,0,0,0,0,0,0,{"$nulls":5},{"v":0,"d":"0.0"},1,0,""]
[29,{"$f":"'Wettkampf 1'!B44","v":"Schütze 29"},{"$f":"'Wettkampf 1'!C44","v":"Börgermoor"},null,null,{"v":0,"d":"0.0"},0,0,0,0,0,0,0,0,0,0,0,1,0,0,0,0,0,0,0,0,0,0,0,0,{"$nulls":5},{"v":0,"d":"0.0"},1,0,""]
[30,{"$f":"'Wettkampf 1'!B45","v":"Schütze 30"},{"$f":"'Wettkampf 1'!C45","v":"Börgermoor"},null,null,{"v":0,"d":"0.0"},0,0,0,0,0,0,0,0,0,0,0,1,0,0,0,0,0,0,0,0,0,0,0,0,{"$nulls":5},{"v":0,"d":"0.0"},1,0,""]
[31,{"$f":"'Wettkampf 1'!B46","v":"Stümpler Jan Luka "},{"$f":"'Wettkampf 1'!C46","v":"Lähden"},null,null,{"v":0,"d":"0.0"},0,0,0,0,0,0,0,0,0,1,0,0,0,0,0,0,0,0,0,0,0,0,0,0,{"$nulls":5},{"v":0,"d":"0.0"},1,0,""]
[32,{"$f":"'Wettkampf 1'!B47","v":"Helmer, Nils"},{"$f":"'Wettkampf 1'!C47","v":"Lorup"},null,null,{"v":0,"d":"0.0"},0,1,0,0,0,0,0,0,0,0,0,0,0,0,0,0,0,0,0,0,0,0,0,0,{"$nulls":5},{"v":0,"d":"0.0"},1,0,""]
[33,{"$f":"'Wettkampf 1'!B48","v":"Schütze 33"},{"$f":"'Wettkampf 1'!C48","v":"Verein VII"},null,null,{"v":0,"d":"0.0"},0,0,0,0,0,0,0,0,0,0,0,0,0,1,0,0,0,0,0,0,0,0,0,0,{"$nulls":5},{"v":0,"d":"0.0"},1,0,""]
[34,{"$f":"'Wettkampf 1'!B49","v":"Schütze 34"},{"$f":"'Wettkampf 1'!C49","v":"Verein VII"},null,null,{"v":0,"d":"0.0"},0,0,0,0,0,0,0,0,0,0,0,0,0,1,0,0,0,0,0,0,0,0,0,0,{"$nulls":5},{"v":0,"d":"0.0"},1,0,""]
[35,{"$f":"'Wettkampf 1'!B50","v":"Schütze 35"},{"$f":"'Wettkampf 1'!C50","v":"Verein VII"},null,null,{"v":0,"d":"0.0"},0,0,0,0,0,0,0,0,0,0,0,0,0,1,0,0,0,0,0,0,0,0,0,0,{"$nulls":5},{"v":0,"d":"0.0"},1,0,""]
[36,{"$f":"'Wettkampf 1'!B51","v":"Schütze 36"},{"$f":"'Wettkampf 1'!C51","v":"Verein VII"},null,null,{"v":0,"d":"0.0"},0,0,0,0,0,0,0,0,0,0,0,0,0,1,0,0,0,0,0,0,0,0,0,0,{"$nulls":5},{"v":0,"d":"0.0"},1,0,""]
[37,{"$f":"'Wettkampf 1'!B52","v":"Schütze 37"},{"$f":"'Wettkampf 1'!C52","v":"Verein VII"},null,null,{"v":0,"d":"0.0"},0,0,0,0,0,0,0,0,0,0,0,0,0,1,0,0,0,0,0,0,0,0,0,0,{"$nulls":5},{"v":0,"d":"0.0"}]
[38,{"$f":"'Wettkampf 1'!B53","v":"Schütze 38"},{"$f":"'Wettkampf 1'!C53","v":"Verein VIII"},null,null,{"v":0,"d":"0.0"},0,0,0,0,0,0,0,0,0,0,0,0,0,0,0,1,0,0,0,0,0,0,0,0,{"$nulls":5},{"v":0,"d":"0.0"}]
[39,{"$f":"'Wettkampf 1'!B54","v":"Schütze 39"},{"$f":"'Wettkampf 1'!C54","v":"Verein VIII"},null,null,{"v":0,"d":"0.0"},0,0,0,0,0,0,0,0,0,0,0,0,{"$f":"IF($C54=$B$8,$F54,0)","v":0},{"$f":"(IF(AND($E54=\"\",$C54=$B$8),1,0))","v":0},{"$f":"IF($C54=$B$9,$F54,0)","v":0},{"$f":"(IF(AND($E54=\"\",$C54=$B$9),1,0))","v":1},{"$f":"IF($C54=$B$10,$F54,0)","v":0},{"$f":"(IF(AND($E54=\"\",$C54=$B$10),1,0))","v":0},{"$f":"IF($C54=$B$11,$F54,0)","v":0},{"$f":"(IF(AND($E54=\"\",$C54=$B$11),1,0))","v":0},{"$f":"IF($C54=$B$12,$F54,0)","v":0},{"$f":"(IF(AND($E54=\"\",$C54=$B$12),1,0))","v":0},{"$f":"IF($C54=$B$13,$F54,0)","v":0},{"$f":"(IF(AND($E54=\"\",$C54=$B$13),1,0))","v":0},{"$nulls":5},{"v":0,"d":"0.0"}]
[40,{"$f":"'Wettkampf 1'!B55","v":"Schütze 40"},{"$f":"'Wettkampf 1'!C55","v":"Verein VIII"},null,null,{"v":0,"d":"0.0"},0,0,0,0,0,0,0,0,0,0,0,0,0,0,0,1,0,0,0,0,0,0,0,0,{"$nulls":5},{"v":0,"d":"0.0"}]
[41,{"$f":"'Wettkampf 1'!B56","v":"Schütze 41"},{"$f":"'Wettkampf 1'!C56","v":"Verein IX"},null,null,{"v":0,"d":"0.0"},0,0,0,0,0,0,0,0,0,0,0,0,0,0,0,0,0,1,0,0,0,0,0,0,{"$nulls":5},{"v":0,"d":"0.0"}]
[42,{"$f":"'Wettkampf 1'!B57","v":"Schütze 42"},{"$f":"'Wettkampf 1'!C57","v":"Verein IX"},null,null,{"v":0,"d":"0.0"},0,0,0,0,0,0,0,0,0,0,0,0,0,0,0,0,0,1,0,0,0,0,0,0,{"$nulls":5},{"v":0,"d":"0.0"}]
[43,{"$f":"'Wettkampf 1'!B58","v":"Schütze 43"},{"$f":"'Wettkampf 1'!C58","v":"Verein IX"},null,null,{"v":0,"d":"0.0"},0,0,0,0,0,0,0,0,0,0,0,0,0,0,0,0,0,1,0,0,0,0,0,0,{"$nulls":5},{"v":0,"d":"0.0"}]
[44,{"$f":"'Wettkampf 1'!B59","v":"Schütze 44"},{"$f":"'Wettkampf 1'!C59","v":"Verein IX"},null,null,{"v":0,"d":"0.0"},0,0,0,0,0,0,0,0,0,0,0,0,0,0,0,0,0,1,0,0,0,0,0,0,{"$nulls":5},{"v":0,"d":"0.0"}]
[45,{"$f":"'Wettkampf 1'!B60","v":"Schütze 45"},{"$f":"'Wettkampf 1'!C60","v":"Verein IX"},null,null,{"v":0,"d":"0.0"},0,0,0,0,0,0,0,0,0,0,0,0,0,0,0,0,0,1,0,0,0,0,0,0,{"$nulls":5},{"v":0,"d":"0.0"}]
[46,{"$f":"'Wettkampf 1'!B61","v":"Schütze 46"},{"$f":"'Wettkampf 1'!C61","v":"Verein X"},null,null,{"v":0,"d":"0.0"},0,0,0,0,0,0,0,0,0,0,0,0,0,0,0,0,0,0,0,1,0,0,0,0,{"$nulls":5},{"v":0,"d":"0.0"}]
[47,{"$f":"'Wettkampf 1'!B62","v":"Schütze 47"},{"$f":"'Wettkampf 1'!C62","v":"Verein X"},null,null,{"v":0,"d":"0.0"},0,0,0,0,0,0,0,0,0,0,0,0,0,0,0,0,0,0,0,1,0,0,0,0,{"$nulls":5},{"v":0,"d":"0.0"}]
[48,{"$f":"'Wettkampf 1'!B63","v":"Schütze 48"},{"$f":"'Wettkampf 1'!C63","v":"Verein X"},null,null,{"v":0,"d":"0.0"},0,0,0,0,0,0,0,0,0,0,0,0,0,0,0,0,0,0,0,1,0,0,0,0,{"$nulls":5},{"v":0,"d":"0.0"}]
[49,{"$f":"'Wettkampf 1'!B64","v":"Schütze 49"},{"$f":"'Wettkampf 1'!C64","v":"Verein X"},null,null,{"v":0,"d":"0.0"},0,0,0,0,0,0,0,0,0,0,0,0,0,0,0,0,0,0,0,1,0,0,0,0,{"$nulls":5},{"v":0,"d":"0.0"}]
[50,{"$f":"'Wettkampf 1'!B65","v":"Schütze 50"},{"$f":"'Wettkampf 1'!C65","v":"Verein X"},null,null,{"v":0,"d":"0.0"},0,0,0,0,0,0,0,0,0,0,0,0,0,0,0,0,0,0,0,1,0,0,0,0,{"$nulls":5},{"v":0,"d":"0.0"}]
[51,{"$f":"'Wettkampf 1'!B66","v":"Schütze 51"},{"$f":"'Wettkampf 1'!C66","v":"Verein XI"},null,null,{"v":0,"d":"0.0"},0,0,0,0,0,0,0,0,0,0,0,0,0,0,0,0,0,0,0,0,0,1,0,0,{"$nulls":5},{"v":0,"d":"0.0"}]
[52,{"$f":"'Wettkampf 1'!B67","v":"Schütze 52"},{"$f":"'Wettkampf 1'!C67","v":"Verein XI"},null,null,{"v":0,"d":"0.0"},0,0,0,0,0,0,0,0,0,0,0,0,0,0,0,0,0,0,0,0,0,1,0,0,{"$nulls":5},{"v":0,"d":"0.0"}]
[53,{"$f":"'Wettkampf 1'!B68","v":"Schütze 53"},{"$f":"'Wettkampf 1'!C68","v":"Verein XI"},null,null,{"v":0,"d":"0.0"},0,0,0,0,0,0,0,0,0,0,0,0,0,0,0,0,0,0,0,0,0,1,0,0,{"$nulls":5},{"v":0,"d":"0.0"}]
[54,{"$f":"'Wettkampf 1'!B69","v":"Schütze 54"},{"$f":"'Wettkampf 1'!C69","v":"Verein XI"},null,null,{"v":0,"d":"0.0"},0,0,0,0,0,0,0,0,0,0,0,0,0,0,0,0,0,0,0,0,0,1,0,0,{"$nulls":5},{"v":0,"d":"0.0"}]
[55,{"$f":"'Wettkampf 1'!B70","v":"Schütze 55"},{"$f":"'Wettkampf 1'!C70","v":"Verein XI"},null,null,{"v":0,"d":"0.0"},0,0,0,0,0,0,0,0,0,0,0,0,0,0,0,0,0,0,0,0,0,1,0,0,{"$nulls":5},{"v":0,"d":"0.0"}]
[56,{"$f":"'Wettkampf 1'!B71","v":"Schütze 56"},{"$f":"'Wettkampf 1'!C71","v":"Verein XII"},null,null,{"v":0,"d":"0.0"},0,0,0,0,0,0,0,0,0,0,0,0,0,0,0,0,0,0,0,0,0,0,0,1,{"$nulls":5},{"v":0,"d":"0.0"}]
[57,{"$f":"'Wettkampf 1'!B72","v":"Schütze 57"},{"$f":"'Wettkampf 1'!C72","v":"Verein XII"},null,null,{"v":0,"d":"0.0"},0,0,0,0,0,0,0,0,0,0,0,0,0,0,0,0,0,0,0,0,0,0,0,1,{"$nulls":5},{"v":0,"d":"0.0"}]
[58,{"$f":"'Wettkampf 1'!B73","v":"Schütze 58"},{"$f":"'Wettkampf 1'!C73","v":"Verein XII"},null,null,{"v":0,"d":"0.0"},0,0,0,0,0,0,0,0,0,0,0,0,0,0,0,0,0,0,0,0,0,0,0,1,{"$nulls":5},{"v":0,"d":"0.0"}]
[59,{"$f":"'Wettkampf 1'!B74","v":"Schütze 59"},{"$f":"'Wettkampf 1'!C74","v":"Verein XII"},null,null,{"v":0,"d":"0.0"},0,0,0,0,0,0,0,0,0,0,0,0,0,0,0,0,0,0,0,0,0,0,0,1,{"$nulls":5},{"v":0,"d":"0.0"}]
[60,{"$f":"'Wettkampf 1'!B75","v":"Schütze 60"},{"$f":"'Wettkampf 1'!C75","v":"Verein XII"},null,null,{"v":0,"d":"0.0"},0,0,0,0,0,0,0,0,0,0,0,0,0,0,0,0,0,0,0,0,0,0,0,1,{"$nulls":5},{"v":0,"d":"0.0"}]
[{"$nulls":6},{"$f":"LARGE(G16:G75,1)+LARGE(G16:G75,2)+LARGE(G16:G75,3)","v":0},{"$f":"SUM(H16:H75)","v":7},{"$f":"LARGE(I16:I75,1)+LARGE(I16:I75,2)+LARGE(I16:I75,3)","v":0},{"$f":"SUM(J16:J75)","v":4},{"$f":"LARGE(K16:K75,1)+LARGE(K16:K75,2)+LARGE(K16:K75,3)","v":0},{"$f":"SUM(L16:L75)","v":5},{"$f":"LARGE(M16:M75,1)+LARGE(M16:M75,2)+LARGE(M16:M75,3)","v":0},{"$f":"SUM(N16:N75)","v":5},{"$f":"LARGE(O16:O75,1)+LARGE(O16:O75,2)+LARGE(O16:O75,3)","v":0},{"$f":"SUM(P16:P75)","v":7},{"$f":"LARGE(Q16:Q75,1)+LARGE(Q16:Q75,2)+LARGE(Q16:Q75,3)","v":0},{"$f":"SUM(R16:R75)","v":4},{"$f":"LARGE(S16:S75,1)+LARGE(S16:S75,2)+LARGE(S16:S75,3)","v":0},{"$f":"SUM(T16:T75)","v":5},{"$f":"LARGE(U16:U75,1)+LARGE(U16:U75,2)+LARGE(U16:U75,3)","v":0},{"$f":"SUM(V16:V75)","v":3},{"$f":"LARGE(W16:W75,1)+LARGE(W16:W75,2)+LARGE(W16:W75,3)","v":0},{"$f":"SUM(X16:X75)","v":5},{"$f":"LARGE(Y16:Y75,1)+LARGE(Y16:Y75,2)+LARGE(Y16:Y75,3)","v":0},{"$f":"SUM(Z16:Z75)","v":5},{"$f":"LARGE(AA16:AA75,1)+LARGE(AA16:AA75,2)+LARGE(AA16:AA75,3)","v":0},{"$f":"SUM(AB16:AB75)","v":5},{"$f":"LARGE(AC16:AC75,1)+LARGE(AC16:AC75,2)+LARGE(AC16:AC75,3)","v":0},{"$f":"SUM(AD16:AD75)","v":5}]
[null,null,"per Email an: sk-huemmling@gmx.de"]

{"sheet":"7","index":7,"n_rows":77,"n_cols":39,"rows_kept":77,"merged":[[0,34,0,35],[1,34,1,35],[4,34,4,35],[5,34,5,35],[6,34,6,35],[14,32,14,35]]}
[null,"Verein / Gruppe",null,"Ergebnisse",{"$nulls":29},"Austragungsort:",{"$f":"Übersicht!L4","v":"Esterwegen"}]
[1,{"$f":"'Wettkampf 1'!B2","v":"Lorup"},null,{"$f":"G76","v":{"v":425.40000000000003,"d":"425.4"}},{"$f":"IF(H76>4,\"Es sind zu viele Schützen in Wertung!\",\" \")","v":"Es sind zu viele Schützen in Wertung!"},{"$nulls":28},"Wettkampftag:",{"$f":"Übersicht!L3","v":"13.01."}]
[2,{"$f":"'Wettkampf 1'!B3","v":"Sögel"},null,{"$f":"I76","v":{"v":0,"d":"0.0"}},{"$f":"IF(J76>4,\"Es sind zu viele Schützen in Wertung!\",\" \")","v":" "}]
[3,{"$f":"'Wettkampf 1'!B4","v":"Spahnharenstätte"},null,{"$f":"K76","v":225.8},{"$f":"IF(L76>4,\"Es sind zu viele Schützen in Wertung!\",\" \")","v":"Es sind zu viele Schützen in Wertung!"},{"$nulls":30},"Ansprechpartner für Rückfragen:"]
[4,{"$f":"'Wettkampf 1'!B5","v":"Esterwegen"},null,{"$f":"M76","v":522.2},{"$f":"IF(N76>4,\"Es sind zu viele Schützen in Wertung!\",\" \")","v":"Es sind zu viele Schützen in Wertung!"},{"$nulls":28},"Name:","Michael Meibers"]
[5,{"$f":"'Wettkampf 1'!B6","v":"Lähden"},null,{"$f":"O76","v":563.6},{"$f":"IF(P76>4,\"Es sind zu viele Schützen in Wertung!\",\" \")","v":"Es sind zu viele Schützen in Wertung!"},{"$nulls":28},"Tel:"]
[6,{"$f":"'Wettkampf 1'!B7","v":"Börgermoor"},null,{"$f":"Q76","v":{"v":0,"d":"0.0"}},{"$f":"IF(R76>4,\"Es sind zu viele Schützen in Wertung!\",\" \")","v":" "},{"$nulls":28},"Standaufsicht:","Michael Meibers"]
[7,{"$f":"'Wettkampf 1'!B8","v":"Verein VII"},null,{"$f":"S76","v":{"v":0,"d":"0.0"}},{"$f":"IF(T76>4,\"Es sind zu viele Schützen in Wertung!\",\" \")","v":"Es sind zu viele Schützen in Wertung!"}]
[8,{"$f":"'Wettkampf 1'!B9","v":"Verein VIII"},null,{"$f":"U76","v":{"v":0,"d":"0.0"}},{"$f":"IF(V76>4,\"Es sind zu viele Schützen in Wertung!\",\" \")","v":" "}]
[9,{"$f":"'Wettkampf 1'!B10","v":"Verein IX"},null,{"$f":"W76","v":{"v":0,"d":"0.0"}},{"$f":"IF(X76>4,\"Es sind zu viele Schützen in Wertung!\",\" \")","v":"Es sind zu viele Schützen in Wertung!"}]
[10,{"$f":"'Wettkampf 1'!B11","v":"Verein X"},null,{"$f":"Y76","v":{"v":0,"d":"0.0"}},{"$f":"IF(Z76>4,\"Es sind zu viele Schützen in Wertung!\",\" \")","v":"Es sind zu viele Schützen in Wertung!"}]
[11,{"$f":"'Wettkampf 1'!B12","v":"Verein XI"},null,{"$f":"AA76","v":{"v":0,"d":"0.0"}},{"$f":"IF(AB76>4,\"Es sind zu viele Schützen in Wertung!\",\" \")","v":"Es sind zu viele Schützen in Wertung!"}]
[12,{"$f":"'Wettkampf 1'!B13","v":"Verein XII"},null,{"$f":"AC76","v":{"v":0,"d":"0.0"}},{"$f":"IF(AD76>4,\"Es sind zu viele Schützen in Wertung!\",\" \")","v":"Es sind zu viele Schützen in Wertung!"}]
[]
[null,"Einzelergebnisse:","Verein / Gruppe","Ergebnisse (mindestens 0 eintragen)","AW? Dann x eintippen",null,"Verein 1",null,"Verein 2",null,"Verein 3",null,"Verein 4",null,"Verein 5",null,"Verein 6",null,"Verein 7",null,"Verein 8",null,"Verein 9",null,"Verein 10",null,"Verein 11",null,"Verein 12",{"$nulls":3},"Proberechnung bei Streifen:"]
[1,{"$f":"'Wettkampf 1'!B16","v":"Wotte Lia"},{"$f":"'Wettkampf 1'!C16","v":"Lorup"},166.3,null,{"$f":"IF(E16=\"x\",\"0\",D16)","v":166.3},{"$f":"IF(C16=$B$2,F16,0)","v":166.3},{"$f":"(IF(AND($E16=\"\",$C16=$B$2),1,0))","v":1},{"$f":"IF($C16=$B$3,$F16,0)","v":0},{"$f":"(IF(AND($E16=\"\",$C16=$B$3),1,0))","v":0},{"$f":"IF($C16=$B$4,F16,0)","v":0},{"$f":"(IF(AND($E16=\"\",$C16=$B$4),1,0))","v":0},{"$f":"IF($C16=$B$5,F16,0)","v":0},{"$f":"(IF(AND($E16=\"\",$C16=$B$5),1,0))","v":0},{"$f":"IF($C16=$B$6,F16,0)","v":0},{"$f":"(IF(AND($E16=\"\",$C16=$B$6),1,0))","v":0},{"$f":"IF($C16=$B$7,F16,0)","v":0},{"$f":"(IF(AND($E16=\"\",$C16=$B$7),1,0))","v":0},{"$f":"IF($C16=$B$8,$F16,0)","v":0},{"$f":"(IF(AND($E16=\"\",$C16=$B$8),1,0))","v":0},{"$f":"IF($C16=$B$9,$F16,0)","v":0},{"$f":"(IF(AND($E16=\"\",$C16=$B$9),1,0))","v":0},{"$f":"IF($C16=$B$10,$F16,0)","v":0},{"$f":"(IF(AND($E16=\"\",$C16=$B$10),1,0))","v":0},{"$f":"IF($C16=$B$11,$F16,0)","v":0},{"$f":"(IF(AND($E16=\"\",$C16=$B$11),1,0))","v":0},{"$f":"IF($C16=$B$12,$F16,0)","v":0},{"$f":"(IF(AND($E16=\"\",$C16=$B$12),1,0))","v":0},{"$f":"IF($C16=$B$13,$F16,0)","v":0},{"$f":"(IF(AND($E16=\"\",$C16=$B$13),1,0))","v":0},{"$nulls":5},{"$f":"SUM(AG16:AI16)","v":{"v":0,"d":"0.0"}},{"$f":"IF(AJ16=D16,1,0)","v":0},{"$f":"IF(AJ16=0,0,1)","v":0},{"$f":"IF(AK16+AL16=2,\"Korrekt\",\"\")","v":""}]
[2,{"$f":"'Wettkampf 1'!B17","v":"Wotte Hannes"},{"$f":"'Wettkampf 1'!C17","v":"Lorup"},131.3,null,{"$f":"IF(E17=\"x\",\"0\",D17)","v":131.3},{"$f":"IF(C17=$B$2,F17,0)","v":131.3},{"$f":"(IF(AND($E17=\"\",$C17=$B$2),1,0))","v":1},{"$f":"IF($C17=$B$3,F17,0)","v":0},{"$f":"(IF(AND($E17=\"\",$C17=$B$3),1,0))","v":0},{"$f":"IF($C17=$B$4,F17,0)","v":0},{"$f":"(IF(AND($E17=\"\",$C17=$B$4),1,0))","v":0},{"$f":"IF($C17=$B$5,F17,0)","v":0},{"$f":"(IF(AND($E17=\"\",$C17=$B$5),1,0))","v":0},{"$f":"IF($C17=$B$6,F17,0)","v":0},{"$f":"(IF(AND($E17=\"\",$C17=$B$6),1,0))","v":0},{"$f":"IF($C17=$B$7,F17,0)","v":0},{"$f":"(IF(AND($E17=\"\",$C17=$B$7),1,0))","v":0},{"$f":"IF($C17=$B$8,$F17,0)","v":0},{"$f":"(IF(AND($E17=\"\",$C17=$B$8),1,0))","v":0},{"$f":"IF($C17=$B$9,$F17,0)","v":0},{"$f":"(IF(AND($E17=\"\",$C17=$B$9),1,0))","v":0},{"$f":"IF($C17=$B$10,$F17,0)","v":0},{"$f":"(IF(AND($E17=\"\",$C17=$B$10),1,0))","v":0},{"$f":"IF($C17=$B$11,$F17,0)","v":0},{"$f":"(IF(AND($E17=\"\",$C17=$B$11),1,0))","v":0},{"$f":"IF($C17=$B$12,$F17,0)","v":0},{"$f":"(IF(AND($E17=\"\",$C17=$B$12),1,0))","v":0},{"$f":"IF($C17=$B$13,$F17,0)","v":0},{"$f":"(IF(AND($E17=\"\",$C17=$B$13),1,0))","v":0},{"$nulls":5},{"$f":"SUM(AG17:AI17)","v":{"v":0,"d":"0.0"}},{"$f":"IF(AJ17=D17,1,0)","v":0},{"$f":"IF(AJ17=0,0,1)","v":0},{"$f":"IF(AK17+AL17=2,\"Korrekt\",\"\")","v":""}]
[3,{"$f":"'Wettkampf 1'!B18","v":"Gretenabeln Elias"},{"$f":"'Wettkampf 1'!C18","v":"Lorup"},105.2,null,105.2,105.2,1,0,0,0,0,0,0,0,0,0,0,0,0,0,0,0,0,0,0,0,0,0,0,{"$nulls":5},{"v":0,"d":"0.0"},0,0,""]
[4,{"$f":"'Wettkampf 1'!B19","v":"Helmer Maike"},{"$f":"'Wettkampf 1'!C19","v":"Lorup"},127.8,null,127.8,127.8,1,0,0,0,0,0,0,0,0,0,0,0,0,0,0,0,0,0,0,0,0,0,0,{"$nulls":5},{"v":0,"d":"0.0"},0,0,""]
[5,{"$f":"'Wettkampf 1'!B20","v":"Többen Jannes"},{"$f":"'Wettkampf 1'!C20","v":"Lorup"},109.5,"x","0","0",0,0,0,0,0,0,0,0,0,0,0,0,0,0,0,0,0,0,0,0,0,0,0,{"$nulls":5},{"v":0,"d":"0.0"},0,0,""]
[6,{"$f":"'Wettkampf 1'!B21","v":"Lüken Arne"},{"$f":"'Wettkampf 1'!C21","v":"Lorup"},null,null,{"v":0,"d":"0.0"},0,1,0,0,0,0,0,0,0,0,0,0,0,0,0,0,0,0,0,0,0,0,0,0,{"$nulls":5},{"v":0,"d":"0.0"},1,0,""]
[7,{"$f":"'Wettkampf 1'!B22","v":"Schütze 7"},{"$f":"'Wettkampf 1'!C22","v":"Sögel"},null,null,{"v":0,"d":"0.0"},0,0,0,1,0,0,0,0,0,0,0,0,0,0,0,0,0,0,0,0,0,0,0,0,{"$nulls":5},{"v":0,"d":"0.0"},1,0,""]
[8,{"$f":"'Wettkampf 1'!B23","v":"Schütze 8"},{"$f":"'Wettkampf 1'!C23","v":"Sögel"},null,null,{"v":0,"d":"0.0"},0,0,0,1,0,0,0,0,0,0,0,0,0,0,0,0,0,0,0,0,0,0,0,0,{"$nulls":5},{"v":0,"d":"0.0"},1,0,""]
[9,{"$f":"'Wettkampf 1'!B24","v":"Schütze 9"},{"$f":"'Wettkampf 1'!C24","v":"Sögel"},null,null,{"v":0,"d":"0.0"},0,0,0,1,0,0,0,0,0,0,0,0,0,0,0,0,0,0,0,0,0,0,0,0,{"$nulls":5},{"v":0,"d":"0.0"},1,0,""]
[10,{"$f":"'Wettkampf 1'!B25","v":"Schütze 10"},{"$f":"'Wettkampf 1'!C25","v":"Sögel"},null,null,{"v":0,"d":"0.0"},0,0,0,1,0,0,0,0,0,0,0,0,0,0,0,0,0,0,0,0,0,0,0,0,{"$nulls":5},{"v":0,"d":"0.0"},1,0,""]
[11,{"$f":"'Wettkampf 1'!B26","v":"Engbers Hannes"},{"$f":"'Wettkampf 1'!C26","v":"Spahnharenstätte"},{"v":70,"d":"70.0"},null,{"v":70,"d":"70.0"},0,0,0,0,70,1,0,0,0,0,0,0,0,0,0,0,0,0,0,0,0,0,0,0,{"$nulls":5},{"v":0,"d":"0.0"},0,0,""]
[12,{"$f":"'Wettkampf 1'!B27","v":"Runde Marcel"},{"$f":"'Wettkampf 1'!C27","v":"Spahnharenstätte"},155.8,null,155.8,0,0,0,0,155.8,1,0,0,0,0,0,0,0,0,0,0,0,0,0,0,0,0,0,0,{"$nulls":5},{"v":0,"d":"0.0"},0,0,""]
[13,{"$f":"'Wettkampf 1'!B28","v":"Jansen Lars"},{"$f":"'Wettkampf 1'!C28","v":"Spahnharenstätte"},null,null,{"v":0,"d":"0.0"},0,0,0,0,0,1,0,0,0,0,0,0,0,0,0,0,0,0,0,0,0,0,0,0,{"$nulls":5},{"v":0,"d":"0.0"},1,0,""]
[14,{"$f":"'Wettkampf 1'!B29","v":"Schütze 14"},{"$f":"'Wettkampf 1'!C29","v":"Spahnharenstätte"},null,null,{"v":0,"d":"0.0"},0,0,0,0,0,1,0,0,0,0,0,0,0,0,0,0,0,0,0,0,0,0,0,0,{"$nulls":5},{"v":0,"d":"0.0"},1,0,""]
[15,{"$f":"'Wettkampf 1'!B30","v":"Schütze 15"},{"$f":"'Wettkampf 1'!C30","v":"Spahnharenstätte"},null,null,{"v":0,"d":"0.0"},0,0,0,0,0,1,0,0,0,0,0,0,0,0,0,0,0,0,0,0,0,0,0,0,{"$nulls":5},{"v":0,"d":"0.0"},1,0,""]
[16,{"$f":"'Wettkampf 1'!B31","v":"Suhle Annalena"},{"$f":"'Wettkampf 1'!C31","v":"Esterwegen"},185.3,null,185.3,0,0,0,0,0,0,185.3,1,0,0,0,0,0,0,0,0,0,0,0,0,0,0,0,0,{"$nulls":5},{"v":0,"d":"0.0"},0,0,""]
[17,{"$f":"'Wettkampf 1'!B32","v":"Gäken Lena"},{"$f":"'Wettkampf 1'!C32","v":"Esterwegen"},170.4,null,170.4,0,0,0,0,0,0,170.4,1,0,0,0,0,0,0,0,0,0,0,0,0,0,0,0,0,{"$nulls":5},{"v":0,"d":"0.0"},0,0,""]
[18,{"$f":"'Wettkampf 1'!B33","v":"Jansen Daniel"},{"$f":"'Wettkampf 1'!C33","v":"Esterwegen"},166.5,null,166.5,0,0,0,0,0,0,166.5,1,0,0,0,0,0,0,0,0,0,0,0,0,0,0,0,0,{"$nulls":5},{"v":0,"d":"0.0"},0,0,""]
[19,{"$f":"'Wettkampf 1'!B34","v":"Pieper Jonas"},{"$f":"'Wettkampf 1'!C34","v":"Esterwegen"},null,null,{"v":0,"d":"0.0"},0,0,0,0,0,0,0,1,0,0,0,0,0,0,0,0,0,0,0,0,0,0,0,0,{"$nulls":5},{"v":0,"d":"0.0"},1,0,""]
[20,{"$f":"'Wettkampf 1'!B35","v":"Schütze 20"},{"$f":"'Wettkampf 1'!C35","v":"Esterwegen"},null,null,{"v":0,"d":"0.0"},0,0,0,0,0,0,0,1,0,0,0,0,0,0,0,0,0,0,0,0,0,0,0,0,{"$nulls":5},{"v":0,"d":"0.0"},1,0,""]
[21,{"$f":"'Wettkampf 1'!B36","v":"Hellweg Thea"},{"$f":"'Wettkampf 1'!C36","v":"Lähden"},183.8,null,183.8,0,0,0,0,0,0,0,0,183.8,1,0,0,0,0,0,0,0,0,0,0,0,0,0,0,{"$nulls":5},{"v":0,"d":"0.0"},0,0,""]
[22,{"$f":"'Wettkampf 1'!B37","v":"Bruns Henrik"},{"$f":"'Wettkampf 1'!C37","v":"Lähden"},183.9,null,183.9,0,0,0,0,0,0,0,0,183.9,1,0,0,0,0,0,0,0,0,0,0,0,0,0,0,{"$nulls":5},{"v":0,"d":"0.0"},0,0,""]
[23,{"$f":"'Wettkampf 1'!B38","v":"Buschen Johann "},{"$f":"'Wettkampf 1'!C38","v":"Lähden"},195.9,null,195.9,0,0,0,0,0,0,0,0,195.9,1,0,0,0,0,0,0,0,0,0,0,0,0,0,0,{"$nulls":5},{"v":0,"d":"0.0"},0,0,""]
[24,{"$f":"'Wettkampf 1'!B39","v":"Preut Jannis"},{"$f":"'Wettkampf 1'!C39","v":"Lähden"},173.3,"x","0",0,0,0,0,0,0,0,0,"0",0,0,0,0,0,0,0,0,0,0,0,0,0,0,0,{"$nulls":5},{"v":0,"d":"0.0"},0,0,""]
[25,{"$f":"'Wettkampf 1'!B40","v":"Fleschenberg Jana"},{"$f":"'Wettkampf 1'!C40","v":"Lähden"},179.2,null,179.2,0,0,0,0,0,0,0,0,179.2,1,0,0,0,0,0,0,0,0,0,0,0,0,0,0,{"$nulls":5},{"v":0,"d":"0.0"},0,0,""]
[26,{"$f":"'Wettkampf 1'!B41","v":"von Seggern Moritz"},{"$f":"'Wettkampf 1'!C41","v":"Lähden"},{"v":133,"d":"133.0"},"x","0",0,0,0,0,0,0,0,0,"0",0,0,0,0,0,0,0,0,0,0,0,0,0,0,0,{"$nulls":5},{"v":0,"d":"0.0"},0,0,""]
[27,{"$f":"'Wettkampf 1'!B42","v":"Kohnen Saskia"},{"$f":"'Wettkampf 1'!C42","v":"Börgermoor"},null,null,{"v":0,"d":"0.0"},0,0,0,0,0,0,0,0,0,0,0,1,0,0,0,0,0,0,0,0,0,0,0,0,{"$nulls":5},{"v":0,"d":"0.0"},1,0,""]
[28,{"$f":"'Wettkampf 1'!B43","v":"Niemann Paul"},{"$f":"'Wettkampf 1'!C43","v":"Börgermoor"},null,null,{"v":0,"d":"0.0"},0,0,0,0,0,0,0,0,0,0,0,1,0,0,0,0,0,0,0,0,0,0,0,0,{"$nulls":5},{"v":0,"d":"0.0"},1,0,""]
[29,{"$f":"'Wettkampf 1'!B44","v":"Schütze 29"},{"$f":"'Wettkampf 1'!C44","v":"Börgermoor"},null,null,{"v":0,"d":"0.0"},0,0,0,0,0,0,0,0,0,0,0,1,0,0,0,0,0,0,0,0,0,0,0,0,{"$nulls":5},{"v":0,"d":"0.0"},1,0,""]
[30,{"$f":"'Wettkampf 1'!B45","v":"Schütze 30"},{"$f":"'Wettkampf 1'!C45","v":"Börgermoor"},null,null,{"v":0,"d":"0.0"},0,0,0,0,0,0,0,0,0,0,0,1,0,0,0,0,0,0,0,0,0,0,0,0,{"$nulls":5},{"v":0,"d":"0.0"},1,0,""]
[31,{"$f":"'Wettkampf 1'!B46","v":"Stümpler Jan Luka "},{"$f":"'Wettkampf 1'!C46","v":"Lähden"},null,null,{"v":0,"d":"0.0"},0,0,0,0,0,0,0,0,0,1,0,0,0,0,0,0,0,0,0,0,0,0,0,0,{"$nulls":5},{"v":0,"d":"0.0"},1,0,""]
[32,{"$f":"'Wettkampf 1'!B47","v":"Helmer, Nils"},{"$f":"'Wettkampf 1'!C47","v":"Lorup"},null,null,{"v":0,"d":"0.0"},0,1,0,0,0,0,0,0,0,0,0,0,0,0,0,0,0,0,0,0,0,0,0,0,{"$nulls":5},{"v":0,"d":"0.0"},1,0,""]
[33,{"$f":"'Wettkampf 1'!B48","v":"Schütze 33"},{"$f":"'Wettkampf 1'!C48","v":"Verein VII"},null,null,{"v":0,"d":"0.0"},0,0,0,0,0,0,0,0,0,0,0,0,0,1,0,0,0,0,0,0,0,0,0,0,{"$nulls":5},{"v":0,"d":"0.0"},1,0,""]
[34,{"$f":"'Wettkampf 1'!B49","v":"Schütze 34"},{"$f":"'Wettkampf 1'!C49","v":"Verein VII"},null,null,{"v":0,"d":"0.0"},0,0,0,0,0,0,0,0,0,0,0,0,0,1,0,0,0,0,0,0,0,0,0,0,{"$nulls":5},{"v":0,"d":"0.0"},1,0,""]
[35,{"$f":"'Wettkampf 1'!B50","v":"Schütze 35"},{"$f":"'Wettkampf 1'!C50","v":"Verein VII"},null,null,{"v":0,"d":"0.0"},0,0,0,0,0,0,0,0,0,0,0,0,0,1,0,0,0,0,0,0,0,0,0,0,{"$nulls":5},{"v":0,"d":"0.0"},1,0,""]
[36,{"$f":"'Wettkampf 1'!B51","v":"Schütze 36"},{"$f":"'Wettkampf 1'!C51","v":"Verein VII"},null,null,{"v":0,"d":"0.0"},0,0,0,0,0,0,0,0,0,0,0,0,0,1,0,0,0,0,0,0,0,0,0,0,{"$nulls":5},{"v":0,"d":"0.0"},1,0,""]
[37,{"$f":"'Wettkampf 1'!B52","v":"Schütze 37"},{"$f":"'Wettkampf 1'!C52","v":"Verein VII"},null,null,{"v":0,"d":"0.0"},0,0,0,0,0,0,0,0,0,0,0,0,0,1,0,0,0,0,0,0,0,0,0,0,{"$nulls":5},{"v":0,"d":"0.0"}]
[38,{"$f":"'Wettkampf 1'!B53","v":"Schütze 38"},{"$f":"'Wettkampf 1'!C53","v":"Verein VIII"},null,null,{"v":0,"d":"0.0"},0,0,0,0,0,0,0,0,0,0,0,0,0,0,0,1,0,0,0,0,0,0,0,0,{"$nulls":5},{"v":0,"d":"0.0"}]
[39,{"$f":"'Wettkampf 1'!B54","v":"Schütze 39"},{"$f":"'Wettkampf 1'!C54","v":"Verein VIII"},null,null,{"v":0,"d":"0.0"},0,0,0,0,0,0,0,0,0,0,0,0,{"$f":"IF($C54=$B$8,$F54,0)","v":0},{"$f":"(IF(AND($E54=\"\",$C54=$B$8),1,0))","v":0},{"$f":"IF($C54=$B$9,$F54,0)","v":0},{"$f":"(IF(AND($E54=\"\",$C54=$B$9),1,0))","v":1},{"$f":"IF($C54=$B$10,$F54,0)","v":0},{"$f":"(IF(AND($E54=\"\",$C54=$B$10),1,0))","v":0},{"$f":"IF($C54=$B$11,$F54,0)","v":0},{"$f":"(IF(AND($E54=\"\",$C54=$B$11),1,0))","v":0},{"$f":"IF($C54=$B$12,$F54,0)","v":0},{"$f":"(IF(AND($E54=\"\",$C54=$B$12),1,0))","v":0},{"$f":"IF($C54=$B$13,$F54,0)","v":0},{"$f":"(IF(AND($E54=\"\",$C54=$B$13),1,0))","v":0},{"$nulls":5},{"v":0,"d":"0.0"}]
[40,{"$f":"'Wettkampf 1'!B55","v":"Schütze 40"},{"$f":"'Wettkampf 1'!C55","v":"Verein VIII"},null,null,{"v":0,"d":"0.0"},0,0,0,0,0,0,0,0,0,0,0,0,0,0,0,1,0,0,0,0,0,0,0,0,{"$nulls":5},{"v":0,"d":"0.0"}]
[41,{"$f":"'Wettkampf 1'!B56","v":"Schütze 41"},{"$f":"'Wettkampf 1'!C56","v":"Verein IX"},null,null,{"v":0,"d":"0.0"},0,0,0,0,0,0,0,0,0,0,0,0,0,0,0,0,0,1,0,0,0,0,0,0,{"$nulls":5},{"v":0,"d":"0.0"}]
[42,{"$f":"'Wettkampf 1'!B57","v":"Schütze 42"},{"$f":"'Wettkampf 1'!C57","v":"Verein IX"},null,null,{"v":0,"d":"0.0"},0,0,0,0,0,0,0,0,0,0,0,0,0,0,0,0,0,1,0,0,0,0,0,0,{"$nulls":5},{"v":0,"d":"0.0"}]
[43,{"$f":"'Wettkampf 1'!B58","v":"Schütze 43"},{"$f":"'Wettkampf 1'!C58","v":"Verein IX"},null,null,{"v":0,"d":"0.0"},0,0,0,0,0,0,0,0,0,0,0,0,0,0,0,0,0,1,0,0,0,0,0,0,{"$nulls":5},{"v":0,"d":"0.0"}]
[44,{"$f":"'Wettkampf 1'!B59","v":"Schütze 44"},{"$f":"'Wettkampf 1'!C59","v":"Verein IX"},null,null,{"v":0,"d":"0.0"},0,0,0,0,0,0,0,0,0,0,0,0,0,0,0,0,0,1,0,0,0,0,0,0,{"$nulls":5},{"v":0,"d":"0.0"}]
[45,{"$f":"'Wettkampf 1'!B60","v":"Schütze 45"},{"$f":"'Wettkampf 1'!C60","v":"Verein IX"},null,null,{"v":0,"d":"0.0"},0,0,0,0,0,0,0,0,0,0,0,0,0,0,0,0,0,1,0,0,0,0,0,0,{"$nulls":5},{"v":0,"d":"0.0"}]
[46,{"$f":"'Wettkampf 1'!B61","v":"Schütze 46"},{"$f":"'Wettkampf 1'!C61","v":"Verein X"},null,null,{"v":0,"d":"0.0"},0,0,0,0,0,0,0,0,0,0,0,0,0,0,0,0,0,0,0,1,0,0,0,0,{"$nulls":5},{"v":0,"d":"0.0"}]
[47,{"$f":"'Wettkampf 1'!B62","v":"Schütze 47"},{"$f":"'Wettkampf 1'!C62","v":"Verein X"},null,null,{"v":0,"d":"0.0"},0,0,0,0,0,0,0,0,0,0,0,0,0,0,0,0,0,0,0,1,0,0,0,0,{"$nulls":5},{"v":0,"d":"0.0"}]
[48,{"$f":"'Wettkampf 1'!B63","v":"Schütze 48"},{"$f":"'Wettkampf 1'!C63","v":"Verein X"},null,null,{"v":0,"d":"0.0"},0,0,0,0,0,0,0,0,0,0,0,0,0,0,0,0,0,0,0,1,0,0,0,0,{"$nulls":5},{"v":0,"d":"0.0"}]
[49,{"$f":"'Wettkampf 1'!B64","v":"Schütze 49"},{"$f":"'Wettkampf 1'!C64","v":"Verein X"},null,null,{"v":0,"d":"0.0"},0,0,0,0,0,0,0,0,0,0,0,0,0,0,0,0,0,0,0,1,0,0,0,0,{"$nulls":5},{"v":0,"d":"0.0"}]
[50,{"$f":"'Wettkampf 1'!B65","v":"Schütze 50"},{"$f":"'Wettkampf 1'!C65","v":"Verein X"},null,null,{"v":0,"d":"0.0"},0,0,0,0,0,0,0,0,0,0,0,0,0,0,0,0,0,0,0,1,0,0,0,0,{"$nulls":5},{"v":0,"d":"0.0"}]
[51,{"$f":"'Wettkampf 1'!B66","v":"Schütze 51"},{"$f":"'Wettkampf 1'!C66","v":"Verein XI"},null,null,{"v":0,"d":"0.0"},0,0,0,0,0,0,0,0,0,0,0,0,0,0,0,0,0,0,0,0,0,1,0,0,{"$nulls":5},{"v":0,"d":"0.0"}]
[52,{"$f":"'Wettkampf 1'!B67","v":"Schütze 52"},{"$f":"'Wettkampf 1'!C67","v":"Verein XI"},null,null,{"v":0,"d":"0.0"},0,0,0,0,0,0,0,0,0,0,0,0,0,0,0,0,0,0,0,0,0,1,0,0,{"$nulls":5},{"v":0,"d":"0.0"}]
[53,{"$f":"'Wettkampf 1'!B68","v":"Schütze 53"},{"$f":"'Wettkampf 1'!C68","v":"Verein XI"},null,null,{"v":0,"d":"0.0"},0,0,0,0,0,0,0,0,0,0,0,0,0,0,0,0,0,0,0,0,0,1,0,0,{"$nulls":5},{"v":0,"d":"0.0"}]
[54,{"$f":"'Wettkampf 1'!B69","v":"Schütze 54"},{"$f":"'Wettkampf 1'!C69","v":"Verein XI"},null,null,{"v":0,"d":"0.0"},0,0,0,0,0,0,0,0,0,0,0,0,0,0,0,0,0,0,0,0,0,1,0,0,{"$nulls":5},{"v":0,"d":"0.0"}]
[55,{"$f":"'Wettkampf 1'!B70","v":"Schütze 55"},{"$f":"'Wettkampf 1'!C70","v":"Verein XI"},null,null,{"v":0,"d":"0.0"},0,0,0,0,0,0,0,0,0,0,0,0,0,0,0,0,0,0,0,0,0,1,0,0,{"$nulls":5},{"v":0,"d":"0.0"}]
[56,{"$f":"'Wettkampf 1'!B71","v":"Schütze 56"},{"$f":"'Wettkampf 1'!C71","v":"Verein XII"},null,null,{"v":0,"d":"0.0"},0,0,0,0,0,0,0,0,0,0,0,0,0,0,0,0,0,0,0,0,0,0,0,1,{"$nulls":5},{"v":0,"d":"0.0"}]
[57,{"$f":"'Wettkampf 1'!B72","v":"Schütze 57"},{"$f":"'Wettkampf 1'!C72","v":"Verein XII"},null,null,{"v":0,"d":"0.0"},0,0,0,0,0,0,0,0,0,0,0,0,0,0,0,0,0,0,0,0,0,0,0,1,{"$nulls":5},{"v":0,"d":"0.0"}]
[58,{"$f":"'Wettkampf 1'!B73","v":"Schütze 58"},{"$f":"'Wettkampf 1'!C73","v":"Verein XII"},null,null,{"v":0,"d":"0.0"},0,0,0,0,0,0,0,0,0,0,0,0,0,0,0,0,0,0,0,0,0,0,0,1,{"$nulls":5},{"v":0,"d":"0.0"}]
[59,{"$f":"'Wettkampf 1'!B74","v":"Schütze 59"},{"$f":"'Wettkampf 1'!C74","v":"Verein XII"},null,null,{"v":0,"d":"0.0"},0,0,0,0,0,0,0,0,0,0,0,0,0,0,0,0,0,0,0,0,0,0,0,1,{"$nulls":5},{"v":0,"d":"0.0"}]
[60,{"$f":"'Wettkampf 1'!B75","v":"Schütze 60"},{"$f":"'Wettkampf 1'!C75","v":"Verein XII"},null,null,{"v":0,"d":"0.0"},0,0,0,0,0,0,0,0,0,0,0,0,0,0,0,0,0,0,0,0,0,0,0,1,{"$nulls":5},{"v":0,"d":"0.0"}]
[{"$nulls":6},{"$f":"LARGE(G16:G75,1)+LARGE(G16:G75,2)+LARGE(G16:G75,3)","v":425.40000000000003},{"$f":"SUM(H16:H75)","v":6},{"$f":"LARGE(I16:I75,1)+LARGE(I16:I75,2)+LARGE(I16:I75,3)","v":0},{"$f":"SUM(J16:J75)","v":4},{"$f":"LARGE(K16:K75,1)+LARGE(K16:K75,2)+LARGE(K16:K75,3)","v":225.8},{"$f":"SUM(L16:L75)","v":5},{"$f":"LARGE(M16:M75,1)+LARGE(M16:M75,2)+LARGE(M16:M75,3)","v":522.2},{"$f":"SUM(N16:N75)","v":5},{"$f":"LARGE(O16:O75,1)+LARGE(O16:O75,2)+LARGE(O16:O75,3)","v":563.6},{"$f":"SUM(P16:P75)","v":5},{"$f":"LARGE(Q16:Q75,1)+LARGE(Q16:Q75,2)+LARGE(Q16:Q75,3)","v":0},{"$f":"SUM(R16:R75)","v":4},{"$f":"LARGE(S16:S75,1)+LARGE(S16:S75,2)+LARGE(S16:S75,3)","v":0},{"$f":"SUM(T16:T75)","v":5},{"$f":"LARGE(U16:U75,1)+LARGE(U16:U75,2)+LARGE(U16:U75,3)","v":0},{"$f":"SUM(V16:V75)","v":3},{"$f":"LARGE(W16:W75,1)+LARGE(W16:W75,2)+LARGE(W16:W75,3)","v":0},{"$f":"SUM(X16:X75)","v":5},{"$f":"LARGE(Y16:Y75,1)+LARGE(Y16:Y75,2)+LARGE(Y16:Y75,3)","v":0},{"$f":"SUM(Z16:Z75)","v":5},{"$f":"LARGE(AA16:AA75,1)+LARGE(AA16:AA75,2)+LARGE(AA16:AA75,3)","v":0},{"$f":"SUM(AB16:AB75)","v":5},{"$f":"LARGE(AC16:AC75,1)+LARGE(AC16:AC75,2)+LARGE(AC16:AC75,3)","v":0},{"$f":"SUM(AD16:AD75)","v":5}]
[null,null,"per Email an: sk-huemmling@gmx.de"]

{"sheet":"8","index":8,"n_rows":77,"n_cols":39,"rows_kept":77,"merged":[[0,34,0,35],[1,34,1,35],[4,34,4,35],[5,34,5,35],[6,34,6,35],[14,32,14,35]]}
[null,"Verein / Gruppe",null,"Ergebnisse",{"$nulls":29},"Austragungsort:",{"$f":"Übersicht!M4","v":"Lähden"}]
[1,{"$f":"'Wettkampf 1'!B2","v":"Lorup"},null,{"$f":"G76","v":{"v":444.20000000000005,"d":"444.2"}},{"$f":"IF(H76>4,\"Es sind zu viele Schützen in Wertung!\",\" \")","v":"Es sind zu viele Schützen in Wertung!"},{"$nulls":28},"Wettkampftag:",{"$f":"Übersicht!M3","v":"03.02."}]
[2,{"$f":"'Wettkampf 1'!B3","v":"Sögel"},null,{"$f":"I76","v":{"v":0,"d":"0.0"}},{"$f":"IF(J76>4,\"Es sind zu viele Schützen in Wertung!\",\" \")","v":" "}]
[3,{"$f":"'Wettkampf 1'!B4","v":"Spahnharenstätte"},null,{"$f":"K76","v":361.5},{"$f":"IF(L76>4,\"Es sind zu viele Schützen in Wertung!\",\" \")","v":"Es sind zu viele Schützen in Wertung!"},{"$nulls":30},"Ansprechpartner für Rückfragen:"]
[4,{"$f":"'Wettkampf 1'!B5","v":"Esterwegen"},null,{"$f":"M76","v":522.9},{"$f":"IF(N76>4,\"Es sind zu viele Schützen in Wertung!\",\" \")","v":"Es sind zu viele Schützen in Wertung!"},{"$nulls":28},"Name:"]
[5,{"$f":"'Wettkampf 1'!B6","v":"Lähden"},null,{"$f":"O76","v":551.9},{"$f":"IF(P76>4,\"Es sind zu viele Schützen in Wertung!\",\" \")","v":"Es sind zu viele Schützen in Wertung!"},{"$nulls":28},"Tel:"]
[6,{"$f":"'Wettkampf 1'!B7","v":"Börgermoor"},null,{"$f":"Q76","v":145.7},{"$f":"IF(R76>4,\"Es sind zu viele Schützen in Wertung!\",\" \")","v":" "},{"$nulls":28},"Standaufsicht:","Hendrik Merschendorf"]
[7,{"$f":"'Wettkampf 1'!B8","v":"Verein VII"},null,{"$f":"S76","v":{"v":0,"d":"0.0"}},{"$f":"IF(T76>4,\"Es sind zu viele Schützen in Wertung!\",\" \")","v":"Es sind zu viele Schützen in Wertung!"}]
[8,{"$f":"'Wettkampf 1'!B9","v":"Verein VIII"},null,{"$f":"U76","v":{"v":0,"d":"0.0"}},{"$f":"IF(V76>4,\"Es sind zu viele Schützen in Wertung!\",\" \")","v":" "}]
[9,{"$f":"'Wettkampf 1'!B10","v":"Verein IX"},null,{"$f":"W76","v":{"v":0,"d":"0.0"}},{"$f":"IF(X76>4,\"Es sind zu viele Schützen in Wertung!\",\" \")","v":"Es sind zu viele Schützen in Wertung!"}]
[10,{"$f":"'Wettkampf 1'!B11","v":"Verein X"},null,{"$f":"Y76","v":{"v":0,"d":"0.0"}},{"$f":"IF(Z76>4,\"Es sind zu viele Schützen in Wertung!\",\" \")","v":"Es sind zu viele Schützen in Wertung!"}]
[11,{"$f":"'Wettkampf 1'!B12","v":"Verein XI"},null,{"$f":"AA76","v":{"v":0,"d":"0.0"}},{"$f":"IF(AB76>4,\"Es sind zu viele Schützen in Wertung!\",\" \")","v":"Es sind zu viele Schützen in Wertung!"}]
[12,{"$f":"'Wettkampf 1'!B13","v":"Verein XII"},null,{"$f":"AC76","v":{"v":0,"d":"0.0"}},{"$f":"IF(AD76>4,\"Es sind zu viele Schützen in Wertung!\",\" \")","v":"Es sind zu viele Schützen in Wertung!"}]
[]
[null,"Einzelergebnisse:","Verein / Gruppe","Ergebnisse (mindestens 0 eintragen)","AW? Dann x eintippen",null,"Verein 1",null,"Verein 2",null,"Verein 3",null,"Verein 4",null,"Verein 5",null,"Verein 6",null,"Verein 7",null,"Verein 8",null,"Verein 9",null,"Verein 10",null,"Verein 11",null,"Verein 12",{"$nulls":3},"Proberechnung bei Streifen:"]
[1,{"$f":"'Wettkampf 1'!B16","v":"Wotte Lia"},{"$f":"'Wettkampf 1'!C16","v":"Lorup"},168.8,null,{"$f":"IF(E16=\"x\",\"0\",D16)","v":168.8},{"$f":"IF(C16=$B$2,F16,0)","v":168.8},{"$f":"(IF(AND($E16=\"\",$C16=$B$2),1,0))","v":1},{"$f":"IF($C16=$B$3,$F16,0)","v":0},{"$f":"(IF(AND($E16=\"\",$C16=$B$3),1,0))","v":0},{"$f":"IF($C16=$B$4,F16,0)","v":0},{"$f":"(IF(AND($E16=\"\",$C16=$B$4),1,0))","v":0},{"$f":"IF($C16=$B$5,F16,0)","v":0},{"$f":"(IF(AND($E16=\"\",$C16=$B$5),1,0))","v":0},{"$f":"IF($C16=$B$6,F16,0)","v":0},{"$f":"(IF(AND($E16=\"\",$C16=$B$6),1,0))","v":0},{"$f":"IF($C16=$B$7,F16,0)","v":0},{"$f":"(IF(AND($E16=\"\",$C16=$B$7),1,0))","v":0},{"$f":"IF($C16=$B$8,$F16,0)","v":0},{"$f":"(IF(AND($E16=\"\",$C16=$B$8),1,0))","v":0},{"$f":"IF($C16=$B$9,$F16,0)","v":0},{"$f":"(IF(AND($E16=\"\",$C16=$B$9),1,0))","v":0},{"$f":"IF($C16=$B$10,$F16,0)","v":0},{"$f":"(IF(AND($E16=\"\",$C16=$B$10),1,0))","v":0},{"$f":"IF($C16=$B$11,$F16,0)","v":0},{"$f":"(IF(AND($E16=\"\",$C16=$B$11),1,0))","v":0},{"$f":"IF($C16=$B$12,$F16,0)","v":0},{"$f":"(IF(AND($E16=\"\",$C16=$B$12),1,0))","v":0},{"$f":"IF($C16=$B$13,$F16,0)","v":0},{"$f":"(IF(AND($E16=\"\",$C16=$B$13),1,0))","v":0},{"$nulls":5},{"$f":"SUM(AG16:AI16)","v":{"v":0,"d":"0.0"}},{"$f":"IF(AJ16=D16,1,0)","v":0},{"$f":"IF(AJ16=0,0,1)","v":0},{"$f":"IF(AK16+AL16=2,\"Korrekt\",\"\")","v":""}]
[2,{"$f":"'Wettkampf 1'!B17","v":"Wotte Hannes"},{"$f":"'Wettkampf 1'!C17","v":"Lorup"},135.9,null,{"$f":"IF(E17=\"x\",\"0\",D17)","v":135.9},{"$f":"IF(C17=$B$2,F17,0)","v":135.9},{"$f":"(IF(AND($E17=\"\",$C17=$B$2),1,0))","v":1},{"$f":"IF($C17=$B$3,F17,0)","v":0},{"$f":"(IF(AND($E17=\"\",$C17=$B$3),1,0))","v":0},{"$f":"IF($C17=$B$4,F17,0)","v":0},{"$f":"(IF(AND($E17=\"\",$C17=$B$4),1,0))","v":0},{"$f":"IF($C17=$B$5,F17,0)","v":0},{"$f":"(IF(AND($E17=\"\",$C17=$B$5),1,0))","v":0},{"$f":"IF($C17=$B$6,F17,0)","v":0},{"$f":"(IF(AND($E17=\"\",$C17=$B$6),1,0))","v":0},{"$f":"IF($C17=$B$7,F17,0)","v":0},{"$f":"(IF(AND($E17=\"\",$C17=$B$7),1,0))","v":0},{"$f":"IF($C17=$B$8,$F17,0)","v":0},{"$f":"(IF(AND($E17=\"\",$C17=$B$8),1,0))","v":0},{"$f":"IF($C17=$B$9,$F17,0)","v":0},{"$f":"(IF(AND($E17=\"\",$C17=$B$9),1,0))","v":0},{"$f":"IF($C17=$B$10,$F17,0)","v":0},{"$f":"(IF(AND($E17=\"\",$C17=$B$10),1,0))","v":0},{"$f":"IF($C17=$B$11,$F17,0)","v":0},{"$f":"(IF(AND($E17=\"\",$C17=$B$11),1,0))","v":0},{"$f":"IF($C17=$B$12,$F17,0)","v":0},{"$f":"(IF(AND($E17=\"\",$C17=$B$12),1,0))","v":0},{"$f":"IF($C17=$B$13,$F17,0)","v":0},{"$f":"(IF(AND($E17=\"\",$C17=$B$13),1,0))","v":0},{"$nulls":5},{"$f":"SUM(AG17:AI17)","v":{"v":0,"d":"0.0"}},{"$f":"IF(AJ17=D17,1,0)","v":0},{"$f":"IF(AJ17=0,0,1)","v":0},{"$f":"IF(AK17+AL17=2,\"Korrekt\",\"\")","v":""}]
[3,{"$f":"'Wettkampf 1'!B18","v":"Gretenabeln Elias"},{"$f":"'Wettkampf 1'!C18","v":"Lorup"},117.5,null,117.5,117.5,1,0,0,0,0,0,0,0,0,0,0,0,0,0,0,0,0,0,0,0,0,0,0,{"$nulls":5},{"v":0,"d":"0.0"},0,0,""]
[4,{"$f":"'Wettkampf 1'!B19","v":"Helmer Maike"},{"$f":"'Wettkampf 1'!C19","v":"Lorup"},139.5,null,139.5,139.5,1,0,0,0,0,0,0,0,0,0,0,0,0,0,0,0,0,0,0,0,0,0,0,{"$nulls":5},{"v":0,"d":"0.0"},0,0,""]
[5,{"$f":"'Wettkampf 1'!B20","v":"Többen Jannes"},{"$f":"'Wettkampf 1'!C20","v":"Lorup"},125.6,"x","0","0",0,0,0,0,0,0,0,0,0,0,0,0,0,0,0,0,0,0,0,0,0,0,0,{"$nulls":5},{"v":0,"d":"0.0"},0,0,""]
[6,{"$f":"'Wettkampf 1'!B21","v":"Lüken Arne"},{"$f":"'Wettkampf 1'!C21","v":"Lorup"},null,null,{"v":0,"d":"0.0"},0,1,0,0,0,0,0,0,0,0,0,0,0,0,0,0,0,0,0,0,0,0,0,0,{"$nulls":5},{"v":0,"d":"0.0"},1,0,""]
[7,{"$f":"'Wettkampf 1'!B22","v":"Schütze 7"},{"$f":"'Wettkampf 1'!C22","v":"Sögel"},null,null,{"v":0,"d":"0.0"},0,0,0,1,0,0,0,0,0,0,0,0,0,0,0,0,0,0,0,0,0,0,0,0,{"$nulls":5},{"v":0,"d":"0.0"},1,0,""]
[8,{"$f":"'Wettkampf 1'!B23","v":"Schütze 8"},{"$f":"'Wettkampf 1'!C23","v":"Sögel"},null,null,{"v":0,"d":"0.0"},0,0,0,1,0,0,0,0,0,0,0,0,0,0,0,0,0,0,0,0,0,0,0,0,{"$nulls":5},{"v":0,"d":"0.0"},1,0,""]
[9,{"$f":"'Wettkampf 1'!B24","v":"Schütze 9"},{"$f":"'Wettkampf 1'!C24","v":"Sögel"},null,null,{"v":0,"d":"0.0"},0,0,0,1,0,0,0,0,0,0,0,0,0,0,0,0,0,0,0,0,0,0,0,0,{"$nulls":5},{"v":0,"d":"0.0"},1,0,""]
[10,{"$f":"'Wettkampf 1'!B25","v":"Schütze 10"},{"$f":"'Wettkampf 1'!C25","v":"Sögel"},null,null,{"v":0,"d":"0.0"},0,0,0,1,0,0,0,0,0,0,0,0,0,0,0,0,0,0,0,0,0,0,0,0,{"$nulls":5},{"v":0,"d":"0.0"},1,0,""]
[11,{"$f":"'Wettkampf 1'!B26","v":"Engbers Hannes"},{"$f":"'Wettkampf 1'!C26","v":"Spahnharenstätte"},88.4,null,88.4,0,0,0,0,88.4,1,0,0,0,0,0,0,0,0,0,0,0,0,0,0,0,0,0,0,{"$nulls":5},{"v":0,"d":"0.0"},0,0,""]
[12,{"$f":"'Wettkampf 1'!B27","v":"Runde Marcel"},{"$f":"'Wettkampf 1'!C27","v":"Spahnharenstätte"},151.2,null,151.2,0,0,0,0,151.2,1,0,0,0,0,0,0,0,0,0,0,0,0,0,0,0,0,0,0,{"$nulls":5},{"v":0,"d":"0.0"},0,0,""]
[13,{"$f":"'Wettkampf 1'!B28","v":"Jansen Lars"},{"$f":"'Wettkampf 1'!C28","v":"Spahnharenstätte"},121.9,null,121.9,0,0,0,0,121.9,1,0,0,0,0,0,0,0,0,0,0,0,0,0,0,0,0,0,0,{"$nulls":5},{"v":0,"d":"0.0"},0,0,""]
[14,{"$f":"'Wettkampf 1'!B29","v":"Schütze 14"},{"$f":"'Wettkampf 1'!C29","v":"Spahnharenstätte"},null,null,{"v":0,"d":"0.0"},0,0,0,0,0,1,0,0,0,0,0,0,0,0,0,0,0,0,0,0,0,0,0,0,{"$nulls":5},{"v":0,"d":"0.0"},1,0,""]
[15,{"$f":"'Wettkampf 1'!B30","v":"Schütze 15"},{"$f":"'Wettkampf 1'!C30","v":"Spahnharenstätte"},null,null,{"v":0,"d":"0.0"},0,0,0,0,0,1,0,0,0,0,0,0,0,0,0,0,0,0,0,0,0,0,0,0,{"$nulls":5},{"v":0,"d":"0.0"},1,0,""]
[16,{"$f":"'Wettkampf 1'!B31","v":"Suhle Annalena"},{"$f":"'Wettkampf 1'!C31","v":"Esterwegen"},190.5,null,190.5,0,0,0,0,0,0,190.5,1,0,0,0,0,0,0,0,0,0,0,0,0,0,0,0,0,{"$nulls":5},{"v":0,"d":"0.0"},0,0,""]
[17,{"$f":"'Wettkampf 1'!B32","v":"Gäken Lena"},{"$f":"'Wettkampf 1'!C32","v":"Esterwegen"},184.7,null,184.7,0,0,0,0,0,0,184.7,1,0,0,0,0,0,0,0,0,0,0,0,0,0,0,0,0,{"$nulls":5},{"v":0,"d":"0.0"},0,0,""]
[18,{"$f":"'Wettkampf 1'!B33","v":"Jansen Daniel"},{"$f":"'Wettkampf 1'!C33","v":"Esterwegen"},126.8,null,126.8,0,0,0,0,0,0,126.8,1,0,0,0,0,0,0,0,0,0,0,0,0,0,0,0,0,{"$nulls":5},{"v":0,"d":"0.0"},0,0,""]
[19,{"$f":"'Wettkampf 1'!B34","v":"Pieper Jonas"},{"$f":"'Wettkampf 1'!C34","v":"Esterwegen"},147.7,null,147.7,0,0,0,0,0,0,147.7,1,0,0,0,0,0,0,0,0,0,0,0,0,0,0,0,0,{"$nulls":5},{"v":0,"d":"0.0"},0,0,""]
[20,{"$f":"'Wettkampf 1'!B35","v":"Schütze 20"},{"$f":"'Wettkampf 1'!C35","v":"Esterwegen"},null,null,{"v":0,"d":"0.0"},0,0,0,0,0,0,0,1,0,0,0,0,0,0,0,0,0,0,0,0,0,0,0,0,{"$nulls":5},{"v":0,"d":"0.0"},1,0,""]
[21,{"$f":"'Wettkampf 1'!B36","v":"Hellweg Thea"},{"$f":"'Wettkampf 1'!C36","v":"Lähden"},180.4,null,180.4,0,0,0,0,0,0,0,0,180.4,1,0,0,0,0,0,0,0,0,0,0,0,0,0,0,{"$nulls":5},{"v":0,"d":"0.0"},0,0,""]
[22,{"$f":"'Wettkampf 1'!B37","v":"Bruns Henrik"},{"$f":"'Wettkampf 1'!C37","v":"Lähden"},179.1,null,179.1,0,0,0,0,0,0,0,0,179.1,1,0,0,0,0,0,0,0,0,0,0,0,0,0,0,{"$nulls":5},{"v":0,"d":"0.0"},0,0,""]
[23,{"$f":"'Wettkampf 1'!B38","v":"Buschen Johann "},{"$f":"'Wettkampf 1'!C38","v":"Lähden"},179.6,null,179.6,0,0,0,0,0,0,0,0,179.6,1,0,0,0,0,0,0,0,0,0,0,0,0,0,0,{"$nulls":5},{"v":0,"d":"0.0"},0,0,""]
[24,{"$f":"'Wettkampf 1'!B39","v":"Preut Jannis"},{"$f":"'Wettkampf 1'!C39","v":"Lähden"},166.4,"x","0",0,0,0,0,0,0,0,0,"0",0,0,0,0,0,0,0,0,0,0,0,0,0,0,0,{"$nulls":5},{"v":0,"d":"0.0"},0,0,""]
[25,{"$f":"'Wettkampf 1'!B40","v":"Fleschenberg Jana"},{"$f":"'Wettkampf 1'!C40","v":"Lähden"},191.9,null,191.9,0,0,0,0,0,0,0,0,191.9,1,0,0,0,0,0,0,0,0,0,0,0,0,0,0,{"$nulls":5},{"v":0,"d":"0.0"},0,0,""]
[26,{"$f":"'Wettkampf 1'!B41","v":"von Seggern Moritz"},{"$f":"'Wettkampf 1'!C41","v":"Lähden"},152.4,"x","0",0,0,0,0,0,0,0,0,"0",0,0,0,0,0,0,0,0,0,0,0,0,0,0,0,{"$nulls":5},{"v":0,"d":"0.0"},0,0,""]
[27,{"$f":"'Wettkampf 1'!B42","v":"Kohnen Saskia"},{"$f":"'Wettkampf 1'!C42","v":"Börgermoor"},145.7,null,145.7,0,0,0,0,0,0,0,0,0,0,145.7,1,0,0,0,0,0,0,0,0,0,0,0,0,{"$nulls":5},{"v":0,"d":"0.0"},0,0,""]
[28,{"$f":"'Wettkampf 1'!B43","v":"Niemann Paul"},{"$f":"'Wettkampf 1'!C43","v":"Börgermoor"},null,null,{"v":0,"d":"0.0"},0,0,0,0,0,0,0,0,0,0,0,1,0,0,0,0,0,0,0,0,0,0,0,0,{"$nulls":5},{"v":0,"d":"0.0"},1,0,""]
[29,{"$f":"'Wettkampf 1'!B44","v":"Schütze 29"},{"$f":"'Wettkampf 1'!C44","v":"Börgermoor"},null,null,{"v":0,"d":"0.0"},0,0,0,0,0,0,0,0,0,0,0,1,0,0,0,0,0,0,0,0,0,0,0,0,{"$nulls":5},{"v":0,"d":"0.0"},1,0,""]
[30,{"$f":"'Wettkampf 1'!B45","v":"Schütze 30"},{"$f":"'Wettkampf 1'!C45","v":"Börgermoor"},null,null,{"v":0,"d":"0.0"},0,0,0,0,0,0,0,0,0,0,0,1,0,0,0,0,0,0,0,0,0,0,0,0,{"$nulls":5},{"v":0,"d":"0.0"},1,0,""]
[31,{"$f":"'Wettkampf 1'!B46","v":"Stümpler Jan Luka "},{"$f":"'Wettkampf 1'!C46","v":"Lähden"},null,null,{"v":0,"d":"0.0"},0,0,0,0,0,0,0,0,0,1,0,0,0,0,0,0,0,0,0,0,0,0,0,0,{"$nulls":5},{"v":0,"d":"0.0"},1,0,""]
[32,{"$f":"'Wettkampf 1'!B47","v":"Helmer, Nils"},{"$f":"'Wettkampf 1'!C47","v":"Lorup"},126.2,"x","0","0",0,0,0,0,0,0,0,0,0,0,0,0,0,0,0,0,0,0,0,0,0,0,0,{"$nulls":5},{"v":0,"d":"0.0"},0,0,""]
[33,{"$f":"'Wettkampf 1'!B48","v":"Schütze 33"},{"$f":"'Wettkampf 1'!C48","v":"Verein VII"},null,null,{"v":0,"d":"0.0"},0,0,0,0,0,0,0,0,0,0,0,0,0,1,0,0,0,0,0,0,0,0,0,0,{"$nulls":5},{"v":0,"d":"0.0"},1,0,""]
[34,{"$f":"'Wettkampf 1'!B49","v":"Schütze 34"},{"$f":"'Wettkampf 1'!C49","v":"Verein VII"},null,null,{"v":0,"d":"0.0"},0,0,0,0,0,0,0,0,0,0,0,0,0,1,0,0,0,0,0,0,0,0,0,0,{"$nulls":5},{"v":0,"d":"0.0"},1,0,""]
[35,{"$f":"'Wettkampf 1'!B50","v":"Schütze 35"},{"$f":"'Wettkampf 1'!C50","v":"Verein VII"},null,null,{"v":0,"d":"0.0"},0,0,0,0,0,0,0,0,0,0,0,0,0,1,0,0,0,0,0,0,0,0,0,0,{"$nulls":5},{"v":0,"d":"0.0"},1,0,""]
[36,{"$f":"'Wettkampf 1'!B51","v":"Schütze 36"},{"$f":"'Wettkampf 1'!C51","v":"Verein VII"},null,null,{"v":0,"d":"0.0"},0,0,0,0,0,0,0,0,0,0,0,0,0,1,0,0,0,0,0,0,0,0,0,0,{"$nulls":5},{"v":0,"d":"0.0"},1,0,""]
[37,{"$f":"'Wettkampf 1'!B52","v":"Schütze 37"},{"$f":"'Wettkampf 1'!C52","v":"Verein VII"},null,null,{"v":0,"d":"0.0"},0,0,0,0,0,0,0,0,0,0,0,0,0,1,0,0,0,0,0,0,0,0,0,0,{"$nulls":5},{"v":0,"d":"0.0"}]
[38,{"$f":"'Wettkampf 1'!B53","v":"Schütze 38"},{"$f":"'Wettkampf 1'!C53","v":"Verein VIII"},null,null,{"v":0,"d":"0.0"},0,0,0,0,0,0,0,0,0,0,0,0,0,0,0,1,0,0,0,0,0,0,0,0,{"$nulls":5},{"v":0,"d":"0.0"}]
[39,{"$f":"'Wettkampf 1'!B54","v":"Schütze 39"},{"$f":"'Wettkampf 1'!C54","v":"Verein VIII"},null,null,{"v":0,"d":"0.0"},0,0,0,0,0,0,0,0,0,0,0,0,{"$f":"IF($C54=$B$8,$F54,0)","v":0},{"$f":"(IF(AND($E54=\"\",$C54=$B$8),1,0))","v":0},{"$f":"IF($C54=$B$9,$F54,0)","v":0},{"$f":"(IF(AND($E54=\"\",$C54=$B$9),1,0))","v":1},{"$f":"IF($C54=$B$10,$F54,0)","v":0},{"$f":"(IF(AND($E54=\"\",$C54=$B$10),1,0))","v":0},{"$f":"IF($C54=$B$11,$F54,0)","v":0},{"$f":"(IF(AND($E54=\"\",$C54=$B$11),1,0))","v":0},{"$f":"IF($C54=$B$12,$F54,0)","v":0},{"$f":"(IF(AND($E54=\"\",$C54=$B$12),1,0))","v":0},{"$f":"IF($C54=$B$13,$F54,0)","v":0},{"$f":"(IF(AND($E54=\"\",$C54=$B$13),1,0))","v":0},{"$nulls":5},{"v":0,"d":"0.0"}]
[40,{"$f":"'Wettkampf 1'!B55","v":"Schütze 40"},{"$f":"'Wettkampf 1'!C55","v":"Verein VIII"},null,null,{"v":0,"d":"0.0"},0,0,0,0,0,0,0,0,0,0,0,0,0,0,0,1,0,0,0,0,0,0,0,0,{"$nulls":5},{"v":0,"d":"0.0"}]
[41,{"$f":"'Wettkampf 1'!B56","v":"Schütze 41"},{"$f":"'Wettkampf 1'!C56","v":"Verein IX"},null,null,{"v":0,"d":"0.0"},0,0,0,0,0,0,0,0,0,0,0,0,0,0,0,0,0,1,0,0,0,0,0,0,{"$nulls":5},{"v":0,"d":"0.0"}]
[42,{"$f":"'Wettkampf 1'!B57","v":"Schütze 42"},{"$f":"'Wettkampf 1'!C57","v":"Verein IX"},null,null,{"v":0,"d":"0.0"},0,0,0,0,0,0,0,0,0,0,0,0,0,0,0,0,0,1,0,0,0,0,0,0,{"$nulls":5},{"v":0,"d":"0.0"}]
[43,{"$f":"'Wettkampf 1'!B58","v":"Schütze 43"},{"$f":"'Wettkampf 1'!C58","v":"Verein IX"},null,null,{"v":0,"d":"0.0"},0,0,0,0,0,0,0,0,0,0,0,0,0,0,0,0,0,1,0,0,0,0,0,0,{"$nulls":5},{"v":0,"d":"0.0"}]
[44,{"$f":"'Wettkampf 1'!B59","v":"Schütze 44"},{"$f":"'Wettkampf 1'!C59","v":"Verein IX"},null,null,{"v":0,"d":"0.0"},0,0,0,0,0,0,0,0,0,0,0,0,0,0,0,0,0,1,0,0,0,0,0,0,{"$nulls":5},{"v":0,"d":"0.0"}]
[45,{"$f":"'Wettkampf 1'!B60","v":"Schütze 45"},{"$f":"'Wettkampf 1'!C60","v":"Verein IX"},null,null,{"v":0,"d":"0.0"},0,0,0,0,0,0,0,0,0,0,0,0,0,0,0,0,0,1,0,0,0,0,0,0,{"$nulls":5},{"v":0,"d":"0.0"}]
[46,{"$f":"'Wettkampf 1'!B61","v":"Schütze 46"},{"$f":"'Wettkampf 1'!C61","v":"Verein X"},null,null,{"v":0,"d":"0.0"},0,0,0,0,0,0,0,0,0,0,0,0,0,0,0,0,0,0,0,1,0,0,0,0,{"$nulls":5},{"v":0,"d":"0.0"}]
[47,{"$f":"'Wettkampf 1'!B62","v":"Schütze 47"},{"$f":"'Wettkampf 1'!C62","v":"Verein X"},null,null,{"v":0,"d":"0.0"},0,0,0,0,0,0,0,0,0,0,0,0,0,0,0,0,0,0,0,1,0,0,0,0,{"$nulls":5},{"v":0,"d":"0.0"}]
[48,{"$f":"'Wettkampf 1'!B63","v":"Schütze 48"},{"$f":"'Wettkampf 1'!C63","v":"Verein X"},null,null,{"v":0,"d":"0.0"},0,0,0,0,0,0,0,0,0,0,0,0,0,0,0,0,0,0,0,1,0,0,0,0,{"$nulls":5},{"v":0,"d":"0.0"}]
[49,{"$f":"'Wettkampf 1'!B64","v":"Schütze 49"},{"$f":"'Wettkampf 1'!C64","v":"Verein X"},null,null,{"v":0,"d":"0.0"},0,0,0,0,0,0,0,0,0,0,0,0,0,0,0,0,0,0,0,1,0,0,0,0,{"$nulls":5},{"v":0,"d":"0.0"}]
[50,{"$f":"'Wettkampf 1'!B65","v":"Schütze 50"},{"$f":"'Wettkampf 1'!C65","v":"Verein X"},null,null,{"v":0,"d":"0.0"},0,0,0,0,0,0,0,0,0,0,0,0,0,0,0,0,0,0,0,1,0,0,0,0,{"$nulls":5},{"v":0,"d":"0.0"}]
[51,{"$f":"'Wettkampf 1'!B66","v":"Schütze 51"},{"$f":"'Wettkampf 1'!C66","v":"Verein XI"},null,null,{"v":0,"d":"0.0"},0,0,0,0,0,0,0,0,0,0,0,0,0,0,0,0,0,0,0,0,0,1,0,0,{"$nulls":5},{"v":0,"d":"0.0"}]
[52,{"$f":"'Wettkampf 1'!B67","v":"Schütze 52"},{"$f":"'Wettkampf 1'!C67","v":"Verein XI"},null,null,{"v":0,"d":"0.0"},0,0,0,0,0,0,0,0,0,0,0,0,0,0,0,0,0,0,0,0,0,1,0,0,{"$nulls":5},{"v":0,"d":"0.0"}]
[53,{"$f":"'Wettkampf 1'!B68","v":"Schütze 53"},{"$f":"'Wettkampf 1'!C68","v":"Verein XI"},null,null,{"v":0,"d":"0.0"},0,0,0,0,0,0,0,0,0,0,0,0,0,0,0,0,0,0,0,0,0,1,0,0,{"$nulls":5},{"v":0,"d":"0.0"}]
[54,{"$f":"'Wettkampf 1'!B69","v":"Schütze 54"},{"$f":"'Wettkampf 1'!C69","v":"Verein XI"},null,null,{"v":0,"d":"0.0"},0,0,0,0,0,0,0,0,0,0,0,0,0,0,0,0,0,0,0,0,0,1,0,0,{"$nulls":5},{"v":0,"d":"0.0"}]
[55,{"$f":"'Wettkampf 1'!B70","v":"Schütze 55"},{"$f":"'Wettkampf 1'!C70","v":"Verein XI"},null,null,{"v":0,"d":"0.0"},0,0,0,0,0,0,0,0,0,0,0,0,0,0,0,0,0,0,0,0,0,1,0,0,{"$nulls":5},{"v":0,"d":"0.0"}]
[56,{"$f":"'Wettkampf 1'!B71","v":"Schütze 56"},{"$f":"'Wettkampf 1'!C71","v":"Verein XII"},null,null,{"v":0,"d":"0.0"},0,0,0,0,0,0,0,0,0,0,0,0,0,0,0,0,0,0,0,0,0,0,0,1,{"$nulls":5},{"v":0,"d":"0.0"}]
[57,{"$f":"'Wettkampf 1'!B72","v":"Schütze 57"},{"$f":"'Wettkampf 1'!C72","v":"Verein XII"},null,null,{"v":0,"d":"0.0"},0,0,0,0,0,0,0,0,0,0,0,0,0,0,0,0,0,0,0,0,0,0,0,1,{"$nulls":5},{"v":0,"d":"0.0"}]
[58,{"$f":"'Wettkampf 1'!B73","v":"Schütze 58"},{"$f":"'Wettkampf 1'!C73","v":"Verein XII"},null,null,{"v":0,"d":"0.0"},0,0,0,0,0,0,0,0,0,0,0,0,0,0,0,0,0,0,0,0,0,0,0,1,{"$nulls":5},{"v":0,"d":"0.0"}]
[59,{"$f":"'Wettkampf 1'!B74","v":"Schütze 59"},{"$f":"'Wettkampf 1'!C74","v":"Verein XII"},null,null,{"v":0,"d":"0.0"},0,0,0,0,0,0,0,0,0,0,0,0,0,0,0,0,0,0,0,0,0,0,0,1,{"$nulls":5},{"v":0,"d":"0.0"}]
[60,{"$f":"'Wettkampf 1'!B75","v":"Schütze 60"},{"$f":"'Wettkampf 1'!C75","v":"Verein XII"},null,null,{"v":0,"d":"0.0"},0,0,0,0,0,0,0,0,0,0,0,0,0,0,0,0,0,0,0,0,0,0,0,1,{"$nulls":5},{"v":0,"d":"0.0"}]
[{"$nulls":6},{"$f":"LARGE(G16:G75,1)+LARGE(G16:G75,2)+LARGE(G16:G75,3)","v":444.20000000000005},{"$f":"SUM(H16:H75)","v":5},{"$f":"LARGE(I16:I75,1)+LARGE(I16:I75,2)+LARGE(I16:I75,3)","v":0},{"$f":"SUM(J16:J75)","v":4},{"$f":"LARGE(K16:K75,1)+LARGE(K16:K75,2)+LARGE(K16:K75,3)","v":361.5},{"$f":"SUM(L16:L75)","v":5},{"$f":"LARGE(M16:M75,1)+LARGE(M16:M75,2)+LARGE(M16:M75,3)","v":522.9},{"$f":"SUM(N16:N75)","v":5},{"$f":"LARGE(O16:O75,1)+LARGE(O16:O75,2)+LARGE(O16:O75,3)","v":551.9},{"$f":"SUM(P16:P75)","v":5},{"$f":"LARGE(Q16:Q75,1)+LARGE(Q16:Q75,2)+LARGE(Q16:Q75,3)","v":145.7},{"$f":"SUM(R16:R75)","v":4},{"$f":"LARGE(S16:S75,1)+LARGE(S16:S75,2)+LARGE(S16:S75,3)","v":0},{"$f":"SUM(T16:T75)","v":5},{"$f":"LARGE(U16:U75,1)+LARGE(U16:U75,2)+LARGE(U16:U75,3)","v":0},{"$f":"SUM(V16:V75)","v":3},{"$f":"LARGE(W16:W75,1)+LARGE(W16:W75,2)+LARGE(W16:W75,3)","v":0},{"$f":"SUM(X16:X75)","v":5},{"$f":"LARGE(Y16:Y75,1)+LARGE(Y16:Y75,2)+LARGE(Y16:Y75,3)","v":0},{"$f":"SUM(Z16:Z75)","v":5},{"$f":"LARGE(AA16:AA75,1)+LARGE(AA16:AA75,2)+LARGE(AA16:AA75,3)","v":0},{"$f":"SUM(AB16:AB75)","v":5},{"$f":"LARGE(AC16:AC75,1)+LARGE(AC16:AC75,2)+LARGE(AC16:AC75,3)","v":0},{"$f":"SUM(AD16:AD75)","v":5}]
[null,null,"per Email an: sk-huemmling@gmx.de"]

{"sheet":"9","index":9,"n_rows":77,"n_cols":39,"rows_kept":77,"merged":[[0,34,0,35],[1,34,1,35],[4,34,4,35],[5,34,5,35],[6,34,6,35],[14,32,14,35]]}
[null,"Verein / Gruppe",null,"Ergebnisse",{"$nulls":29},"Austragungsort:",{"$f":"Übersicht!N4","v":"Breddenberg"}]
[1,{"$f":"'Wettkampf 1'!B2","v":"Lorup"},null,{"$f":"G76","v":507.7},{"$f":"IF(H76>4,\"Es sind zu viele Schützen in Wertung!\",\" \")","v":"Es sind zu viele Schützen in Wertung!"},{"$nulls":28},"Wettkampftag:",{"$f":"Übersicht!N3","v":"17.02."}]
[2,{"$f":"'Wettkampf 1'!B3","v":"Sögel"},null,{"$f":"I76","v":{"v":0,"d":"0.0"}},{"$f":"IF(J76>4,\"Es sind zu viele Schützen in Wertung!\",\" \")","v":" "}]
[3,{"$f":"'Wettkampf 1'!B4","v":"Spahnharenstätte"},null,{"$f":"K76","v":372.1},{"$f":"IF(L76>4,\"Es sind zu viele Schützen in Wertung!\",\" \")","v":"Es sind zu viele Schützen in Wertung!"},{"$nulls":30},"Ansprechpartner für Rückfragen:"]
[4,{"$f":"'Wettkampf 1'!B5","v":"Esterwegen"},null,{"$f":"M76","v":490.7},{"$f":"IF(N76>4,\"Es sind zu viele Schützen in Wertung!\",\" \")","v":"Es sind zu viele Schützen in Wertung!"},{"$nulls":28},"Name:","Frank Kuper"]
[5,{"$f":"'Wettkampf 1'!B6","v":"Lähden"},null,{"$f":"O76","v":560.7},{"$f":"IF(P76>4,\"Es sind zu viele Schützen in Wertung!\",\" \")","v":"Es sind zu viele Schützen in Wertung!"},{"$nulls":28},"Tel:","01525/6118900"]
[6,{"$f":"'Wettkampf 1'!B7","v":"Börgermoor"},null,{"$f":"Q76","v":175.5},{"$f":"IF(R76>4,\"Es sind zu viele Schützen in Wertung!\",\" \")","v":" "},{"$nulls":28},"Standaufsicht:","G.Jansen/F.Kuper"]
[7,{"$f":"'Wettkampf 1'!B8","v":"Verein VII"},null,{"$f":"S76","v":{"v":0,"d":"0.0"}},{"$f":"IF(T76>4,\"Es sind zu viele Schützen in Wertung!\",\" \")","v":"Es sind zu viele Schützen in Wertung!"}]
[8,{"$f":"'Wettkampf 1'!B9","v":"Verein VIII"},null,{"$f":"U76","v":{"v":0,"d":"0.0"}},{"$f":"IF(V76>4,\"Es sind zu viele Schützen in Wertung!\",\" \")","v":" "}]
[9,{"$f":"'Wettkampf 1'!B10","v":"Verein IX"},null,{"$f":"W76","v":{"v":0,"d":"0.0"}},{"$f":"IF(X76>4,\"Es sind zu viele Schützen in Wertung!\",\" \")","v":"Es sind zu viele Schützen in Wertung!"}]
[10,{"$f":"'Wettkampf 1'!B11","v":"Verein X"},null,{"$f":"Y76","v":{"v":0,"d":"0.0"}},{"$f":"IF(Z76>4,\"Es sind zu viele Schützen in Wertung!\",\" \")","v":"Es sind zu viele Schützen in Wertung!"}]
[11,{"$f":"'Wettkampf 1'!B12","v":"Verein XI"},null,{"$f":"AA76","v":{"v":0,"d":"0.0"}},{"$f":"IF(AB76>4,\"Es sind zu viele Schützen in Wertung!\",\" \")","v":"Es sind zu viele Schützen in Wertung!"}]
[12,{"$f":"'Wettkampf 1'!B13","v":"Verein XII"},null,{"$f":"AC76","v":{"v":0,"d":"0.0"}},{"$f":"IF(AD76>4,\"Es sind zu viele Schützen in Wertung!\",\" \")","v":"Es sind zu viele Schützen in Wertung!"}]
[]
[null,"Einzelergebnisse:","Verein / Gruppe","Ergebnisse (mindestens 0 eintragen)","AW? Dann x eintippen",null,"Verein 1",null,"Verein 2",null,"Verein 3",null,"Verein 4",null,"Verein 5",null,"Verein 6",null,"Verein 7",null,"Verein 8",null,"Verein 9",null,"Verein 10",null,"Verein 11",null,"Verein 12",{"$nulls":3},"Proberechnung bei Streifen:"]
[1,{"$f":"'Wettkampf 1'!B16","v":"Wotte Lia"},{"$f":"'Wettkampf 1'!C16","v":"Lorup"},178.6,null,{"$f":"IF(E16=\"x\",\"0\",D16)","v":178.6},{"$f":"IF(C16=$B$2,F16,0)","v":178.6},{"$f":"(IF(AND($E16=\"\",$C16=$B$2),1,0))","v":1},{"$f":"IF($C16=$B$3,$F16,0)","v":0},{"$f":"(IF(AND($E16=\"\",$C16=$B$3),1,0))","v":0},{"$f":"IF($C16=$B$4,F16,0)","v":0},{"$f":"(IF(AND($E16=\"\",$C16=$B$4),1,0))","v":0},{"$f":"IF($C16=$B$5,F16,0)","v":0},{"$f":"(IF(AND($E16=\"\",$C16=$B$5),1,0))","v":0},{"$f":"IF($C16=$B$6,F16,0)","v":0},{"$f":"(IF(AND($E16=\"\",$C16=$B$6),1,0))","v":0},{"$f":"IF($C16=$B$7,F16,0)","v":0},{"$f":"(IF(AND($E16=\"\",$C16=$B$7),1,0))","v":0},{"$f":"IF($C16=$B$8,$F16,0)","v":0},{"$f":"(IF(AND($E16=\"\",$C16=$B$8),1,0))","v":0},{"$f":"IF($C16=$B$9,$F16,0)","v":0},{"$f":"(IF(AND($E16=\"\",$C16=$B$9),1,0))","v":0},{"$f":"IF($C16=$B$10,$F16,0)","v":0},{"$f":"(IF(AND($E16=\"\",$C16=$B$10),1,0))","v":0},{"$f":"IF($C16=$B$11,$F16,0)","v":0},{"$f":"(IF(AND($E16=\"\",$C16=$B$11),1,0))","v":0},{"$f":"IF($C16=$B$12,$F16,0)","v":0},{"$f":"(IF(AND($E16=\"\",$C16=$B$12),1,0))","v":0},{"$f":"IF($C16=$B$13,$F16,0)","v":0},{"$f":"(IF(AND($E16=\"\",$C16=$B$13),1,0))","v":0},{"$nulls":5},{"$f":"SUM(AG16:AI16)","v":{"v":0,"d":"0.0"}},{"$f":"IF(AJ16=D16,1,0)","v":0},{"$f":"IF(AJ16=0,0,1)","v":0},{"$f":"IF(AK16+AL16=2,\"Korrekt\",\"\")","v":""}]
[2,{"$f":"'Wettkampf 1'!B17","v":"Wotte Hannes"},{"$f":"'Wettkampf 1'!C17","v":"Lorup"},139.8,null,{"$f":"IF(E17=\"x\",\"0\",D17)","v":139.8},{"$f":"IF(C17=$B$2,F17,0)","v":139.8},{"$f":"(IF(AND($E17=\"\",$C17=$B$2),1,0))","v":1},{"$f":"IF($C17=$B$3,F17,0)","v":0},{"$f":"(IF(AND($E17=\"\",$C17=$B$3),1,0))","v":0},{"$f":"IF($C17=$B$4,F17,0)","v":0},{"$f":"(IF(AND($E17=\"\",$C17=$B$4),1,0))","v":0},{"$f":"IF($C17=$B$5,F17,0)","v":0},{"$f":"(IF(AND($E17=\"\",$C17=$B$5),1,0))","v":0},{"$f":"IF($C17=$B$6,F17,0)","v":0},{"$f":"(IF(AND($E17=\"\",$C17=$B$6),1,0))","v":0},{"$f":"IF($C17=$B$7,F17,0)","v":0},{"$f":"(IF(AND($E17=\"\",$C17=$B$7),1,0))","v":0},{"$f":"IF($C17=$B$8,$F17,0)","v":0},{"$f":"(IF(AND($E17=\"\",$C17=$B$8),1,0))","v":0},{"$f":"IF($C17=$B$9,$F17,0)","v":0},{"$f":"(IF(AND($E17=\"\",$C17=$B$9),1,0))","v":0},{"$f":"IF($C17=$B$10,$F17,0)","v":0},{"$f":"(IF(AND($E17=\"\",$C17=$B$10),1,0))","v":0},{"$f":"IF($C17=$B$11,$F17,0)","v":0},{"$f":"(IF(AND($E17=\"\",$C17=$B$11),1,0))","v":0},{"$f":"IF($C17=$B$12,$F17,0)","v":0},{"$f":"(IF(AND($E17=\"\",$C17=$B$12),1,0))","v":0},{"$f":"IF($C17=$B$13,$F17,0)","v":0},{"$f":"(IF(AND($E17=\"\",$C17=$B$13),1,0))","v":0},{"$nulls":5},{"$f":"SUM(AG17:AI17)","v":{"v":0,"d":"0.0"}},{"$f":"IF(AJ17=D17,1,0)","v":0},{"$f":"IF(AJ17=0,0,1)","v":0},{"$f":"IF(AK17+AL17=2,\"Korrekt\",\"\")","v":""}]
[3,{"$f":"'Wettkampf 1'!B18","v":"Gretenabeln Elias"},{"$f":"'Wettkampf 1'!C18","v":"Lorup"},148.2,null,148.2,148.2,1,0,0,0,0,0,0,0,0,0,0,0,0,0,0,0,0,0,0,0,0,0,0,{"$nulls":5},{"v":0,"d":"0.0"},0,0,""]
[4,{"$f":"'Wettkampf 1'!B19","v":"Helmer Maike"},{"$f":"'Wettkampf 1'!C19","v":"Lorup"},180.9,null,180.9,180.9,1,0,0,0,0,0,0,0,0,0,0,0,0,0,0,0,0,0,0,0,0,0,0,{"$nulls":5},{"v":0,"d":"0.0"},0,0,""]
[5,{"$f":"'Wettkampf 1'!B20","v":"Többen Jannes"},{"$f":"'Wettkampf 1'!C20","v":"Lorup"},115.3,"x","0","0",0,0,0,0,0,0,0,0,0,0,0,0,0,0,0,0,0,0,0,0,0,0,0,{"$nulls":5},{"v":0,"d":"0.0"},0,0,""]
[6,{"$f":"'Wettkampf 1'!B21","v":"Lüken Arne"},{"$f":"'Wettkampf 1'!C21","v":"Lorup"},null,null,{"v":0,"d":"0.0"},0,1,0,0,0,0,0,0,0,0,0,0,0,0,0,0,0,0,0,0,0,0,0,0,{"$nulls":5},{"v":0,"d":"0.0"},1,0,""]
[7,{"$f":"'Wettkampf 1'!B22","v":"Schütze 7"},{"$f":"'Wettkampf 1'!C22","v":"Sögel"},null,null,{"v":0,"d":"0.0"},0,0,0,1,0,0,0,0,0,0,0,0,0,0,0,0,0,0,0,0,0,0,0,0,{"$nulls":5},{"v":0,"d":"0.0"},1,0,""]
[8,{"$f":"'Wettkampf 1'!B23","v":"Schütze 8"},{"$f":"'Wettkampf 1'!C23","v":"Sögel"},null,null,{"v":0,"d":"0.0"},0,0,0,1,0,0,0,0,0,0,0,0,0,0,0,0,0,0,0,0,0,0,0,0,{"$nulls":5},{"v":0,"d":"0.0"},1,0,""]
[9,{"$f":"'Wettkampf 1'!B24","v":"Schütze 9"},{"$f":"'Wettkampf 1'!C24","v":"Sögel"},null,null,{"v":0,"d":"0.0"},0,0,0,1,0,0,0,0,0,0,0,0,0,0,0,0,0,0,0,0,0,0,0,0,{"$nulls":5},{"v":0,"d":"0.0"},1,0,""]
[10,{"$f":"'Wettkampf 1'!B25","v":"Schütze 10"},{"$f":"'Wettkampf 1'!C25","v":"Sögel"},null,null,{"v":0,"d":"0.0"},0,0,0,1,0,0,0,0,0,0,0,0,0,0,0,0,0,0,0,0,0,0,0,0,{"$nulls":5},{"v":0,"d":"0.0"},1,0,""]
[11,{"$f":"'Wettkampf 1'!B26","v":"Engbers Hannes"},{"$f":"'Wettkampf 1'!C26","v":"Spahnharenstätte"},109.8,null,109.8,0,0,0,0,109.8,1,0,0,0,0,0,0,0,0,0,0,0,0,0,0,0,0,0,0,{"$nulls":5},{"v":0,"d":"0.0"},0,0,""]
[12,{"$f":"'Wettkampf 1'!B27","v":"Runde Marcel"},{"$f":"'Wettkampf 1'!C27","v":"Spahnharenstätte"},{"v":137,"d":"137.0"},null,{"v":137,"d":"137.0"},0,0,0,0,137,1,0,0,0,0,0,0,0,0,0,0,0,0,0,0,0,0,0,0,{"$nulls":5},{"v":0,"d":"0.0"},0,0,""]
[13,{"$f":"'Wettkampf 1'!B28","v":"Jansen Lars"},{"$f":"'Wettkampf 1'!C28","v":"Spahnharenstätte"},125.3,null,125.3,0,0,0,0,125.3,1,0,0,0,0,0,0,0,0,0,0,0,0,0,0,0,0,0,0,{"$nulls":5},{"v":0,"d":"0.0"},0,0,""]
[14,{"$f":"'Wettkampf 1'!B29","v":"Schütze 14"},{"$f":"'Wettkampf 1'!C29","v":"Spahnharenstätte"},null,null,{"v":0,"d":"0.0"},0,0,0,0,0,1,0,0,0,0,0,0,0,0,0,0,0,0,0,0,0,0,0,0,{"$nulls":5},{"v":0,"d":"0.0"},1,0,""]
[15,{"$f":"'Wettkampf 1'!B30","v":"Schütze 15"},{"$f":"'Wettkampf 1'!C30","v":"Spahnharenstätte"},null,null,{"v":0,"d":"0.0"},0,0,0,0,0,1,0,0,0,0,0,0,0,0,0,0,0,0,0,0,0,0,0,0,{"$nulls":5},{"v":0,"d":"0.0"},1,0,""]
[16,{"$f":"'Wettkampf 1'!B31","v":"Suhle Annalena"},{"$f":"'Wettkampf 1'!C31","v":"Esterwegen"},186.4,null,186.4,0,0,0,0,0,0,186.4,1,0,0,0,0,0,0,0,0,0,0,0,0,0,0,0,0,{"$nulls":5},{"v":0,"d":"0.0"},0,0,""]
[17,{"$f":"'Wettkampf 1'!B32","v":"Gäken Lena"},{"$f":"'Wettkampf 1'!C32","v":"Esterwegen"},185.5,null,185.5,0,0,0,0,0,0,185.5,1,0,0,0,0,0,0,0,0,0,0,0,0,0,0,0,0,{"$nulls":5},{"v":0,"d":"0.0"},0,0,""]
[18,{"$f":"'Wettkampf 1'!B33","v":"Jansen Daniel"},{"$f":"'Wettkampf 1'!C33","v":"Esterwegen"},null,null,{"v":0,"d":"0.0"},0,0,0,0,0,0,0,1,0,0,0,0,0,0,0,0,0,0,0,0,0,0,0,0,{"$nulls":5},{"v":0,"d":"0.0"},1,0,""]
[19,{"$f":"'Wettkampf 1'!B34","v":"Pieper Jonas"},{"$f":"'Wettkampf 1'!C34","v":"Esterwegen"},118.8,null,118.8,0,0,0,0,0,0,118.8,1,0,0,0,0,0,0,0,0,0,0,0,0,0,0,0,0,{"$nulls":5},{"v":0,"d":"0.0"},0,0,""]
[20,{"$f":"'Wettkampf 1'!B35","v":"Schütze 20"},{"$f":"'Wettkampf 1'!C35","v":"Esterwegen"},null,null,{"v":0,"d":"0.0"},0,0,0,0,0,0,0,1,0,0,0,0,0,0,0,0,0,0,0,0,0,0,0,0,{"$nulls":5},{"v":0,"d":"0.0"},1,0,""]
[21,{"$f":"'Wettkampf 1'!B36","v":"Hellweg Thea"},{"$f":"'Wettkampf 1'!C36","v":"Lähden"},175.1,null,175.1,0,0,0,0,0,0,0,0,175.1,1,0,0,0,0,0,0,0,0,0,0,0,0,0,0,{"$nulls":5},{"v":0,"d":"0.0"},0,0,""]
[22,{"$f":"'Wettkampf 1'!B37","v":"Bruns Henrik"},{"$f":"'Wettkampf 1'!C37","v":"Lähden"},184.7,null,184.7,0,0,0,0,0,0,0,0,184.7,1,0,0,0,0,0,0,0,0,0,0,0,0,0,0,{"$nulls":5},{"v":0,"d":"0.0"},0,0,""]
[23,{"$f":"'Wettkampf 1'!B38","v":"Buschen Johann "},{"$f":"'Wettkampf 1'!C38","v":"Lähden"},189.5,null,189.5,0,0,0,0,0,0,0,0,189.5,1,0,0,0,0,0,0,0,0,0,0,0,0,0,0,{"$nulls":5},{"v":0,"d":"0.0"},0,0,""]
[24,{"$f":"'Wettkampf 1'!B39","v":"Preut Jannis"},{"$f":"'Wettkampf 1'!C39","v":"Lähden"},150.1,"x","0",0,0,0,0,0,0,0,0,"0",0,0,0,0,0,0,0,0,0,0,0,0,0,0,0,{"$nulls":5},{"v":0,"d":"0.0"},0,0,""]
[25,{"$f":"'Wettkampf 1'!B40","v":"Fleschenberg Jana"},{"$f":"'Wettkampf 1'!C40","v":"Lähden"},186.5,null,186.5,0,0,0,0,0,0,0,0,186.5,1,0,0,0,0,0,0,0,0,0,0,0,0,0,0,{"$nulls":5},{"v":0,"d":"0.0"},0,0,""]
[26,{"$f":"'Wettkampf 1'!B41","v":"von Seggern Moritz"},{"$f":"'Wettkampf 1'!C41","v":"Lähden"},166.8,null,166.8,0,0,0,0,0,0,0,0,166.8,1,0,0,0,0,0,0,0,0,0,0,0,0,0,0,{"$nulls":5},{"v":0,"d":"0.0"},0,0,""]
[27,{"$f":"'Wettkampf 1'!B42","v":"Kohnen Saskia"},{"$f":"'Wettkampf 1'!C42","v":"Börgermoor"},175.5,null,175.5,0,0,0,0,0,0,0,0,0,0,175.5,1,0,0,0,0,0,0,0,0,0,0,0,0,{"$nulls":5},{"v":0,"d":"0.0"},0,0,""]
[28,{"$f":"'Wettkampf 1'!B43","v":"Niemann Paul"},{"$f":"'Wettkampf 1'!C43","v":"Börgermoor"},null,null,{"v":0,"d":"0.0"},0,0,0,0,0,0,0,0,0,0,0,1,0,0,0,0,0,0,0,0,0,0,0,0,{"$nulls":5},{"v":0,"d":"0.0"},1,0,""]
[29,{"$f":"'Wettkampf 1'!B44","v":"Schütze 29"},{"$f":"'Wettkampf 1'!C44","v":"Börgermoor"},null,null,{"v":0,"d":"0.0"},0,0,0,0,0,0,0,0,0,0,0,1,0,0,0,0,0,0,0,0,0,0,0,0,{"$nulls":5},{"v":0,"d":"0.0"},1,0,""]
[30,{"$f":"'Wettkampf 1'!B45","v":"Schütze 30"},{"$f":"'Wettkampf 1'!C45","v":"Börgermoor"},null,null,{"v":0,"d":"0.0"},0,0,0,0,0,0,0,0,0,0,0,1,0,0,0,0,0,0,0,0,0,0,0,0,{"$nulls":5},{"v":0,"d":"0.0"},1,0,""]
[31,{"$f":"'Wettkampf 1'!B46","v":"Stümpler Jan Luka "},{"$f":"'Wettkampf 1'!C46","v":"Lähden"},null,null,{"v":0,"d":"0.0"},0,0,0,0,0,0,0,0,0,1,0,0,0,0,0,0,0,0,0,0,0,0,0,0,{"$nulls":5},{"v":0,"d":"0.0"},1,0,""]
[32,{"$f":"'Wettkampf 1'!B47","v":"Helmer, Nils"},{"$f":"'Wettkampf 1'!C47","v":"Lorup"},71.8,"x","0","0",0,0,0,0,0,0,0,0,0,0,0,0,0,0,0,0,0,0,0,0,0,0,0,{"$nulls":5},{"v":0,"d":"0.0"},0,0,""]
[33,{"$f":"'Wettkampf 1'!B48","v":"Schütze 33"},{"$f":"'Wettkampf 1'!C48","v":"Verein VII"},null,null,{"v":0,"d":"0.0"},0,0,0,0,0,0,0,0,0,0,0,0,0,1,0,0,0,0,0,0,0,0,0,0,{"$nulls":5},{"v":0,"d":"0.0"},1,0,""]
[34,{"$f":"'Wettkampf 1'!B49","v":"Schütze 34"},{"$f":"'Wettkampf 1'!C49","v":"Verein VII"},null,null,{"v":0,"d":"0.0"},0,0,0,0,0,0,0,0,0,0,0,0,0,1,0,0,0,0,0,0,0,0,0,0,{"$nulls":5},{"v":0,"d":"0.0"},1,0,""]
[35,{"$f":"'Wettkampf 1'!B50","v":"Schütze 35"},{"$f":"'Wettkampf 1'!C50","v":"Verein VII"},null,null,{"v":0,"d":"0.0"},0,0,0,0,0,0,0,0,0,0,0,0,0,1,0,0,0,0,0,0,0,0,0,0,{"$nulls":5},{"v":0,"d":"0.0"},1,0,""]
[36,{"$f":"'Wettkampf 1'!B51","v":"Schütze 36"},{"$f":"'Wettkampf 1'!C51","v":"Verein VII"},null,null,{"v":0,"d":"0.0"},0,0,0,0,0,0,0,0,0,0,0,0,0,1,0,0,0,0,0,0,0,0,0,0,{"$nulls":5},{"v":0,"d":"0.0"},1,0,""]
[37,{"$f":"'Wettkampf 1'!B52","v":"Schütze 37"},{"$f":"'Wettkampf 1'!C52","v":"Verein VII"},null,null,{"v":0,"d":"0.0"},0,0,0,0,0,0,0,0,0,0,0,0,0,1,0,0,0,0,0,0,0,0,0,0,{"$nulls":5},{"v":0,"d":"0.0"}]
[38,{"$f":"'Wettkampf 1'!B53","v":"Schütze 38"},{"$f":"'Wettkampf 1'!C53","v":"Verein VIII"},null,null,{"v":0,"d":"0.0"},0,0,0,0,0,0,0,0,0,0,0,0,0,0,0,1,0,0,0,0,0,0,0,0,{"$nulls":5},{"v":0,"d":"0.0"}]
[39,{"$f":"'Wettkampf 1'!B54","v":"Schütze 39"},{"$f":"'Wettkampf 1'!C54","v":"Verein VIII"},null,null,{"v":0,"d":"0.0"},0,0,0,0,0,0,0,0,0,0,0,0,{"$f":"IF($C54=$B$8,$F54,0)","v":0},{"$f":"(IF(AND($E54=\"\",$C54=$B$8),1,0))","v":0},{"$f":"IF($C54=$B$9,$F54,0)","v":0},{"$f":"(IF(AND($E54=\"\",$C54=$B$9),1,0))","v":1},{"$f":"IF($C54=$B$10,$F54,0)","v":0},{"$f":"(IF(AND($E54=\"\",$C54=$B$10),1,0))","v":0},{"$f":"IF($C54=$B$11,$F54,0)","v":0},{"$f":"(IF(AND($E54=\"\",$C54=$B$11),1,0))","v":0},{"$f":"IF($C54=$B$12,$F54,0)","v":0},{"$f":"(IF(AND($E54=\"\",$C54=$B$12),1,0))","v":0},{"$f":"IF($C54=$B$13,$F54,0)","v":0},{"$f":"(IF(AND($E54=\"\",$C54=$B$13),1,0))","v":0},{"$nulls":5},{"v":0,"d":"0.0"}]
[40,{"$f":"'Wettkampf 1'!B55","v":"Schütze 40"},{"$f":"'Wettkampf 1'!C55","v":"Verein VIII"},null,null,{"v":0,"d":"0.0"},0,0,0,0,0,0,0,0,0,0,0,0,0,0,0,1,0,0,0,0,0,0,0,0,{"$nulls":5},{"v":0,"d":"0.0"}]
[41,{"$f":"'Wettkampf 1'!B56","v":"Schütze 41"},{"$f":"'Wettkampf 1'!C56","v":"Verein IX"},null,null,{"v":0,"d":"0.0"},0,0,0,0,0,0,0,0,0,0,0,0,0,0,0,0,0,1,0,0,0,0,0,0,{"$nulls":5},{"v":0,"d":"0.0"}]
[42,{"$f":"'Wettkampf 1'!B57","v":"Schütze 42"},{"$f":"'Wettkampf 1'!C57","v":"Verein IX"},null,null,{"v":0,"d":"0.0"},0,0,0,0,0,0,0,0,0,0,0,0,0,0,0,0,0,1,0,0,0,0,0,0,{"$nulls":5},{"v":0,"d":"0.0"}]
[43,{"$f":"'Wettkampf 1'!B58","v":"Schütze 43"},{"$f":"'Wettkampf 1'!C58","v":"Verein IX"},null,null,{"v":0,"d":"0.0"},0,0,0,0,0,0,0,0,0,0,0,0,0,0,0,0,0,1,0,0,0,0,0,0,{"$nulls":5},{"v":0,"d":"0.0"}]
[44,{"$f":"'Wettkampf 1'!B59","v":"Schütze 44"},{"$f":"'Wettkampf 1'!C59","v":"Verein IX"},null,null,{"v":0,"d":"0.0"},0,0,0,0,0,0,0,0,0,0,0,0,0,0,0,0,0,1,0,0,0,0,0,0,{"$nulls":5},{"v":0,"d":"0.0"}]
[45,{"$f":"'Wettkampf 1'!B60","v":"Schütze 45"},{"$f":"'Wettkampf 1'!C60","v":"Verein IX"},null,null,{"v":0,"d":"0.0"},0,0,0,0,0,0,0,0,0,0,0,0,0,0,0,0,0,1,0,0,0,0,0,0,{"$nulls":5},{"v":0,"d":"0.0"}]
[46,{"$f":"'Wettkampf 1'!B61","v":"Schütze 46"},{"$f":"'Wettkampf 1'!C61","v":"Verein X"},null,null,{"v":0,"d":"0.0"},0,0,0,0,0,0,0,0,0,0,0,0,0,0,0,0,0,0,0,1,0,0,0,0,{"$nulls":5},{"v":0,"d":"0.0"}]
[47,{"$f":"'Wettkampf 1'!B62","v":"Schütze 47"},{"$f":"'Wettkampf 1'!C62","v":"Verein X"},null,null,{"v":0,"d":"0.0"},0,0,0,0,0,0,0,0,0,0,0,0,0,0,0,0,0,0,0,1,0,0,0,0,{"$nulls":5},{"v":0,"d":"0.0"}]
[48,{"$f":"'Wettkampf 1'!B63","v":"Schütze 48"},{"$f":"'Wettkampf 1'!C63","v":"Verein X"},null,null,{"v":0,"d":"0.0"},0,0,0,0,0,0,0,0,0,0,0,0,0,0,0,0,0,0,0,1,0,0,0,0,{"$nulls":5},{"v":0,"d":"0.0"}]
[49,{"$f":"'Wettkampf 1'!B64","v":"Schütze 49"},{"$f":"'Wettkampf 1'!C64","v":"Verein X"},null,null,{"v":0,"d":"0.0"},0,0,0,0,0,0,0,0,0,0,0,0,0,0,0,0,0,0,0,1,0,0,0,0,{"$nulls":5},{"v":0,"d":"0.0"}]
[50,{"$f":"'Wettkampf 1'!B65","v":"Schütze 50"},{"$f":"'Wettkampf 1'!C65","v":"Verein X"},null,null,{"v":0,"d":"0.0"},0,0,0,0,0,0,0,0,0,0,0,0,0,0,0,0,0,0,0,1,0,0,0,0,{"$nulls":5},{"v":0,"d":"0.0"}]
[51,{"$f":"'Wettkampf 1'!B66","v":"Schütze 51"},{"$f":"'Wettkampf 1'!C66","v":"Verein XI"},null,null,{"v":0,"d":"0.0"},0,0,0,0,0,0,0,0,0,0,0,0,0,0,0,0,0,0,0,0,0,1,0,0,{"$nulls":5},{"v":0,"d":"0.0"}]
[52,{"$f":"'Wettkampf 1'!B67","v":"Schütze 52"},{"$f":"'Wettkampf 1'!C67","v":"Verein XI"},null,null,{"v":0,"d":"0.0"},0,0,0,0,0,0,0,0,0,0,0,0,0,0,0,0,0,0,0,0,0,1,0,0,{"$nulls":5},{"v":0,"d":"0.0"}]
[53,{"$f":"'Wettkampf 1'!B68","v":"Schütze 53"},{"$f":"'Wettkampf 1'!C68","v":"Verein XI"},null,null,{"v":0,"d":"0.0"},0,0,0,0,0,0,0,0,0,0,0,0,0,0,0,0,0,0,0,0,0,1,0,0,{"$nulls":5},{"v":0,"d":"0.0"}]
[54,{"$f":"'Wettkampf 1'!B69","v":"Schütze 54"},{"$f":"'Wettkampf 1'!C69","v":"Verein XI"},null,null,{"v":0,"d":"0.0"},0,0,0,0,0,0,0,0,0,0,0,0,0,0,0,0,0,0,0,0,0,1,0,0,{"$nulls":5},{"v":0,"d":"0.0"}]
[55,{"$f":"'Wettkampf 1'!B70","v":"Schütze 55"},{"$f":"'Wettkampf 1'!C70","v":"Verein XI"},null,null,{"v":0,"d":"0.0"},0,0,0,0,0,0,0,0,0,0,0,0,0,0,0,0,0,0,0,0,0,1,0,0,{"$nulls":5},{"v":0,"d":"0.0"}]
[56,{"$f":"'Wettkampf 1'!B71","v":"Schütze 56"},{"$f":"'Wettkampf 1'!C71","v":"Verein XII"},null,null,{"v":0,"d":"0.0"},0,0,0,0,0,0,0,0,0,0,0,0,0,0,0,0,0,0,0,0,0,0,0,1,{"$nulls":5},{"v":0,"d":"0.0"}]
[57,{"$f":"'Wettkampf 1'!B72","v":"Schütze 57"},{"$f":"'Wettkampf 1'!C72","v":"Verein XII"},null,null,{"v":0,"d":"0.0"},0,0,0,0,0,0,0,0,0,0,0,0,0,0,0,0,0,0,0,0,0,0,0,1,{"$nulls":5},{"v":0,"d":"0.0"}]
[58,{"$f":"'Wettkampf 1'!B73","v":"Schütze 58"},{"$f":"'Wettkampf 1'!C73","v":"Verein XII"},null,null,{"v":0,"d":"0.0"},0,0,0,0,0,0,0,0,0,0,0,0,0,0,0,0,0,0,0,0,0,0,0,1,{"$nulls":5},{"v":0,"d":"0.0"}]
[59,{"$f":"'Wettkampf 1'!B74","v":"Schütze 59"},{"$f":"'Wettkampf 1'!C74","v":"Verein XII"},null,null,{"v":0,"d":"0.0"},0,0,0,0,0,0,0,0,0,0,0,0,0,0,0,0,0,0,0,0,0,0,0,1,{"$nulls":5},{"v":0,"d":"0.0"}]
[60,{"$f":"'Wettkampf 1'!B75","v":"Schütze 60"},{"$f":"'Wettkampf 1'!C75","v":"Verein XII"},null,null,{"v":0,"d":"0.0"},0,0,0,0,0,0,0,0,0,0,0,0,0,0,0,0,0,0,0,0,0,0,0,1,{"$nulls":5},{"v":0,"d":"0.0"}]
[{"$nulls":6},{"$f":"LARGE(G16:G75,1)+LARGE(G16:G75,2)+LARGE(G16:G75,3)","v":507.7},{"$f":"SUM(H16:H75)","v":5},{"$f":"LARGE(I16:I75,1)+LARGE(I16:I75,2)+LARGE(I16:I75,3)","v":0},{"$f":"SUM(J16:J75)","v":4},{"$f":"LARGE(K16:K75,1)+LARGE(K16:K75,2)+LARGE(K16:K75,3)","v":372.1},{"$f":"SUM(L16:L75)","v":5},{"$f":"LARGE(M16:M75,1)+LARGE(M16:M75,2)+LARGE(M16:M75,3)","v":490.7},{"$f":"SUM(N16:N75)","v":5},{"$f":"LARGE(O16:O75,1)+LARGE(O16:O75,2)+LARGE(O16:O75,3)","v":560.7},{"$f":"SUM(P16:P75)","v":6},{"$f":"LARGE(Q16:Q75,1)+LARGE(Q16:Q75,2)+LARGE(Q16:Q75,3)","v":175.5},{"$f":"SUM(R16:R75)","v":4},{"$f":"LARGE(S16:S75,1)+LARGE(S16:S75,2)+LARGE(S16:S75,3)","v":0},{"$f":"SUM(T16:T75)","v":5},{"$f":"LARGE(U16:U75,1)+LARGE(U16:U75,2)+LARGE(U16:U75,3)","v":0},{"$f":"SUM(V16:V75)","v":3},{"$f":"LARGE(W16:W75,1)+LARGE(W16:W75,2)+LARGE(W16:W75,3)","v":0},{"$f":"SUM(X16:X75)","v":5},{"$f":"LARGE(Y16:Y75,1)+LARGE(Y16:Y75,2)+LARGE(Y16:Y75,3)","v":0},{"$f":"SUM(Z16:Z75)","v":5},{"$f":"LARGE(AA16:AA75,1)+LARGE(AA16:AA75,2)+LARGE(AA16:AA75,3)","v":0},{"$f":"SUM(AB16:AB75)","v":5},{"$f":"LARGE(AC16:AC75,1)+LARGE(AC16:AC75,2)+LARGE(AC16:AC75,3)","v":0},{"$f":"SUM(AD16:AD75)","v":5}]
[null,null,"per Email an: sk-huemmling@gmx.de"]

{"sheet":"10","index":10,"n_rows":77,"n_cols":39,"rows_kept":77,"merged":[[0,34,0,35],[1,34,1,35],[4,34,4,35],[5,34,5,35],[6,34,6,35],[14,32,14,35]]}
[null,"Verein / Gruppe",null,"Ergebnisse",{"$nulls":29},"Austragungsort:",{"$f":"Übersicht!O4","v":"Neubörger"}]
[1,{"$f":"'Wettkampf 1'!B2","v":"Lorup"},null,{"$f":"G76","v":{"v":458,"d":"458.0"}},{"$f":"IF(H76>4,\"Es sind zu viele Schützen in Wertung!\",\" \")","v":"Es sind zu viele Schützen in Wertung!"},{"$nulls":28},"Wettkampftag:",{"$f":"Übersicht!O3","v":"09.03."}]
[2,{"$f":"'Wettkampf 1'!B3","v":"Sögel"},null,{"$f":"I76","v":{"v":0,"d":"0.0"}},{"$f":"IF(J76>4,\"Es sind zu viele Schützen in Wertung!\",\" \")","v":" "}]
[3,{"$f":"'Wettkampf 1'!B4","v":"Spahnharenstätte"},null,{"$f":"K76","v":248.5},{"$f":"IF(L76>4,\"Es sind zu viele Schützen in Wertung!\",\" \")","v":"Es sind zu viele Schützen in Wertung!"},{"$nulls":30},"Ansprechpartner für Rückfragen:"]
[4,{"$f":"'Wettkampf 1'!B5","v":"Esterwegen"},null,{"$f":"M76","v":508.3},{"$f":"IF(N76>4,\"Es sind zu viele Schützen in Wertung!\",\" \")","v":"Es sind zu viele Schützen in Wertung!"},{"$nulls":28},"Name:","Anna Rosenboom"]
[5,{"$f":"'Wettkampf 1'!B6","v":"Lähden"},null,{"$f":"O76","v":{"v":562,"d":"562.0"}},{"$f":"IF(P76>4,\"Es sind zu viele Schützen in Wertung!\",\" \")","v":"Es sind zu viele Schützen in Wertung!"},{"$nulls":28},"Tel:"]
[6,{"$f":"'Wettkampf 1'!B7","v":"Börgermoor"},null,{"$f":"Q76","v":137.2},{"$f":"IF(R76>4,\"Es sind zu viele Schützen in Wertung!\",\" \")","v":" "},{"$nulls":28},"Standaufsicht:","Anna Rosenboom"]
[7,{"$f":"'Wettkampf 1'!B8","v":"Verein VII"},null,{"$f":"S76","v":{"v":0,"d":"0.0"}},{"$f":"IF(T76>4,\"Es sind zu viele Schützen in Wertung!\",\" \")","v":"Es sind zu viele Schützen in Wertung!"}]
[8,{"$f":"'Wettkampf 1'!B9","v":"Verein VIII"},null,{"$f":"U76","v":{"v":0,"d":"0.0"}},{"$f":"IF(V76>4,\"Es sind zu viele Schützen in Wertung!\",\" \")","v":" "}]
[9,{"$f":"'Wettkampf 1'!B10","v":"Verein IX"},null,{"$f":"W76","v":{"v":0,"d":"0.0"}},{"$f":"IF(X76>4,\"Es sind zu viele Schützen in Wertung!\",\" \")","v":"Es sind zu viele Schützen in Wertung!"}]
[10,{"$f":"'Wettkampf 1'!B11","v":"Verein X"},null,{"$f":"Y76","v":{"v":0,"d":"0.0"}},{"$f":"IF(Z76>4,\"Es sind zu viele Schützen in Wertung!\",\" \")","v":"Es sind zu viele Schützen in Wertung!"}]
[11,{"$f":"'Wettkampf 1'!B12","v":"Verein XI"},null,{"$f":"AA76","v":{"v":0,"d":"0.0"}},{"$f":"IF(AB76>4,\"Es sind zu viele Schützen in Wertung!\",\" \")","v":"Es sind zu viele Schützen in Wertung!"}]
[12,{"$f":"'Wettkampf 1'!B13","v":"Verein XII"},null,{"$f":"AC76","v":{"v":0,"d":"0.0"}},{"$f":"IF(AD76>4,\"Es sind zu viele Schützen in Wertung!\",\" \")","v":"Es sind zu viele Schützen in Wertung!"}]
[]
[null,"Einzelergebnisse:","Verein / Gruppe","Ergebnisse (mindestens 0 eintragen)","AW? Dann x eintippen",null,"Verein 1",null,"Verein 2",null,"Verein 3",null,"Verein 4",null,"Verein 5",null,"Verein 6",null,"Verein 7",null,"Verein 8",null,"Verein 9",null,"Verein 10",null,"Verein 11",null,"Verein 12",{"$nulls":3},"Proberechnung bei Streifen:"]
[1,{"$f":"'Wettkampf 1'!B16","v":"Wotte Lia"},{"$f":"'Wettkampf 1'!C16","v":"Lorup"},166.4,null,{"$f":"IF(E16=\"x\",\"0\",D16)","v":166.4},{"$f":"IF(C16=$B$2,F16,0)","v":166.4},{"$f":"(IF(AND($E16=\"\",$C16=$B$2),1,0))","v":1},{"$f":"IF($C16=$B$3,$F16,0)","v":0},{"$f":"(IF(AND($E16=\"\",$C16=$B$3),1,0))","v":0},{"$f":"IF($C16=$B$4,F16,0)","v":0},{"$f":"(IF(AND($E16=\"\",$C16=$B$4),1,0))","v":0},{"$f":"IF($C16=$B$5,F16,0)","v":0},{"$f":"(IF(AND($E16=\"\",$C16=$B$5),1,0))","v":0},{"$f":"IF($C16=$B$6,F16,0)","v":0},{"$f":"(IF(AND($E16=\"\",$C16=$B$6),1,0))","v":0},{"$f":"IF($C16=$B$7,F16,0)","v":0},{"$f":"(IF(AND($E16=\"\",$C16=$B$7),1,0))","v":0},{"$f":"IF($C16=$B$8,$F16,0)","v":0},{"$f":"(IF(AND($E16=\"\",$C16=$B$8),1,0))","v":0},{"$f":"IF($C16=$B$9,$F16,0)","v":0},{"$f":"(IF(AND($E16=\"\",$C16=$B$9),1,0))","v":0},{"$f":"IF($C16=$B$10,$F16,0)","v":0},{"$f":"(IF(AND($E16=\"\",$C16=$B$10),1,0))","v":0},{"$f":"IF($C16=$B$11,$F16,0)","v":0},{"$f":"(IF(AND($E16=\"\",$C16=$B$11),1,0))","v":0},{"$f":"IF($C16=$B$12,$F16,0)","v":0},{"$f":"(IF(AND($E16=\"\",$C16=$B$12),1,0))","v":0},{"$f":"IF($C16=$B$13,$F16,0)","v":0},{"$f":"(IF(AND($E16=\"\",$C16=$B$13),1,0))","v":0},{"$nulls":5},{"$f":"SUM(AG16:AI16)","v":{"v":0,"d":"0.0"}},{"$f":"IF(AJ16=D16,1,0)","v":0},{"$f":"IF(AJ16=0,0,1)","v":0},{"$f":"IF(AK16+AL16=2,\"Korrekt\",\"\")","v":""}]
[2,{"$f":"'Wettkampf 1'!B17","v":"Wotte Hannes"},{"$f":"'Wettkampf 1'!C17","v":"Lorup"},149.6,null,{"$f":"IF(E17=\"x\",\"0\",D17)","v":149.6},{"$f":"IF(C17=$B$2,F17,0)","v":149.6},{"$f":"(IF(AND($E17=\"\",$C17=$B$2),1,0))","v":1},{"$f":"IF($C17=$B$3,F17,0)","v":0},{"$f":"(IF(AND($E17=\"\",$C17=$B$3),1,0))","v":0},{"$f":"IF($C17=$B$4,F17,0)","v":0},{"$f":"(IF(AND($E17=\"\",$C17=$B$4),1,0))","v":0},{"$f":"IF($C17=$B$5,F17,0)","v":0},{"$f":"(IF(AND($E17=\"\",$C17=$B$5),1,0))","v":0},{"$f":"IF($C17=$B$6,F17,0)","v":0},{"$f":"(IF(AND($E17=\"\",$C17=$B$6),1,0))","v":0},{"$f":"IF($C17=$B$7,F17,0)","v":0},{"$f":"(IF(AND($E17=\"\",$C17=$B$7),1,0))","v":0},{"$f":"IF($C17=$B$8,$F17,0)","v":0},{"$f":"(IF(AND($E17=\"\",$C17=$B$8),1,0))","v":0},{"$f":"IF($C17=$B$9,$F17,0)","v":0},{"$f":"(IF(AND($E17=\"\",$C17=$B$9),1,0))","v":0},{"$f":"IF($C17=$B$10,$F17,0)","v":0},{"$f":"(IF(AND($E17=\"\",$C17=$B$10),1,0))","v":0},{"$f":"IF($C17=$B$11,$F17,0)","v":0},{"$f":"(IF(AND($E17=\"\",$C17=$B$11),1,0))","v":0},{"$f":"IF($C17=$B$12,$F17,0)","v":0},{"$f":"(IF(AND($E17=\"\",$C17=$B$12),1,0))","v":0},{"$f":"IF($C17=$B$13,$F17,0)","v":0},{"$f":"(IF(AND($E17=\"\",$C17=$B$13),1,0))","v":0},{"$nulls":5},{"$f":"SUM(AG17:AI17)","v":{"v":0,"d":"0.0"}},{"$f":"IF(AJ17=D17,1,0)","v":0},{"$f":"IF(AJ17=0,0,1)","v":0},{"$f":"IF(AK17+AL17=2,\"Korrekt\",\"\")","v":""}]
[3,{"$f":"'Wettkampf 1'!B18","v":"Gretenabeln Elias"},{"$f":"'Wettkampf 1'!C18","v":"Lorup"},{"v":142,"d":"142.0"},null,{"v":142,"d":"142.0"},142,1,0,0,0,0,0,0,0,0,0,0,0,0,0,0,0,0,0,0,0,0,0,0,{"$nulls":5},{"v":0,"d":"0.0"},0,0,""]
[4,{"$f":"'Wettkampf 1'!B19","v":"Helmer Maike"},{"$f":"'Wettkampf 1'!C19","v":"Lorup"},155.1,"x","0","0",0,0,0,0,0,0,0,0,0,0,0,0,0,0,0,0,0,0,0,0,0,0,0,{"$nulls":5},{"v":0,"d":"0.0"},0,0,""]
[5,{"$f":"'Wettkampf 1'!B20","v":"Többen Jannes"},{"$f":"'Wettkampf 1'!C20","v":"Lorup"},131.9,null,131.9,131.9,1,0,0,0,0,0,0,0,0,0,0,0,0,0,0,0,0,0,0,0,0,0,0,{"$nulls":5},{"v":0,"d":"0.0"},0,0,""]
[6,{"$f":"'Wettkampf 1'!B21","v":"Lüken Arne"},{"$f":"'Wettkampf 1'!C21","v":"Lorup"},null,null,{"v":0,"d":"0.0"},0,1,0,0,0,0,0,0,0,0,0,0,0,0,0,0,0,0,0,0,0,0,0,0,{"$nulls":5},{"v":0,"d":"0.0"},1,0,""]
[7,{"$f":"'Wettkampf 1'!B22","v":"Schütze 7"},{"$f":"'Wettkampf 1'!C22","v":"Sögel"},null,null,{"v":0,"d":"0.0"},0,0,0,1,0,0,0,0,0,0,0,0,0,0,0,0,0,0,0,0,0,0,0,0,{"$nulls":5},{"v":0,"d":"0.0"},1,0,""]
[8,{"$f":"'Wettkampf 1'!B23","v":"Schütze 8"},{"$f":"'Wettkampf 1'!C23","v":"Sögel"},null,null,{"v":0,"d":"0.0"},0,0,0,1,0,0,0,0,0,0,0,0,0,0,0,0,0,0,0,0,0,0,0,0,{"$nulls":5},{"v":0,"d":"0.0"},1,0,""]
[9,{"$f":"'Wettkampf 1'!B24","v":"Schütze 9"},{"$f":"'Wettkampf 1'!C24","v":"Sögel"},null,null,{"v":0,"d":"0.0"},0,0,0,1,0,0,0,0,0,0,0,0,0,0,0,0,0,0,0,0,0,0,0,0,{"$nulls":5},{"v":0,"d":"0.0"},1,0,""]
[10,{"$f":"'Wettkampf 1'!B25","v":"Schütze 10"},{"$f":"'Wettkampf 1'!C25","v":"Sögel"},null,null,{"v":0,"d":"0.0"},0,0,0,1,0,0,0,0,0,0,0,0,0,0,0,0,0,0,0,0,0,0,0,0,{"$nulls":5},{"v":0,"d":"0.0"},1,0,""]
[11,{"$f":"'Wettkampf 1'!B26","v":"Engbers Hannes"},{"$f":"'Wettkampf 1'!C26","v":"Spahnharenstätte"},101.5,null,101.5,0,0,0,0,101.5,1,0,0,0,0,0,0,0,0,0,0,0,0,0,0,0,0,0,0,{"$nulls":5},{"v":0,"d":"0.0"},0,0,""]
[12,{"$f":"'Wettkampf 1'!B27","v":"Runde Marcel"},{"$f":"'Wettkampf 1'!C27","v":"Spahnharenstätte"},{"v":147,"d":"147.0"},null,{"v":147,"d":"147.0"},0,0,0,0,147,1,0,0,0,0,0,0,0,0,0,0,0,0,0,0,0,0,0,0,{"$nulls":5},{"v":0,"d":"0.0"},0,0,""]
[13,{"$f":"'Wettkampf 1'!B28","v":"Jansen Lars"},{"$f":"'Wettkampf 1'!C28","v":"Spahnharenstätte"},null,null,{"v":0,"d":"0.0"},0,0,0,0,0,1,0,0,0,0,0,0,0,0,0,0,0,0,0,0,0,0,0,0,{"$nulls":5},{"v":0,"d":"0.0"},1,0,""]
[14,{"$f":"'Wettkampf 1'!B29","v":"Schütze 14"},{"$f":"'Wettkampf 1'!C29","v":"Spahnharenstätte"},null,null,{"v":0,"d":"0.0"},0,0,0,0,0,1,0,0,0,0,0,0,0,0,0,0,0,0,0,0,0,0,0,0,{"$nulls":5},{"v":0,"d":"0.0"},1,0,""]
[15,{"$f":"'Wettkampf 1'!B30","v":"Schütze 15"},{"$f":"'Wettkampf 1'!C30","v":"Spahnharenstätte"},null,null,{"v":0,"d":"0.0"},0,0,0,0,0,1,0,0,0,0,0,0,0,0,0,0,0,0,0,0,0,0,0,0,{"$nulls":5},{"v":0,"d":"0.0"},1,0,""]
[16,{"$f":"'Wettkampf 1'!B31","v":"Suhle Annalena"},{"$f":"'Wettkampf 1'!C31","v":"Esterwegen"},188.9,null,188.9,0,0,0,0,0,0,188.9,1,0,0,0,0,0,0,0,0,0,0,0,0,0,0,0,0,{"$nulls":5},{"v":0,"d":"0.0"},0,0,""]
[17,{"$f":"'Wettkampf 1'!B32","v":"Gäken Lena"},{"$f":"'Wettkampf 1'!C32","v":"Esterwegen"},179.6,null,179.6,0,0,0,0,0,0,179.6,1,0,0,0,0,0,0,0,0,0,0,0,0,0,0,0,0,{"$nulls":5},{"v":0,"d":"0.0"},0,0,""]
[18,{"$f":"'Wettkampf 1'!B33","v":"Jansen Daniel"},{"$f":"'Wettkampf 1'!C33","v":"Esterwegen"},139.8,null,139.8,0,0,0,0,0,0,139.8,1,0,0,0,0,0,0,0,0,0,0,0,0,0,0,0,0,{"$nulls":5},{"v":0,"d":"0.0"},0,0,""]
[19,{"$f":"'Wettkampf 1'!B34","v":"Pieper Jonas"},{"$f":"'Wettkampf 1'!C34","v":"Esterwegen"},117.2,null,117.2,0,0,0,0,0,0,117.2,1,0,0,0,0,0,0,0,0,0,0,0,0,0,0,0,0,{"$nulls":5},{"v":0,"d":"0.0"},0,0,""]
[20,{"$f":"'Wettkampf 1'!B35","v":"Schütze 20"},{"$f":"'Wettkampf 1'!C35","v":"Esterwegen"},null,null,{"v":0,"d":"0.0"},0,0,0,0,0,0,0,1,0,0,0,0,0,0,0,0,0,0,0,0,0,0,0,0,{"$nulls":5},{"v":0,"d":"0.0"},1,0,""]
[21,{"$f":"'Wettkampf 1'!B36","v":"Hellweg Thea"},{"$f":"'Wettkampf 1'!C36","v":"Lähden"},188.4,null,188.4,0,0,0,0,0,0,0,0,188.4,1,0,0,0,0,0,0,0,0,0,0,0,0,0,0,{"$nulls":5},{"v":0,"d":"0.0"},0,0,""]
[22,{"$f":"'Wettkampf 1'!B37","v":"Bruns Henrik"},{"$f":"'Wettkampf 1'!C37","v":"Lähden"},180.7,null,180.7,0,0,0,0,0,0,0,0,180.7,1,0,0,0,0,0,0,0,0,0,0,0,0,0,0,{"$nulls":5},{"v":0,"d":"0.0"},0,0,""]
[23,{"$f":"'Wettkampf 1'!B38","v":"Buschen Johann "},{"$f":"'Wettkampf 1'!C38","v":"Lähden"},184.5,null,184.5,0,0,0,0,0,0,0,0,184.5,1,0,0,0,0,0,0,0,0,0,0,0,0,0,0,{"$nulls":5},{"v":0,"d":"0.0"},0,0,""]
[24,{"$f":"'Wettkampf 1'!B39","v":"Preut Jannis"},{"$f":"'Wettkampf 1'!C39","v":"Lähden"},149.6,"x","0",0,0,0,0,0,0,0,0,"0",0,0,0,0,0,0,0,0,0,0,0,0,0,0,0,{"$nulls":5},{"v":0,"d":"0.0"},0,0,""]
[25,{"$f":"'Wettkampf 1'!B40","v":"Fleschenberg Jana"},{"$f":"'Wettkampf 1'!C40","v":"Lähden"},189.1,null,189.1,0,0,0,0,0,0,0,0,189.1,1,0,0,0,0,0,0,0,0,0,0,0,0,0,0,{"$nulls":5},{"v":0,"d":"0.0"},0,0,""]
[26,{"$f":"'Wettkampf 1'!B41","v":"von Seggern Moritz"},{"$f":"'Wettkampf 1'!C41","v":"Lähden"},162.8,"x","0",0,0,0,0,0,0,0,0,"0",0,0,0,0,0,0,0,0,0,0,0,0,0,0,0,{"$nulls":5},{"v":0,"d":"0.0"},0,0,""]
[27,{"$f":"'Wettkampf 1'!B42","v":"Kohnen Saskia"},{"$f":"'Wettkampf 1'!C42","v":"Börgermoor"},137.2,null,137.2,0,0,0,0,0,0,0,0,0,0,137.2,1,0,0,0,0,0,0,0,0,0,0,0,0,{"$nulls":5},{"v":0,"d":"0.0"},0,0,""]
[28,{"$f":"'Wettkampf 1'!B43","v":"Niemann Paul"},{"$f":"'Wettkampf 1'!C43","v":"Börgermoor"},null,null,{"v":0,"d":"0.0"},0,0,0,0,0,0,0,0,0,0,0,1,0,0,0,0,0,0,0,0,0,0,0,0,{"$nulls":5},{"v":0,"d":"0.0"},1,0,""]
[29,{"$f":"'Wettkampf 1'!B44","v":"Schütze 29"},{"$f":"'Wettkampf 1'!C44","v":"Börgermoor"},null,null,{"v":0,"d":"0.0"},0,0,0,0,0,0,0,0,0,0,0,1,0,0,0,0,0,0,0,0,0,0,0,0,{"$nulls":5},{"v":0,"d":"0.0"},1,0,""]
[30,{"$f":"'Wettkampf 1'!B45","v":"Schütze 30"},{"$f":"'Wettkampf 1'!C45","v":"Börgermoor"},null,null,{"v":0,"d":"0.0"},0,0,0,0,0,0,0,0,0,0,0,1,0,0,0,0,0,0,0,0,0,0,0,0,{"$nulls":5},{"v":0,"d":"0.0"},1,0,""]
[31,{"$f":"'Wettkampf 1'!B46","v":"Stümpler Jan Luka "},{"$f":"'Wettkampf 1'!C46","v":"Lähden"},null,null,{"v":0,"d":"0.0"},0,0,0,0,0,0,0,0,0,1,0,0,0,0,0,0,0,0,0,0,0,0,0,0,{"$nulls":5},{"v":0,"d":"0.0"},1,0,""]
[32,{"$f":"'Wettkampf 1'!B47","v":"Helmer, Nils"},{"$f":"'Wettkampf 1'!C47","v":"Lorup"},100.1,"x","0","0",0,0,0,0,0,0,0,0,0,0,0,0,0,0,0,0,0,0,0,0,0,0,0,{"$nulls":5},{"v":0,"d":"0.0"},0,0,""]
[33,{"$f":"'Wettkampf 1'!B48","v":"Schütze 33"},{"$f":"'Wettkampf 1'!C48","v":"Verein VII"},null,null,{"v":0,"d":"0.0"},0,0,0,0,0,0,0,0,0,0,0,0,0,1,0,0,0,0,0,0,0,0,0,0,{"$nulls":5},{"v":0,"d":"0.0"},1,0,""]
[34,{"$f":"'Wettkampf 1'!B49","v":"Schütze 34"},{"$f":"'Wettkampf 1'!C49","v":"Verein VII"},null,null,{"v":0,"d":"0.0"},0,0,0,0,0,0,0,0,0,0,0,0,0,1,0,0,0,0,0,0,0,0,0,0,{"$nulls":5},{"v":0,"d":"0.0"},1,0,""]
[35,{"$f":"'Wettkampf 1'!B50","v":"Schütze 35"},{"$f":"'Wettkampf 1'!C50","v":"Verein VII"},null,null,{"v":0,"d":"0.0"},0,0,0,0,0,0,0,0,0,0,0,0,0,1,0,0,0,0,0,0,0,0,0,0,{"$nulls":5},{"v":0,"d":"0.0"},1,0,""]
[36,{"$f":"'Wettkampf 1'!B51","v":"Schütze 36"},{"$f":"'Wettkampf 1'!C51","v":"Verein VII"},null,null,{"v":0,"d":"0.0"},0,0,0,0,0,0,0,0,0,0,0,0,0,1,0,0,0,0,0,0,0,0,0,0,{"$nulls":5},{"v":0,"d":"0.0"},1,0,""]
[37,{"$f":"'Wettkampf 1'!B52","v":"Schütze 37"},{"$f":"'Wettkampf 1'!C52","v":"Verein VII"},null,null,{"v":0,"d":"0.0"},0,0,0,0,0,0,0,0,0,0,0,0,0,1,0,0,0,0,0,0,0,0,0,0,{"$nulls":5},{"v":0,"d":"0.0"}]
[38,{"$f":"'Wettkampf 1'!B53","v":"Schütze 38"},{"$f":"'Wettkampf 1'!C53","v":"Verein VIII"},null,null,{"v":0,"d":"0.0"},0,0,0,0,0,0,0,0,0,0,0,0,0,0,0,1,0,0,0,0,0,0,0,0,{"$nulls":5},{"v":0,"d":"0.0"}]
[39,{"$f":"'Wettkampf 1'!B54","v":"Schütze 39"},{"$f":"'Wettkampf 1'!C54","v":"Verein VIII"},null,null,{"v":0,"d":"0.0"},0,0,0,0,0,0,0,0,0,0,0,0,{"$f":"IF($C54=$B$8,$F54,0)","v":0},{"$f":"(IF(AND($E54=\"\",$C54=$B$8),1,0))","v":0},{"$f":"IF($C54=$B$9,$F54,0)","v":0},{"$f":"(IF(AND($E54=\"\",$C54=$B$9),1,0))","v":1},{"$f":"IF($C54=$B$10,$F54,0)","v":0},{"$f":"(IF(AND($E54=\"\",$C54=$B$10),1,0))","v":0},{"$f":"IF($C54=$B$11,$F54,0)","v":0},{"$f":"(IF(AND($E54=\"\",$C54=$B$11),1,0))","v":0},{"$f":"IF($C54=$B$12,$F54,0)","v":0},{"$f":"(IF(AND($E54=\"\",$C54=$B$12),1,0))","v":0},{"$f":"IF($C54=$B$13,$F54,0)","v":0},{"$f":"(IF(AND($E54=\"\",$C54=$B$13),1,0))","v":0},{"$nulls":5},{"v":0,"d":"0.0"}]
[40,{"$f":"'Wettkampf 1'!B55","v":"Schütze 40"},{"$f":"'Wettkampf 1'!C55","v":"Verein VIII"},null,null,{"v":0,"d":"0.0"},0,0,0,0,0,0,0,0,0,0,0,0,0,0,0,1,0,0,0,0,0,0,0,0,{"$nulls":5},{"v":0,"d":"0.0"}]
[41,{"$f":"'Wettkampf 1'!B56","v":"Schütze 41"},{"$f":"'Wettkampf 1'!C56","v":"Verein IX"},null,null,{"v":0,"d":"0.0"},0,0,0,0,0,0,0,0,0,0,0,0,0,0,0,0,0,1,0,0,0,0,0,0,{"$nulls":5},{"v":0,"d":"0.0"}]
[42,{"$f":"'Wettkampf 1'!B57","v":"Schütze 42"},{"$f":"'Wettkampf 1'!C57","v":"Verein IX"},null,null,{"v":0,"d":"0.0"},0,0,0,0,0,0,0,0,0,0,0,0,0,0,0,0,0,1,0,0,0,0,0,0,{"$nulls":5},{"v":0,"d":"0.0"}]
[43,{"$f":"'Wettkampf 1'!B58","v":"Schütze 43"},{"$f":"'Wettkampf 1'!C58","v":"Verein IX"},null,null,{"v":0,"d":"0.0"},0,0,0,0,0,0,0,0,0,0,0,0,0,0,0,0,0,1,0,0,0,0,0,0,{"$nulls":5},{"v":0,"d":"0.0"}]
[44,{"$f":"'Wettkampf 1'!B59","v":"Schütze 44"},{"$f":"'Wettkampf 1'!C59","v":"Verein IX"},null,null,{"v":0,"d":"0.0"},0,0,0,0,0,0,0,0,0,0,0,0,0,0,0,0,0,1,0,0,0,0,0,0,{"$nulls":5},{"v":0,"d":"0.0"}]
[45,{"$f":"'Wettkampf 1'!B60","v":"Schütze 45"},{"$f":"'Wettkampf 1'!C60","v":"Verein IX"},null,null,{"v":0,"d":"0.0"},0,0,0,0,0,0,0,0,0,0,0,0,0,0,0,0,0,1,0,0,0,0,0,0,{"$nulls":5},{"v":0,"d":"0.0"}]
[46,{"$f":"'Wettkampf 1'!B61","v":"Schütze 46"},{"$f":"'Wettkampf 1'!C61","v":"Verein X"},null,null,{"v":0,"d":"0.0"},0,0,0,0,0,0,0,0,0,0,0,0,0,0,0,0,0,0,0,1,0,0,0,0,{"$nulls":5},{"v":0,"d":"0.0"}]
[47,{"$f":"'Wettkampf 1'!B62","v":"Schütze 47"},{"$f":"'Wettkampf 1'!C62","v":"Verein X"},null,null,{"v":0,"d":"0.0"},0,0,0,0,0,0,0,0,0,0,0,0,0,0,0,0,0,0,0,1,0,0,0,0,{"$nulls":5},{"v":0,"d":"0.0"}]
[48,{"$f":"'Wettkampf 1'!B63","v":"Schütze 48"},{"$f":"'Wettkampf 1'!C63","v":"Verein X"},null,null,{"v":0,"d":"0.0"},0,0,0,0,0,0,0,0,0,0,0,0,0,0,0,0,0,0,0,1,0,0,0,0,{"$nulls":5},{"v":0,"d":"0.0"}]
[49,{"$f":"'Wettkampf 1'!B64","v":"Schütze 49"},{"$f":"'Wettkampf 1'!C64","v":"Verein X"},null,null,{"v":0,"d":"0.0"},0,0,0,0,0,0,0,0,0,0,0,0,0,0,0,0,0,0,0,1,0,0,0,0,{"$nulls":5},{"v":0,"d":"0.0"}]
[50,{"$f":"'Wettkampf 1'!B65","v":"Schütze 50"},{"$f":"'Wettkampf 1'!C65","v":"Verein X"},null,null,{"v":0,"d":"0.0"},0,0,0,0,0,0,0,0,0,0,0,0,0,0,0,0,0,0,0,1,0,0,0,0,{"$nulls":5},{"v":0,"d":"0.0"}]
[51,{"$f":"'Wettkampf 1'!B66","v":"Schütze 51"},{"$f":"'Wettkampf 1'!C66","v":"Verein XI"},null,null,{"v":0,"d":"0.0"},0,0,0,0,0,0,0,0,0,0,0,0,0,0,0,0,0,0,0,0,0,1,0,0,{"$nulls":5},{"v":0,"d":"0.0"}]
[52,{"$f":"'Wettkampf 1'!B67","v":"Schütze 52"},{"$f":"'Wettkampf 1'!C67","v":"Verein XI"},null,null,{"v":0,"d":"0.0"},0,0,0,0,0,0,0,0,0,0,0,0,0,0,0,0,0,0,0,0,0,1,0,0,{"$nulls":5},{"v":0,"d":"0.0"}]
[53,{"$f":"'Wettkampf 1'!B68","v":"Schütze 53"},{"$f":"'Wettkampf 1'!C68","v":"Verein XI"},null,null,{"v":0,"d":"0.0"},0,0,0,0,0,0,0,0,0,0,0,0,0,0,0,0,0,0,0,0,0,1,0,0,{"$nulls":5},{"v":0,"d":"0.0"}]
[54,{"$f":"'Wettkampf 1'!B69","v":"Schütze 54"},{"$f":"'Wettkampf 1'!C69","v":"Verein XI"},null,null,{"v":0,"d":"0.0"},0,0,0,0,0,0,0,0,0,0,0,0,0,0,0,0,0,0,0,0,0,1,0,0,{"$nulls":5},{"v":0,"d":"0.0"}]
[55,{"$f":"'Wettkampf 1'!B70","v":"Schütze 55"},{"$f":"'Wettkampf 1'!C70","v":"Verein XI"},null,null,{"v":0,"d":"0.0"},0,0,0,0,0,0,0,0,0,0,0,0,0,0,0,0,0,0,0,0,0,1,0,0,{"$nulls":5},{"v":0,"d":"0.0"}]
[56,{"$f":"'Wettkampf 1'!B71","v":"Schütze 56"},{"$f":"'Wettkampf 1'!C71","v":"Verein XII"},null,null,{"v":0,"d":"0.0"},0,0,0,0,0,0,0,0,0,0,0,0,0,0,0,0,0,0,0,0,0,0,0,1,{"$nulls":5},{"v":0,"d":"0.0"}]
[57,{"$f":"'Wettkampf 1'!B72","v":"Schütze 57"},{"$f":"'Wettkampf 1'!C72","v":"Verein XII"},null,null,{"v":0,"d":"0.0"},0,0,0,0,0,0,0,0,0,0,0,0,0,0,0,0,0,0,0,0,0,0,0,1,{"$nulls":5},{"v":0,"d":"0.0"}]
[58,{"$f":"'Wettkampf 1'!B73","v":"Schütze 58"},{"$f":"'Wettkampf 1'!C73","v":"Verein XII"},null,null,{"v":0,"d":"0.0"},0,0,0,0,0,0,0,0,0,0,0,0,0,0,0,0,0,0,0,0,0,0,0,1,{"$nulls":5},{"v":0,"d":"0.0"}]
[59,{"$f":"'Wettkampf 1'!B74","v":"Schütze 59"},{"$f":"'Wettkampf 1'!C74","v":"Verein XII"},null,null,{"v":0,"d":"0.0"},0,0,0,0,0,0,0,0,0,0,0,0,0,0,0,0,0,0,0,0,0,0,0,1,{"$nulls":5},{"v":0,"d":"0.0"}]
[60,{"$f":"'Wettkampf 1'!B75","v":"Schütze 60"},{"$f":"'Wettkampf 1'!C75","v":"Verein XII"},null,null,{"v":0,"d":"0.0"},0,0,0,0,0,0,0,0,0,0,0,0,0,0,0,0,0,0,0,0,0,0,0,1,{"$nulls":5},{"v":0,"d":"0.0"}]
[{"$nulls":6},{"$f":"LARGE(G16:G75,1)+LARGE(G16:G75,2)+LARGE(G16:G75,3)","v":458},{"$f":"SUM(H16:H75)","v":5},{"$f":"LARGE(I16:I75,1)+LARGE(I16:I75,2)+LARGE(I16:I75,3)","v":0},{"$f":"SUM(J16:J75)","v":4},{"$f":"LARGE(K16:K75,1)+LARGE(K16:K75,2)+LARGE(K16:K75,3)","v":248.5},{"$f":"SUM(L16:L75)","v":5},{"$f":"LARGE(M16:M75,1)+LARGE(M16:M75,2)+LARGE(M16:M75,3)","v":508.3},{"$f":"SUM(N16:N75)","v":5},{"$f":"LARGE(O16:O75,1)+LARGE(O16:O75,2)+LARGE(O16:O75,3)","v":562},{"$f":"SUM(P16:P75)","v":5},{"$f":"LARGE(Q16:Q75,1)+LARGE(Q16:Q75,2)+LARGE(Q16:Q75,3)","v":137.2},{"$f":"SUM(R16:R75)","v":4},{"$f":"LARGE(S16:S75,1)+LARGE(S16:S75,2)+LARGE(S16:S75,3)","v":0},{"$f":"SUM(T16:T75)","v":5},{"$f":"LARGE(U16:U75,1)+LARGE(U16:U75,2)+LARGE(U16:U75,3)","v":0},{"$f":"SUM(V16:V75)","v":3},{"$f":"LARGE(W16:W75,1)+LARGE(W16:W75,2)+LARGE(W16:W75,3)","v":0},{"$f":"SUM(X16:X75)","v":5},{"$f":"LARGE(Y16:Y75,1)+LARGE(Y16:Y75,2)+LARGE(Y16:Y75,3)","v":0},{"$f":"SUM(Z16:Z75)","v":5},{"$f":"LARGE(AA16:AA75,1)+LARGE(AA16:AA75,2)+LARGE(AA16:AA75,3)","v":0},{"$f":"SUM(AB16:AB75)","v":5},{"$f":"LARGE(AC16:AC75,1)+LARGE(AC16:AC75,2)+LARGE(AC16:AC75,3)","v":0},{"$f":"SUM(AD16:AD75)","v":5}]
[null,null,"per Email an: sk-huemmling@gmx.de"]

{"sheet":"11","index":11,"n_rows":77,"n_cols":39,"rows_kept":77,"merged":[[0,34,0,35],[1,34,1,35],[4,34,4,35],[5,34,5,35],[6,34,6,35],[14,32,14,35]]}
[null,"Verein / Gruppe",null,"Ergebnisse",{"$nulls":29},"Austragungsort:",{"$f":"Übersicht!P4","v":"Sögel"}]
[1,{"$f":"'Wettkampf 1'!B2","v":"Lorup"},null,{"$f":"G76","v":500.4},{"$f":"IF(H76>4,\"Es sind zu viele Schützen in Wertung!\",\" \")","v":"Es sind zu viele Schützen in Wertung!"},{"$nulls":28},"Wettkampftag:",{"$f":"Übersicht!P3","v":"06.04."}]
[2,{"$f":"'Wettkampf 1'!B3","v":"Sögel"},null,{"$f":"I76","v":{"v":0,"d":"0.0"}},{"$f":"IF(J76>4,\"Es sind zu viele Schützen in Wertung!\",\" \")","v":" "}]
[3,{"$f":"'Wettkampf 1'!B4","v":"Spahnharenstätte"},null,{"$f":"K76","v":294.7},{"$f":"IF(L76>4,\"Es sind zu viele Schützen in Wertung!\",\" \")","v":"Es sind zu viele Schützen in Wertung!"},{"$nulls":30},"Ansprechpartner für Rückfragen:"]
[4,{"$f":"'Wettkampf 1'!B5","v":"Esterwegen"},null,{"$f":"M76","v":{"v":508,"d":"508.0"}},{"$f":"IF(N76>4,\"Es sind zu viele Schützen in Wertung!\",\" \")","v":"Es sind zu viele Schützen in Wertung!"},{"$nulls":28},"Name:","Wester"]
[5,{"$f":"'Wettkampf 1'!B6","v":"Lähden"},null,{"$f":"O76","v":{"v":559.5999999999999,"d":"559.6"}},{"$f":"IF(P76>4,\"Es sind zu viele Schützen in Wertung!\",\" \")","v":"Es sind zu viele Schützen in Wertung!"},{"$nulls":28},"Tel:"]
[6,{"$f":"'Wettkampf 1'!B7","v":"Börgermoor"},null,{"$f":"Q76","v":160.3},{"$f":"IF(R76>4,\"Es sind zu viele Schützen in Wertung!\",\" \")","v":" "},{"$nulls":28},"Standaufsicht:","eintragen"]
[7,{"$f":"'Wettkampf 1'!B8","v":"Verein VII"},null,{"$f":"S76","v":{"v":0,"d":"0.0"}},{"$f":"IF(T76>4,\"Es sind zu viele Schützen in Wertung!\",\" \")","v":"Es sind zu viele Schützen in Wertung!"}]
[8,{"$f":"'Wettkampf 1'!B9","v":"Verein VIII"},null,{"$f":"U76","v":{"v":0,"d":"0.0"}},{"$f":"IF(V76>4,\"Es sind zu viele Schützen in Wertung!\",\" \")","v":" "}]
[9,{"$f":"'Wettkampf 1'!B10","v":"Verein IX"},null,{"$f":"W76","v":{"v":0,"d":"0.0"}},{"$f":"IF(X76>4,\"Es sind zu viele Schützen in Wertung!\",\" \")","v":"Es sind zu viele Schützen in Wertung!"}]
[10,{"$f":"'Wettkampf 1'!B11","v":"Verein X"},null,{"$f":"Y76","v":{"v":0,"d":"0.0"}},{"$f":"IF(Z76>4,\"Es sind zu viele Schützen in Wertung!\",\" \")","v":"Es sind zu viele Schützen in Wertung!"}]
[11,{"$f":"'Wettkampf 1'!B12","v":"Verein XI"},null,{"$f":"AA76","v":{"v":0,"d":"0.0"}},{"$f":"IF(AB76>4,\"Es sind zu viele Schützen in Wertung!\",\" \")","v":"Es sind zu viele Schützen in Wertung!"}]
[12,{"$f":"'Wettkampf 1'!B13","v":"Verein XII"},null,{"$f":"AC76","v":{"v":0,"d":"0.0"}},{"$f":"IF(AD76>4,\"Es sind zu viele Schützen in Wertung!\",\" \")","v":"Es sind zu viele Schützen in Wertung!"}]
[]
[null,"Einzelergebnisse:","Verein / Gruppe","Ergebnisse (mindestens 0 eintragen)","AW? Dann x eintippen",null,"Verein 1",null,"Verein 2",null,"Verein 3",null,"Verein 4",null,"Verein 5",null,"Verein 6",null,"Verein 7",null,"Verein 8",null,"Verein 9",null,"Verein 10",null,"Verein 11",null,"Verein 12",{"$nulls":3},"Proberechnung bei Streifen:"]
[1,{"$f":"'Wettkampf 1'!B16","v":"Wotte Lia"},{"$f":"'Wettkampf 1'!C16","v":"Lorup"},182.2,null,{"$f":"IF(E16=\"x\",\"0\",D16)","v":182.2},{"$f":"IF(C16=$B$2,F16,0)","v":182.2},{"$f":"(IF(AND($E16=\"\",$C16=$B$2),1,0))","v":1},{"$f":"IF($C16=$B$3,$F16,0)","v":0},{"$f":"(IF(AND($E16=\"\",$C16=$B$3),1,0))","v":0},{"$f":"IF($C16=$B$4,F16,0)","v":0},{"$f":"(IF(AND($E16=\"\",$C16=$B$4),1,0))","v":0},{"$f":"IF($C16=$B$5,F16,0)","v":0},{"$f":"(IF(AND($E16=\"\",$C16=$B$5),1,0))","v":0},{"$f":"IF($C16=$B$6,F16,0)","v":0},{"$f":"(IF(AND($E16=\"\",$C16=$B$6),1,0))","v":0},{"$f":"IF($C16=$B$7,F16,0)","v":0},{"$f":"(IF(AND($E16=\"\",$C16=$B$7),1,0))","v":0},{"$f":"IF($C16=$B$8,$F16,0)","v":0},{"$f":"(IF(AND($E16=\"\",$C16=$B$8),1,0))","v":0},{"$f":"IF($C16=$B$9,$F16,0)","v":0},{"$f":"(IF(AND($E16=\"\",$C16=$B$9),1,0))","v":0},{"$f":"IF($C16=$B$10,$F16,0)","v":0},{"$f":"(IF(AND($E16=\"\",$C16=$B$10),1,0))","v":0},{"$f":"IF($C16=$B$11,$F16,0)","v":0},{"$f":"(IF(AND($E16=\"\",$C16=$B$11),1,0))","v":0},{"$f":"IF($C16=$B$12,$F16,0)","v":0},{"$f":"(IF(AND($E16=\"\",$C16=$B$12),1,0))","v":0},{"$f":"IF($C16=$B$13,$F16,0)","v":0},{"$f":"(IF(AND($E16=\"\",$C16=$B$13),1,0))","v":0},{"$nulls":5},{"$f":"SUM(AG16:AI16)","v":{"v":0,"d":"0.0"}},{"$f":"IF(AJ16=D16,1,0)","v":0},{"$f":"IF(AJ16=0,0,1)","v":0},{"$f":"IF(AK16+AL16=2,\"Korrekt\",\"\")","v":""}]
[2,{"$f":"'Wettkampf 1'!B17","v":"Wotte Hannes"},{"$f":"'Wettkampf 1'!C17","v":"Lorup"},140.3,null,{"$f":"IF(E17=\"x\",\"0\",D17)","v":140.3},{"$f":"IF(C17=$B$2,F17,0)","v":140.3},{"$f":"(IF(AND($E17=\"\",$C17=$B$2),1,0))","v":1},{"$f":"IF($C17=$B$3,F17,0)","v":0},{"$f":"(IF(AND($E17=\"\",$C17=$B$3),1,0))","v":0},{"$f":"IF($C17=$B$4,F17,0)","v":0},{"$f":"(IF(AND($E17=\"\",$C17=$B$4),1,0))","v":0},{"$f":"IF($C17=$B$5,F17,0)","v":0},{"$f":"(IF(AND($E17=\"\",$C17=$B$5),1,0))","v":0},{"$f":"IF($C17=$B$6,F17,0)","v":0},{"$f":"(IF(AND($E17=\"\",$C17=$B$6),1,0))","v":0},{"$f":"IF($C17=$B$7,F17,0)","v":0},{"$f":"(IF(AND($E17=\"\",$C17=$B$7),1,0))","v":0},{"$f":"IF($C17=$B$8,$F17,0)","v":0},{"$f":"(IF(AND($E17=\"\",$C17=$B$8),1,0))","v":0},{"$f":"IF($C17=$B$9,$F17,0)","v":0},{"$f":"(IF(AND($E17=\"\",$C17=$B$9),1,0))","v":0},{"$f":"IF($C17=$B$10,$F17,0)","v":0},{"$f":"(IF(AND($E17=\"\",$C17=$B$10),1,0))","v":0},{"$f":"IF($C17=$B$11,$F17,0)","v":0},{"$f":"(IF(AND($E17=\"\",$C17=$B$11),1,0))","v":0},{"$f":"IF($C17=$B$12,$F17,0)","v":0},{"$f":"(IF(AND($E17=\"\",$C17=$B$12),1,0))","v":0},{"$f":"IF($C17=$B$13,$F17,0)","v":0},{"$f":"(IF(AND($E17=\"\",$C17=$B$13),1,0))","v":0},{"$nulls":5},{"$f":"SUM(AG17:AI17)","v":{"v":0,"d":"0.0"}},{"$f":"IF(AJ17=D17,1,0)","v":0},{"$f":"IF(AJ17=0,0,1)","v":0},{"$f":"IF(AK17+AL17=2,\"Korrekt\",\"\")","v":""}]
[3,{"$f":"'Wettkampf 1'!B18","v":"Gretenabeln Elias"},{"$f":"'Wettkampf 1'!C18","v":"Lorup"},148.2,null,148.2,148.2,1,0,0,0,0,0,0,0,0,0,0,0,0,0,0,0,0,0,0,0,0,0,0,{"$nulls":5},{"v":0,"d":"0.0"},0,0,""]
[4,{"$f":"'Wettkampf 1'!B19","v":"Helmer Maike"},{"$f":"'Wettkampf 1'!C19","v":"Lorup"},{"v":170,"d":"170.0"},null,{"v":170,"d":"170.0"},170,1,0,0,0,0,0,0,0,0,0,0,0,0,0,0,0,0,0,0,0,0,0,0,{"$nulls":5},{"v":0,"d":"0.0"},0,0,""]
[5,{"$f":"'Wettkampf 1'!B20","v":"Többen Jannes"},{"$f":"'Wettkampf 1'!C20","v":"Lorup"},128.3,"x","0","0",0,0,0,0,0,0,0,0,0,0,0,0,0,0,0,0,0,0,0,0,0,0,0,{"$nulls":5},{"v":0,"d":"0.0"},0,0,""]
[6,{"$f":"'Wettkampf 1'!B21","v":"Lüken Arne"},{"$f":"'Wettkampf 1'!C21","v":"Lorup"},null,null,{"v":0,"d":"0.0"},0,1,0,0,0,0,0,0,0,0,0,0,0,0,0,0,0,0,0,0,0,0,0,0,{"$nulls":5},{"v":0,"d":"0.0"},1,0,""]
[7,{"$f":"'Wettkampf 1'!B22","v":"Schütze 7"},{"$f":"'Wettkampf 1'!C22","v":"Sögel"},null,null,{"v":0,"d":"0.0"},0,0,0,1,0,0,0,0,0,0,0,0,0,0,0,0,0,0,0,0,0,0,0,0,{"$nulls":5},{"v":0,"d":"0.0"},1,0,""]
[8,{"$f":"'Wettkampf 1'!B23","v":"Schütze 8"},{"$f":"'Wettkampf 1'!C23","v":"Sögel"},null,null,{"v":0,"d":"0.0"},0,0,0,1,0,0,0,0,0,0,0,0,0,0,0,0,0,0,0,0,0,0,0,0,{"$nulls":5},{"v":0,"d":"0.0"},1,0,""]
[9,{"$f":"'Wettkampf 1'!B24","v":"Schütze 9"},{"$f":"'Wettkampf 1'!C24","v":"Sögel"},null,null,{"v":0,"d":"0.0"},0,0,0,1,0,0,0,0,0,0,0,0,0,0,0,0,0,0,0,0,0,0,0,0,{"$nulls":5},{"v":0,"d":"0.0"},1,0,""]
[10,{"$f":"'Wettkampf 1'!B25","v":"Schütze 10"},{"$f":"'Wettkampf 1'!C25","v":"Sögel"},null,null,{"v":0,"d":"0.0"},0,0,0,1,0,0,0,0,0,0,0,0,0,0,0,0,0,0,0,0,0,0,0,0,{"$nulls":5},{"v":0,"d":"0.0"},1,0,""]
[11,{"$f":"'Wettkampf 1'!B26","v":"Engbers Hannes"},{"$f":"'Wettkampf 1'!C26","v":"Spahnharenstätte"},null,null,{"v":0,"d":"0.0"},0,0,0,0,0,1,0,0,0,0,0,0,0,0,0,0,0,0,0,0,0,0,0,0,{"$nulls":5},{"v":0,"d":"0.0"},1,0,""]
[12,{"$f":"'Wettkampf 1'!B27","v":"Runde Marcel"},{"$f":"'Wettkampf 1'!C27","v":"Spahnharenstätte"},{"v":154,"d":"154.0"},null,{"v":154,"d":"154.0"},0,0,0,0,154,1,0,0,0,0,0,0,0,0,0,0,0,0,0,0,0,0,0,0,{"$nulls":5},{"v":0,"d":"0.0"},0,0,""]
[13,{"$f":"'Wettkampf 1'!B28","v":"Jansen Lars"},{"$f":"'Wettkampf 1'!C28","v":"Spahnharenstätte"},140.7,null,140.7,0,0,0,0,140.7,1,0,0,0,0,0,0,0,0,0,0,0,0,0,0,0,0,0,0,{"$nulls":5},{"v":0,"d":"0.0"},0,0,""]
[14,{"$f":"'Wettkampf 1'!B29","v":"Schütze 14"},{"$f":"'Wettkampf 1'!C29","v":"Spahnharenstätte"},null,null,{"v":0,"d":"0.0"},0,0,0,0,0,1,0,0,0,0,0,0,0,0,0,0,0,0,0,0,0,0,0,0,{"$nulls":5},{"v":0,"d":"0.0"},1,0,""]
[15,{"$f":"'Wettkampf 1'!B30","v":"Schütze 15"},{"$f":"'Wettkampf 1'!C30","v":"Spahnharenstätte"},null,null,{"v":0,"d":"0.0"},0,0,0,0,0,1,0,0,0,0,0,0,0,0,0,0,0,0,0,0,0,0,0,0,{"$nulls":5},{"v":0,"d":"0.0"},1,0,""]
[16,{"$f":"'Wettkampf 1'!B31","v":"Suhle Annalena"},{"$f":"'Wettkampf 1'!C31","v":"Esterwegen"},196.1,null,196.1,0,0,0,0,0,0,196.1,1,0,0,0,0,0,0,0,0,0,0,0,0,0,0,0,0,{"$nulls":5},{"v":0,"d":"0.0"},0,0,""]
[17,{"$f":"'Wettkampf 1'!B32","v":"Gäken Lena"},{"$f":"'Wettkampf 1'!C32","v":"Esterwegen"},{"v":188,"d":"188.0"},null,{"v":188,"d":"188.0"},0,0,0,0,0,0,188,1,0,0,0,0,0,0,0,0,0,0,0,0,0,0,0,0,{"$nulls":5},{"v":0,"d":"0.0"},0,0,""]
[18,{"$f":"'Wettkampf 1'!B33","v":"Jansen Daniel"},{"$f":"'Wettkampf 1'!C33","v":"Esterwegen"},123.9,null,123.9,0,0,0,0,0,0,123.9,1,0,0,0,0,0,0,0,0,0,0,0,0,0,0,0,0,{"$nulls":5},{"v":0,"d":"0.0"},0,0,""]
[19,{"$f":"'Wettkampf 1'!B34","v":"Pieper Jonas"},{"$f":"'Wettkampf 1'!C34","v":"Esterwegen"},null,null,{"v":0,"d":"0.0"},0,0,0,0,0,0,0,1,0,0,0,0,0,0,0,0,0,0,0,0,0,0,0,0,{"$nulls":5},{"v":0,"d":"0.0"},1,0,""]
[20,{"$f":"'Wettkampf 1'!B35","v":"Schütze 20"},{"$f":"'Wettkampf 1'!C35","v":"Esterwegen"},null,null,{"v":0,"d":"0.0"},0,0,0,0,0,0,0,1,0,0,0,0,0,0,0,0,0,0,0,0,0,0,0,0,{"$nulls":5},{"v":0,"d":"0.0"},1,0,""]
[21,{"$f":"'Wettkampf 1'!B36","v":"Hellweg Thea"},{"$f":"'Wettkampf 1'!C36","v":"Lähden"},181.7,null,181.7,0,0,0,0,0,0,0,0,181.7,1,0,0,0,0,0,0,0,0,0,0,0,0,0,0,{"$nulls":5},{"v":0,"d":"0.0"},0,0,""]
[22,{"$f":"'Wettkampf 1'!B37","v":"Bruns Henrik"},{"$f":"'Wettkampf 1'!C37","v":"Lähden"},178.9,null,178.9,0,0,0,0,0,0,0,0,178.9,1,0,0,0,0,0,0,0,0,0,0,0,0,0,0,{"$nulls":5},{"v":0,"d":"0.0"},0,0,""]
[23,{"$f":"'Wettkampf 1'!B38","v":"Buschen Johann "},{"$f":"'Wettkampf 1'!C38","v":"Lähden"},192.1,null,192.1,0,0,0,0,0,0,0,0,192.1,1,0,0,0,0,0,0,0,0,0,0,0,0,0,0,{"$nulls":5},{"v":0,"d":"0.0"},0,0,""]
[24,{"$f":"'Wettkampf 1'!B39","v":"Preut Jannis"},{"$f":"'Wettkampf 1'!C39","v":"Lähden"},159.3,"x","0",0,0,0,0,0,0,0,0,"0",0,0,0,0,0,0,0,0,0,0,0,0,0,0,0,{"$nulls":5},{"v":0,"d":"0.0"},0,0,""]
[25,{"$f":"'Wettkampf 1'!B40","v":"Fleschenberg Jana"},{"$f":"'Wettkampf 1'!C40","v":"Lähden"},185.8,null,185.8,0,0,0,0,0,0,0,0,185.8,1,0,0,0,0,0,0,0,0,0,0,0,0,0,0,{"$nulls":5},{"v":0,"d":"0.0"},0,0,""]
[26,{"$f":"'Wettkampf 1'!B41","v":"von Seggern Moritz"},{"$f":"'Wettkampf 1'!C41","v":"Lähden"},154.1,"x","0",0,0,0,0,0,0,0,0,"0",0,0,0,0,0,0,0,0,0,0,0,0,0,0,0,{"$nulls":5},{"v":0,"d":"0.0"},0,0,""]
[27,{"$f":"'Wettkampf 1'!B42","v":"Kohnen Saskia"},{"$f":"'Wettkampf 1'!C42","v":"Börgermoor"},160.3,null,160.3,0,0,0,0,0,0,0,0,0,0,160.3,1,0,0,0,0,0,0,0,0,0,0,0,0,{"$nulls":5},{"v":0,"d":"0.0"},0,0,""]
[28,{"$f":"'Wettkampf 1'!B43","v":"Niemann Paul"},{"$f":"'Wettkampf 1'!C43","v":"Börgermoor"},null,null,{"v":0,"d":"0.0"},0,0,0,0,0,0,0,0,0,0,0,1,0,0,0,0,0,0,0,0,0,0,0,0,{"$nulls":5},{"v":0,"d":"0.0"},1,0,""]
[29,{"$f":"'Wettkampf 1'!B44","v":"Schütze 29"},{"$f":"'Wettkampf 1'!C44","v":"Börgermoor"},null,null,{"v":0,"d":"0.0"},0,0,0,0,0,0,0,0,0,0,0,1,0,0,0,0,0,0,0,0,0,0,0,0,{"$nulls":5},{"v":0,"d":"0.0"},1,0,""]
[30,{"$f":"'Wettkampf 1'!B45","v":"Schütze 30"},{"$f":"'Wettkampf 1'!C45","v":"Börgermoor"},null,null,{"v":0,"d":"0.0"},0,0,0,0,0,0,0,0,0,0,0,1,0,0,0,0,0,0,0,0,0,0,0,0,{"$nulls":5},{"v":0,"d":"0.0"},1,0,""]
[31,{"$f":"'Wettkampf 1'!B46","v":"Stümpler Jan Luka "},{"$f":"'Wettkampf 1'!C46","v":"Lähden"},null,null,{"v":0,"d":"0.0"},0,0,0,0,0,0,0,0,0,1,0,0,0,0,0,0,0,0,0,0,0,0,0,0,{"$nulls":5},{"v":0,"d":"0.0"},1,0,""]
[32,{"$f":"'Wettkampf 1'!B47","v":"Helmer, Nils"},{"$f":"'Wettkampf 1'!C47","v":"Lorup"},{"v":142,"d":"142.0"},"x","0","0",0,0,0,0,0,0,0,0,0,0,0,0,0,0,0,0,0,0,0,0,0,0,0,{"$nulls":5},{"v":0,"d":"0.0"},0,0,""]
[33,{"$f":"'Wettkampf 1'!B48","v":"Schütze 33"},{"$f":"'Wettkampf 1'!C48","v":"Verein VII"},null,null,{"v":0,"d":"0.0"},0,0,0,0,0,0,0,0,0,0,0,0,0,1,0,0,0,0,0,0,0,0,0,0,{"$nulls":5},{"v":0,"d":"0.0"},1,0,""]
[34,{"$f":"'Wettkampf 1'!B49","v":"Schütze 34"},{"$f":"'Wettkampf 1'!C49","v":"Verein VII"},null,null,{"v":0,"d":"0.0"},0,0,0,0,0,0,0,0,0,0,0,0,0,1,0,0,0,0,0,0,0,0,0,0,{"$nulls":5},{"v":0,"d":"0.0"},1,0,""]
[35,{"$f":"'Wettkampf 1'!B50","v":"Schütze 35"},{"$f":"'Wettkampf 1'!C50","v":"Verein VII"},null,null,{"v":0,"d":"0.0"},0,0,0,0,0,0,0,0,0,0,0,0,0,1,0,0,0,0,0,0,0,0,0,0,{"$nulls":5},{"v":0,"d":"0.0"},1,0,""]
[36,{"$f":"'Wettkampf 1'!B51","v":"Schütze 36"},{"$f":"'Wettkampf 1'!C51","v":"Verein VII"},null,null,{"v":0,"d":"0.0"},0,0,0,0,0,0,0,0,0,0,0,0,0,1,0,0,0,0,0,0,0,0,0,0,{"$nulls":5},{"v":0,"d":"0.0"},1,0,""]
[37,{"$f":"'Wettkampf 1'!B52","v":"Schütze 37"},{"$f":"'Wettkampf 1'!C52","v":"Verein VII"},null,null,{"v":0,"d":"0.0"},0,0,0,0,0,0,0,0,0,0,0,0,0,1,0,0,0,0,0,0,0,0,0,0,{"$nulls":5},{"v":0,"d":"0.0"}]
[38,{"$f":"'Wettkampf 1'!B53","v":"Schütze 38"},{"$f":"'Wettkampf 1'!C53","v":"Verein VIII"},null,null,{"v":0,"d":"0.0"},0,0,0,0,0,0,0,0,0,0,0,0,0,0,0,1,0,0,0,0,0,0,0,0,{"$nulls":5},{"v":0,"d":"0.0"}]
[39,{"$f":"'Wettkampf 1'!B54","v":"Schütze 39"},{"$f":"'Wettkampf 1'!C54","v":"Verein VIII"},null,null,{"v":0,"d":"0.0"},0,0,0,0,0,0,0,0,0,0,0,0,{"$f":"IF($C54=$B$8,$F54,0)","v":0},{"$f":"(IF(AND($E54=\"\",$C54=$B$8),1,0))","v":0},{"$f":"IF($C54=$B$9,$F54,0)","v":0},{"$f":"(IF(AND($E54=\"\",$C54=$B$9),1,0))","v":1},{"$f":"IF($C54=$B$10,$F54,0)","v":0},{"$f":"(IF(AND($E54=\"\",$C54=$B$10),1,0))","v":0},{"$f":"IF($C54=$B$11,$F54,0)","v":0},{"$f":"(IF(AND($E54=\"\",$C54=$B$11),1,0))","v":0},{"$f":"IF($C54=$B$12,$F54,0)","v":0},{"$f":"(IF(AND($E54=\"\",$C54=$B$12),1,0))","v":0},{"$f":"IF($C54=$B$13,$F54,0)","v":0},{"$f":"(IF(AND($E54=\"\",$C54=$B$13),1,0))","v":0},{"$nulls":5},{"v":0,"d":"0.0"}]
[40,{"$f":"'Wettkampf 1'!B55","v":"Schütze 40"},{"$f":"'Wettkampf 1'!C55","v":"Verein VIII"},null,null,{"v":0,"d":"0.0"},0,0,0,0,0,0,0,0,0,0,0,0,0,0,0,1,0,0,0,0,0,0,0,0,{"$nulls":5},{"v":0,"d":"0.0"}]
[41,{"$f":"'Wettkampf 1'!B56","v":"Schütze 41"},{"$f":"'Wettkampf 1'!C56","v":"Verein IX"},null,null,{"v":0,"d":"0.0"},0,0,0,0,0,0,0,0,0,0,0,0,0,0,0,0,0,1,0,0,0,0,0,0,{"$nulls":5},{"v":0,"d":"0.0"}]
[42,{"$f":"'Wettkampf 1'!B57","v":"Schütze 42"},{"$f":"'Wettkampf 1'!C57","v":"Verein IX"},null,null,{"v":0,"d":"0.0"},0,0,0,0,0,0,0,0,0,0,0,0,0,0,0,0,0,1,0,0,0,0,0,0,{"$nulls":5},{"v":0,"d":"0.0"}]
[43,{"$f":"'Wettkampf 1'!B58","v":"Schütze 43"},{"$f":"'Wettkampf 1'!C58","v":"Verein IX"},null,null,{"v":0,"d":"0.0"},0,0,0,0,0,0,0,0,0,0,0,0,0,0,0,0,0,1,0,0,0,0,0,0,{"$nulls":5},{"v":0,"d":"0.0"}]
[44,{"$f":"'Wettkampf 1'!B59","v":"Schütze 44"},{"$f":"'Wettkampf 1'!C59","v":"Verein IX"},null,null,{"v":0,"d":"0.0"},0,0,0,0,0,0,0,0,0,0,0,0,0,0,0,0,0,1,0,0,0,0,0,0,{"$nulls":5},{"v":0,"d":"0.0"}]
[45,{"$f":"'Wettkampf 1'!B60","v":"Schütze 45"},{"$f":"'Wettkampf 1'!C60","v":"Verein IX"},null,null,{"v":0,"d":"0.0"},0,0,0,0,0,0,0,0,0,0,0,0,0,0,0,0,0,1,0,0,0,0,0,0,{"$nulls":5},{"v":0,"d":"0.0"}]
[46,{"$f":"'Wettkampf 1'!B61","v":"Schütze 46"},{"$f":"'Wettkampf 1'!C61","v":"Verein X"},null,null,{"v":0,"d":"0.0"},0,0,0,0,0,0,0,0,0,0,0,0,0,0,0,0,0,0,0,1,0,0,0,0,{"$nulls":5},{"v":0,"d":"0.0"}]
[47,{"$f":"'Wettkampf 1'!B62","v":"Schütze 47"},{"$f":"'Wettkampf 1'!C62","v":"Verein X"},null,null,{"v":0,"d":"0.0"},0,0,0,0,0,0,0,0,0,0,0,0,0,0,0,0,0,0,0,1,0,0,0,0,{"$nulls":5},{"v":0,"d":"0.0"}]
[48,{"$f":"'Wettkampf 1'!B63","v":"Schütze 48"},{"$f":"'Wettkampf 1'!C63","v":"Verein X"},null,null,{"v":0,"d":"0.0"},0,0,0,0,0,0,0,0,0,0,0,0,0,0,0,0,0,0,0,1,0,0,0,0,{"$nulls":5},{"v":0,"d":"0.0"}]
[49,{"$f":"'Wettkampf 1'!B64","v":"Schütze 49"},{"$f":"'Wettkampf 1'!C64","v":"Verein X"},null,null,{"v":0,"d":"0.0"},0,0,0,0,0,0,0,0,0,0,0,0,0,0,0,0,0,0,0,1,0,0,0,0,{"$nulls":5},{"v":0,"d":"0.0"}]
[50,{"$f":"'Wettkampf 1'!B65","v":"Schütze 50"},{"$f":"'Wettkampf 1'!C65","v":"Verein X"},null,null,{"v":0,"d":"0.0"},0,0,0,0,0,0,0,0,0,0,0,0,0,0,0,0,0,0,0,1,0,0,0,0,{"$nulls":5},{"v":0,"d":"0.0"}]
[51,{"$f":"'Wettkampf 1'!B66","v":"Schütze 51"},{"$f":"'Wettkampf 1'!C66","v":"Verein XI"},null,null,{"v":0,"d":"0.0"},0,0,0,0,0,0,0,0,0,0,0,0,0,0,0,0,0,0,0,0,0,1,0,0,{"$nulls":5},{"v":0,"d":"0.0"}]
[52,{"$f":"'Wettkampf 1'!B67","v":"Schütze 52"},{"$f":"'Wettkampf 1'!C67","v":"Verein XI"},null,null,{"v":0,"d":"0.0"},0,0,0,0,0,0,0,0,0,0,0,0,0,0,0,0,0,0,0,0,0,1,0,0,{"$nulls":5},{"v":0,"d":"0.0"}]
[53,{"$f":"'Wettkampf 1'!B68","v":"Schütze 53"},{"$f":"'Wettkampf 1'!C68","v":"Verein XI"},null,null,{"v":0,"d":"0.0"},0,0,0,0,0,0,0,0,0,0,0,0,0,0,0,0,0,0,0,0,0,1,0,0,{"$nulls":5},{"v":0,"d":"0.0"}]
[54,{"$f":"'Wettkampf 1'!B69","v":"Schütze 54"},{"$f":"'Wettkampf 1'!C69","v":"Verein XI"},null,null,{"v":0,"d":"0.0"},0,0,0,0,0,0,0,0,0,0,0,0,0,0,0,0,0,0,0,0,0,1,0,0,{"$nulls":5},{"v":0,"d":"0.0"}]
[55,{"$f":"'Wettkampf 1'!B70","v":"Schütze 55"},{"$f":"'Wettkampf 1'!C70","v":"Verein XI"},null,null,{"v":0,"d":"0.0"},0,0,0,0,0,0,0,0,0,0,0,0,0,0,0,0,0,0,0,0,0,1,0,0,{"$nulls":5},{"v":0,"d":"0.0"}]
[56,{"$f":"'Wettkampf 1'!B71","v":"Schütze 56"},{"$f":"'Wettkampf 1'!C71","v":"Verein XII"},null,null,{"v":0,"d":"0.0"},0,0,0,0,0,0,0,0,0,0,0,0,0,0,0,0,0,0,0,0,0,0,0,1,{"$nulls":5},{"v":0,"d":"0.0"}]
[57,{"$f":"'Wettkampf 1'!B72","v":"Schütze 57"},{"$f":"'Wettkampf 1'!C72","v":"Verein XII"},null,null,{"v":0,"d":"0.0"},0,0,0,0,0,0,0,0,0,0,0,0,0,0,0,0,0,0,0,0,0,0,0,1,{"$nulls":5},{"v":0,"d":"0.0"}]
[58,{"$f":"'Wettkampf 1'!B73","v":"Schütze 58"},{"$f":"'Wettkampf 1'!C73","v":"Verein XII"},null,null,{"v":0,"d":"0.0"},0,0,0,0,0,0,0,0,0,0,0,0,0,0,0,0,0,0,0,0,0,0,0,1,{"$nulls":5},{"v":0,"d":"0.0"}]
[59,{"$f":"'Wettkampf 1'!B74","v":"Schütze 59"},{"$f":"'Wettkampf 1'!C74","v":"Verein XII"},null,null,{"v":0,"d":"0.0"},0,0,0,0,0,0,0,0,0,0,0,0,0,0,0,0,0,0,0,0,0,0,0,1,{"$nulls":5},{"v":0,"d":"0.0"}]
[60,{"$f":"'Wettkampf 1'!B75","v":"Schütze 60"},{"$f":"'Wettkampf 1'!C75","v":"Verein XII"},null,null,{"v":0,"d":"0.0"},0,0,0,0,0,0,0,0,0,0,0,0,0,0,0,0,0,0,0,0,0,0,0,1,{"$nulls":5},{"v":0,"d":"0.0"}]
[{"$nulls":6},{"$f":"LARGE(G16:G75,1)+LARGE(G16:G75,2)+LARGE(G16:G75,3)","v":500.4},{"$f":"SUM(H16:H75)","v":5},{"$f":"LARGE(I16:I75,1)+LARGE(I16:I75,2)+LARGE(I16:I75,3)","v":0},{"$f":"SUM(J16:J75)","v":4},{"$f":"LARGE(K16:K75,1)+LARGE(K16:K75,2)+LARGE(K16:K75,3)","v":294.7},{"$f":"SUM(L16:L75)","v":5},{"$f":"LARGE(M16:M75,1)+LARGE(M16:M75,2)+LARGE(M16:M75,3)","v":508},{"$f":"SUM(N16:N75)","v":5},{"$f":"LARGE(O16:O75,1)+LARGE(O16:O75,2)+LARGE(O16:O75,3)","v":559.5999999999999},{"$f":"SUM(P16:P75)","v":5},{"$f":"LARGE(Q16:Q75,1)+LARGE(Q16:Q75,2)+LARGE(Q16:Q75,3)","v":160.3},{"$f":"SUM(R16:R75)","v":4},{"$f":"LARGE(S16:S75,1)+LARGE(S16:S75,2)+LARGE(S16:S75,3)","v":0},{"$f":"SUM(T16:T75)","v":5},{"$f":"LARGE(U16:U75,1)+LARGE(U16:U75,2)+LARGE(U16:U75,3)","v":0},{"$f":"SUM(V16:V75)","v":3},{"$f":"LARGE(W16:W75,1)+LARGE(W16:W75,2)+LARGE(W16:W75,3)","v":0},{"$f":"SUM(X16:X75)","v":5},{"$f":"LARGE(Y16:Y75,1)+LARGE(Y16:Y75,2)+LARGE(Y16:Y75,3)","v":0},{"$f":"SUM(Z16:Z75)","v":5},{"$f":"LARGE(AA16:AA75,1)+LARGE(AA16:AA75,2)+LARGE(AA16:AA75,3)","v":0},{"$f":"SUM(AB16:AB75)","v":5},{"$f":"LARGE(AC16:AC75,1)+LARGE(AC16:AC75,2)+LARGE(AC16:AC75,3)","v":0},{"$f":"SUM(AD16:AD75)","v":5}]
[null,null,"per Email an: sk-huemmling@gmx.de"]

{"sheet":"12","index":12,"n_rows":77,"n_cols":39,"rows_kept":77,"merged":[[0,34,0,35],[1,34,1,35],[4,34,4,35],[5,34,5,35],[6,34,6,35],[14,32,14,35]]}
[null,"Verein / Gruppe",null,"Ergebnisse",{"$nulls":29},"Austragungsort:",{"$f":"Übersicht!Q4","v":0}]
[1,{"$f":"'Wettkampf 1'!B2","v":"Lorup"},null,{"$f":"G76","v":{"v":0,"d":"0.0"}},{"$f":"IF(H76>4,\"Es sind zu viele Schützen in Wertung!\",\" \")","v":"Es sind zu viele Schützen in Wertung!"},{"$nulls":28},"Wettkampftag:",{"$f":"Übersicht!Q3","v":0}]
[2,{"$f":"'Wettkampf 1'!B3","v":"Sögel"},null,{"$f":"I76","v":{"v":0,"d":"0.0"}},{"$f":"IF(J76>4,\"Es sind zu viele Schützen in Wertung!\",\" \")","v":" "}]
[3,{"$f":"'Wettkampf 1'!B4","v":"Spahnharenstätte"},null,{"$f":"K76","v":{"v":0,"d":"0.0"}},{"$f":"IF(L76>4,\"Es sind zu viele Schützen in Wertung!\",\" \")","v":"Es sind zu viele Schützen in Wertung!"},{"$nulls":30},"Ansprechpartner für Rückfragen:"]
[4,{"$f":"'Wettkampf 1'!B5","v":"Esterwegen"},null,{"$f":"M76","v":{"v":0,"d":"0.0"}},{"$f":"IF(N76>4,\"Es sind zu viele Schützen in Wertung!\",\" \")","v":"Es sind zu viele Schützen in Wertung!"},{"$nulls":28},"Name:"]
[5,{"$f":"'Wettkampf 1'!B6","v":"Lähden"},null,{"$f":"O76","v":{"v":0,"d":"0.0"}},{"$f":"IF(P76>4,\"Es sind zu viele Schützen in Wertung!\",\" \")","v":"Es sind zu viele Schützen in Wertung!"},{"$nulls":28},"Tel:"]
[6,{"$f":"'Wettkampf 1'!B7","v":"Börgermoor"},null,{"$f":"Q76","v":{"v":0,"d":"0.0"}},{"$f":"IF(R76>4,\"Es sind zu viele Schützen in Wertung!\",\" \")","v":" "},{"$nulls":28},"Standaufsicht:","eintragen"]
[7,{"$f":"'Wettkampf 1'!B8","v":"Verein VII"},null,{"$f":"S76","v":{"v":0,"d":"0.0"}},{"$f":"IF(T76>4,\"Es sind zu viele Schützen in Wertung!\",\" \")","v":"Es sind zu viele Schützen in Wertung!"}]
[8,{"$f":"'Wettkampf 1'!B9","v":"Verein VIII"},null,{"$f":"U76","v":{"v":0,"d":"0.0"}},{"$f":"IF(V76>4,\"Es sind zu viele Schützen in Wertung!\",\" \")","v":" "}]
[9,{"$f":"'Wettkampf 1'!B10","v":"Verein IX"},null,{"$f":"W76","v":{"v":0,"d":"0.0"}},{"$f":"IF(X76>4,\"Es sind zu viele Schützen in Wertung!\",\" \")","v":"Es sind zu viele Schützen in Wertung!"}]
[10,{"$f":"'Wettkampf 1'!B11","v":"Verein X"},null,{"$f":"Y76","v":{"v":0,"d":"0.0"}},{"$f":"IF(Z76>4,\"Es sind zu viele Schützen in Wertung!\",\" \")","v":"Es sind zu viele Schützen in Wertung!"}]
[11,{"$f":"'Wettkampf 1'!B12","v":"Verein XI"},null,{"$f":"AA76","v":{"v":0,"d":"0.0"}},{"$f":"IF(AB76>4,\"Es sind zu viele Schützen in Wertung!\",\" \")","v":"Es sind zu viele Schützen in Wertung!"}]
[12,{"$f":"'Wettkampf 1'!B13","v":"Verein XII"},null,{"$f":"AC76","v":{"v":0,"d":"0.0"}},{"$f":"IF(AD76>4,\"Es sind zu viele Schützen in Wertung!\",\" \")","v":"Es sind zu viele Schützen in Wertung!"}]
[]
[null,"Einzelergebnisse:","Verein / Gruppe","Ergebnisse (mindestens 0 eintragen)","AW? Dann x eintippen",null,"Verein 1",null,"Verein 2",null,"Verein 3",null,"Verein 4",null,"Verein 5",null,"Verein 6",null,"Verein 7",null,"Verein 8",null,"Verein 9",null,"Verein 10",null,"Verein 11",null,"Verein 12",{"$nulls":3},"Proberechnung bei Streifen:"]
[1,{"$f":"'Wettkampf 1'!B16","v":"Wotte Lia"},{"$f":"'Wettkampf 1'!C16","v":"Lorup"},null,null,{"$f":"IF(E16=\"x\",\"0\",D16)","v":{"v":0,"d":"0.0"}},{"$f":"IF(C16=$B$2,F16,0)","v":0},{"$f":"(IF(AND($E16=\"\",$C16=$B$2),1,0))","v":1},{"$f":"IF($C16=$B$3,$F16,0)","v":0},{"$f":"(IF(AND($E16=\"\",$C16=$B$3),1,0))","v":0},{"$f":"IF($C16=$B$4,F16,0)","v":0},{"$f":"(IF(AND($E16=\"\",$C16=$B$4),1,0))","v":0},{"$f":"IF($C16=$B$5,F16,0)","v":0},{"$f":"(IF(AND($E16=\"\",$C16=$B$5),1,0))","v":0},{"$f":"IF($C16=$B$6,F16,0)","v":0},{"$f":"(IF(AND($E16=\"\",$C16=$B$6),1,0))","v":0},{"$f":"IF($C16=$B$7,F16,0)","v":0},{"$f":"(IF(AND($E16=\"\",$C16=$B$7),1,0))","v":0},{"$f":"IF($C16=$B$8,$F16,0)","v":0},{"$f":"(IF(AND($E16=\"\",$C16=$B$8),1,0))","v":0},{"$f":"IF($C16=$B$9,$F16,0)","v":0},{"$f":"(IF(AND($E16=\"\",$C16=$B$9),1,0))","v":0},{"$f":"IF($C16=$B$10,$F16,0)","v":0},{"$f":"(IF(AND($E16=\"\",$C16=$B$10),1,0))","v":0},{"$f":"IF($C16=$B$11,$F16,0)","v":0},{"$f":"(IF(AND($E16=\"\",$C16=$B$11),1,0))","v":0},{"$f":"IF($C16=$B$12,$F16,0)","v":0},{"$f":"(IF(AND($E16=\"\",$C16=$B$12),1,0))","v":0},{"$f":"IF($C16=$B$13,$F16,0)","v":0},{"$f":"(IF(AND($E16=\"\",$C16=$B$13),1,0))","v":0},{"$nulls":5},{"$f":"SUM(AG16:AI16)","v":{"v":0,"d":"0.0"}},{"$f":"IF(AJ16=D16,1,0)","v":1},{"$f":"IF(AJ16=0,0,1)","v":0},{"$f":"IF(AK16+AL16=2,\"Korrekt\",\"\")","v":""}]
[2,{"$f":"'Wettkampf 1'!B17","v":"Wotte Hannes"},{"$f":"'Wettkampf 1'!C17","v":"Lorup"},null,null,{"$f":"IF(E17=\"x\",\"0\",D17)","v":{"v":0,"d":"0.0"}},{"$f":"IF(C17=$B$2,F17,0)","v":0},{"$f":"(IF(AND($E17=\"\",$C17=$B$2),1,0))","v":1},{"$f":"IF($C17=$B$3,F17,0)","v":0},{"$f":"(IF(AND($E17=\"\",$C17=$B$3),1,0))","v":0},{"$f":"IF($C17=$B$4,F17,0)","v":0},{"$f":"(IF(AND($E17=\"\",$C17=$B$4),1,0))","v":0},{"$f":"IF($C17=$B$5,F17,0)","v":0},{"$f":"(IF(AND($E17=\"\",$C17=$B$5),1,0))","v":0},{"$f":"IF($C17=$B$6,F17,0)","v":0},{"$f":"(IF(AND($E17=\"\",$C17=$B$6),1,0))","v":0},{"$f":"IF($C17=$B$7,F17,0)","v":0},{"$f":"(IF(AND($E17=\"\",$C17=$B$7),1,0))","v":0},{"$f":"IF($C17=$B$8,$F17,0)","v":0},{"$f":"(IF(AND($E17=\"\",$C17=$B$8),1,0))","v":0},{"$f":"IF($C17=$B$9,$F17,0)","v":0},{"$f":"(IF(AND($E17=\"\",$C17=$B$9),1,0))","v":0},{"$f":"IF($C17=$B$10,$F17,0)","v":0},{"$f":"(IF(AND($E17=\"\",$C17=$B$10),1,0))","v":0},{"$f":"IF($C17=$B$11,$F17,0)","v":0},{"$f":"(IF(AND($E17=\"\",$C17=$B$11),1,0))","v":0},{"$f":"IF($C17=$B$12,$F17,0)","v":0},{"$f":"(IF(AND($E17=\"\",$C17=$B$12),1,0))","v":0},{"$f":"IF($C17=$B$13,$F17,0)","v":0},{"$f":"(IF(AND($E17=\"\",$C17=$B$13),1,0))","v":0},{"$nulls":5},{"$f":"SUM(AG17:AI17)","v":{"v":0,"d":"0.0"}},{"$f":"IF(AJ17=D17,1,0)","v":1},{"$f":"IF(AJ17=0,0,1)","v":0},{"$f":"IF(AK17+AL17=2,\"Korrekt\",\"\")","v":""}]
[3,{"$f":"'Wettkampf 1'!B18","v":"Gretenabeln Elias"},{"$f":"'Wettkampf 1'!C18","v":"Lorup"},null,null,{"v":0,"d":"0.0"},0,1,0,0,0,0,0,0,0,0,0,0,0,0,0,0,0,0,0,0,0,0,0,0,{"$nulls":5},{"v":0,"d":"0.0"},1,0,""]
[4,{"$f":"'Wettkampf 1'!B19","v":"Helmer Maike"},{"$f":"'Wettkampf 1'!C19","v":"Lorup"},null,null,{"v":0,"d":"0.0"},0,1,0,0,0,0,0,0,0,0,0,0,0,0,0,0,0,0,0,0,0,0,0,0,{"$nulls":5},{"v":0,"d":"0.0"},1,0,""]
[5,{"$f":"'Wettkampf 1'!B20","v":"Többen Jannes"},{"$f":"'Wettkampf 1'!C20","v":"Lorup"},null,null,{"v":0,"d":"0.0"},0,1,0,0,0,0,0,0,0,0,0,0,0,0,0,0,0,0,0,0,0,0,0,0,{"$nulls":5},{"v":0,"d":"0.0"},1,0,""]
[6,{"$f":"'Wettkampf 1'!B21","v":"Lüken Arne"},{"$f":"'Wettkampf 1'!C21","v":"Lorup"},null,null,{"v":0,"d":"0.0"},0,1,0,0,0,0,0,0,0,0,0,0,0,0,0,0,0,0,0,0,0,0,0,0,{"$nulls":5},{"v":0,"d":"0.0"},1,0,""]
[7,{"$f":"'Wettkampf 1'!B22","v":"Schütze 7"},{"$f":"'Wettkampf 1'!C22","v":"Sögel"},null,null,{"v":0,"d":"0.0"},0,0,0,1,0,0,0,0,0,0,0,0,0,0,0,0,0,0,0,0,0,0,0,0,{"$nulls":5},{"v":0,"d":"0.0"},1,0,""]
[8,{"$f":"'Wettkampf 1'!B23","v":"Schütze 8"},{"$f":"'Wettkampf 1'!C23","v":"Sögel"},null,null,{"v":0,"d":"0.0"},0,0,0,1,0,0,0,0,0,0,0,0,0,0,0,0,0,0,0,0,0,0,0,0,{"$nulls":5},{"v":0,"d":"0.0"},1,0,""]
[9,{"$f":"'Wettkampf 1'!B24","v":"Schütze 9"},{"$f":"'Wettkampf 1'!C24","v":"Sögel"},null,null,{"v":0,"d":"0.0"},0,0,0,1,0,0,0,0,0,0,0,0,0,0,0,0,0,0,0,0,0,0,0,0,{"$nulls":5},{"v":0,"d":"0.0"},1,0,""]
[10,{"$f":"'Wettkampf 1'!B25","v":"Schütze 10"},{"$f":"'Wettkampf 1'!C25","v":"Sögel"},null,null,{"v":0,"d":"0.0"},0,0,0,1,0,0,0,0,0,0,0,0,0,0,0,0,0,0,0,0,0,0,0,0,{"$nulls":5},{"v":0,"d":"0.0"},1,0,""]
[11,{"$f":"'Wettkampf 1'!B26","v":"Engbers Hannes"},{"$f":"'Wettkampf 1'!C26","v":"Spahnharenstätte"},null,null,{"v":0,"d":"0.0"},0,0,0,0,0,1,0,0,0,0,0,0,0,0,0,0,0,0,0,0,0,0,0,0,{"$nulls":5},{"v":0,"d":"0.0"},1,0,""]
[12,{"$f":"'Wettkampf 1'!B27","v":"Runde Marcel"},{"$f":"'Wettkampf 1'!C27","v":"Spahnharenstätte"},null,null,{"v":0,"d":"0.0"},0,0,0,0,0,1,0,0,0,0,0,0,0,0,0,0,0,0,0,0,0,0,0,0,{"$nulls":5},{"v":0,"d":"0.0"},1,0,""]
[13,{"$f":"'Wettkampf 1'!B28","v":"Jansen Lars"},{"$f":"'Wettkampf 1'!C28","v":"Spahnharenstätte"},null,null,{"v":0,"d":"0.0"},0,0,0,0,0,1,0,0,0,0,0,0,0,0,0,0,0,0,0,0,0,0,0,0,{"$nulls":5},{"v":0,"d":"0.0"},1,0,""]
[14,{"$f":"'Wettkampf 1'!B29","v":"Schütze 14"},{"$f":"'Wettkampf 1'!C29","v":"Spahnharenstätte"},null,null,{"v":0,"d":"0.0"},0,0,0,0,0,1,0,0,0,0,0,0,0,0,0,0,0,0,0,0,0,0,0,0,{"$nulls":5},{"v":0,"d":"0.0"},1,0,""]
[15,{"$f":"'Wettkampf 1'!B30","v":"Schütze 15"},{"$f":"'Wettkampf 1'!C30","v":"Spahnharenstätte"},null,null,{"v":0,"d":"0.0"},0,0,0,0,0,1,0,0,0,0,0,0,0,0,0,0,0,0,0,0,0,0,0,0,{"$nulls":5},{"v":0,"d":"0.0"},1,0,""]
[16,{"$f":"'Wettkampf 1'!B31","v":"Suhle Annalena"},{"$f":"'Wettkampf 1'!C31","v":"Esterwegen"},null,null,{"v":0,"d":"0.0"},0,0,0,0,0,0,0,1,0,0,0,0,0,0,0,0,0,0,0,0,0,0,0,0,{"$nulls":5},{"v":0,"d":"0.0"},1,0,""]
[17,{"$f":"'Wettkampf 1'!B32","v":"Gäken Lena"},{"$f":"'Wettkampf 1'!C32","v":"Esterwegen"},null,null,{"v":0,"d":"0.0"},0,0,0,0,0,0,0,1,0,0,0,0,0,0,0,0,0,0,0,0,0,0,0,0,{"$nulls":5},{"v":0,"d":"0.0"},1,0,""]
[18,{"$f":"'Wettkampf 1'!B33","v":"Jansen Daniel"},{"$f":"'Wettkampf 1'!C33","v":"Esterwegen"},null,null,{"v":0,"d":"0.0"},0,0,0,0,0,0,0,1,0,0,0,0,0,0,0,0,0,0,0,0,0,0,0,0,{"$nulls":5},{"v":0,"d":"0.0"},1,0,""]
[19,{"$f":"'Wettkampf 1'!B34","v":"Pieper Jonas"},{"$f":"'Wettkampf 1'!C34","v":"Esterwegen"},null,null,{"v":0,"d":"0.0"},0,0,0,0,0,0,0,1,0,0,0,0,0,0,0,0,0,0,0,0,0,0,0,0,{"$nulls":5},{"v":0,"d":"0.0"},1,0,""]
[20,{"$f":"'Wettkampf 1'!B35","v":"Schütze 20"},{"$f":"'Wettkampf 1'!C35","v":"Esterwegen"},null,null,{"v":0,"d":"0.0"},0,0,0,0,0,0,0,1,0,0,0,0,0,0,0,0,0,0,0,0,0,0,0,0,{"$nulls":5},{"v":0,"d":"0.0"},1,0,""]
[21,{"$f":"'Wettkampf 1'!B36","v":"Hellweg Thea"},{"$f":"'Wettkampf 1'!C36","v":"Lähden"},null,null,{"v":0,"d":"0.0"},0,0,0,0,0,0,0,0,0,1,0,0,0,0,0,0,0,0,0,0,0,0,0,0,{"$nulls":5},{"v":0,"d":"0.0"},1,0,""]
[22,{"$f":"'Wettkampf 1'!B37","v":"Bruns Henrik"},{"$f":"'Wettkampf 1'!C37","v":"Lähden"},null,null,{"v":0,"d":"0.0"},0,0,0,0,0,0,0,0,0,1,0,0,0,0,0,0,0,0,0,0,0,0,0,0,{"$nulls":5},{"v":0,"d":"0.0"},1,0,""]
[23,{"$f":"'Wettkampf 1'!B38","v":"Buschen Johann "},{"$f":"'Wettkampf 1'!C38","v":"Lähden"},null,null,{"v":0,"d":"0.0"},0,0,0,0,0,0,0,0,0,1,0,0,0,0,0,0,0,0,0,0,0,0,0,0,{"$nulls":5},{"v":0,"d":"0.0"},1,0,""]
[24,{"$f":"'Wettkampf 1'!B39","v":"Preut Jannis"},{"$f":"'Wettkampf 1'!C39","v":"Lähden"},null,null,{"v":0,"d":"0.0"},0,0,0,0,0,0,0,0,0,1,0,0,0,0,0,0,0,0,0,0,0,0,0,0,{"$nulls":5},{"v":0,"d":"0.0"},1,0,""]
[25,{"$f":"'Wettkampf 1'!B40","v":"Fleschenberg Jana"},{"$f":"'Wettkampf 1'!C40","v":"Lähden"},null,null,{"v":0,"d":"0.0"},0,0,0,0,0,0,0,0,0,1,0,0,0,0,0,0,0,0,0,0,0,0,0,0,{"$nulls":5},{"v":0,"d":"0.0"},1,0,""]
[26,{"$f":"'Wettkampf 1'!B41","v":"von Seggern Moritz"},{"$f":"'Wettkampf 1'!C41","v":"Lähden"},null,null,{"v":0,"d":"0.0"},0,0,0,0,0,0,0,0,0,1,0,0,0,0,0,0,0,0,0,0,0,0,0,0,{"$nulls":5},{"v":0,"d":"0.0"},1,0,""]
[27,{"$f":"'Wettkampf 1'!B42","v":"Kohnen Saskia"},{"$f":"'Wettkampf 1'!C42","v":"Börgermoor"},null,null,{"v":0,"d":"0.0"},0,0,0,0,0,0,0,0,0,0,0,1,0,0,0,0,0,0,0,0,0,0,0,0,{"$nulls":5},{"v":0,"d":"0.0"},1,0,""]
[28,{"$f":"'Wettkampf 1'!B43","v":"Niemann Paul"},{"$f":"'Wettkampf 1'!C43","v":"Börgermoor"},null,null,{"v":0,"d":"0.0"},0,0,0,0,0,0,0,0,0,0,0,1,0,0,0,0,0,0,0,0,0,0,0,0,{"$nulls":5},{"v":0,"d":"0.0"},1,0,""]
[29,{"$f":"'Wettkampf 1'!B44","v":"Schütze 29"},{"$f":"'Wettkampf 1'!C44","v":"Börgermoor"},null,null,{"v":0,"d":"0.0"},0,0,0,0,0,0,0,0,0,0,0,1,0,0,0,0,0,0,0,0,0,0,0,0,{"$nulls":5},{"v":0,"d":"0.0"},1,0,""]
[30,{"$f":"'Wettkampf 1'!B45","v":"Schütze 30"},{"$f":"'Wettkampf 1'!C45","v":"Börgermoor"},null,null,{"v":0,"d":"0.0"},0,0,0,0,0,0,0,0,0,0,0,1,0,0,0,0,0,0,0,0,0,0,0,0,{"$nulls":5},{"v":0,"d":"0.0"},1,0,""]
[31,{"$f":"'Wettkampf 1'!B46","v":"Stümpler Jan Luka "},{"$f":"'Wettkampf 1'!C46","v":"Lähden"},null,null,{"v":0,"d":"0.0"},0,0,0,0,0,0,0,0,0,1,0,0,0,0,0,0,0,0,0,0,0,0,0,0,{"$nulls":5},{"v":0,"d":"0.0"},1,0,""]
[32,{"$f":"'Wettkampf 1'!B47","v":"Helmer, Nils"},{"$f":"'Wettkampf 1'!C47","v":"Lorup"},null,null,{"v":0,"d":"0.0"},0,1,0,0,0,0,0,0,0,0,0,0,0,0,0,0,0,0,0,0,0,0,0,0,{"$nulls":5},{"v":0,"d":"0.0"},1,0,""]
[33,{"$f":"'Wettkampf 1'!B48","v":"Schütze 33"},{"$f":"'Wettkampf 1'!C48","v":"Verein VII"},null,null,{"v":0,"d":"0.0"},0,0,0,0,0,0,0,0,0,0,0,0,0,1,0,0,0,0,0,0,0,0,0,0,{"$nulls":5},{"v":0,"d":"0.0"},1,0,""]
[34,{"$f":"'Wettkampf 1'!B49","v":"Schütze 34"},{"$f":"'Wettkampf 1'!C49","v":"Verein VII"},null,null,{"v":0,"d":"0.0"},0,0,0,0,0,0,0,0,0,0,0,0,0,1,0,0,0,0,0,0,0,0,0,0,{"$nulls":5},{"v":0,"d":"0.0"},1,0,""]
[35,{"$f":"'Wettkampf 1'!B50","v":"Schütze 35"},{"$f":"'Wettkampf 1'!C50","v":"Verein VII"},null,null,{"v":0,"d":"0.0"},0,0,0,0,0,0,0,0,0,0,0,0,0,1,0,0,0,0,0,0,0,0,0,0,{"$nulls":5},{"v":0,"d":"0.0"},1,0,""]
[36,{"$f":"'Wettkampf 1'!B51","v":"Schütze 36"},{"$f":"'Wettkampf 1'!C51","v":"Verein VII"},null,null,{"v":0,"d":"0.0"},0,0,0,0,0,0,0,0,0,0,0,0,0,1,0,0,0,0,0,0,0,0,0,0,{"$nulls":5},{"v":0,"d":"0.0"},1,0,""]
[37,{"$f":"'Wettkampf 1'!B52","v":"Schütze 37"},{"$f":"'Wettkampf 1'!C52","v":"Verein VII"},null,null,{"v":0,"d":"0.0"},0,0,0,0,0,0,0,0,0,0,0,0,0,1,0,0,0,0,0,0,0,0,0,0,{"$nulls":5},{"v":0,"d":"0.0"}]
[38,{"$f":"'Wettkampf 1'!B53","v":"Schütze 38"},{"$f":"'Wettkampf 1'!C53","v":"Verein VIII"},null,null,{"v":0,"d":"0.0"},0,0,0,0,0,0,0,0,0,0,0,0,0,0,0,1,0,0,0,0,0,0,0,0,{"$nulls":5},{"v":0,"d":"0.0"}]
[39,{"$f":"'Wettkampf 1'!B54","v":"Schütze 39"},{"$f":"'Wettkampf 1'!C54","v":"Verein VIII"},null,null,{"v":0,"d":"0.0"},0,0,0,0,0,0,0,0,0,0,0,0,{"$f":"IF($C54=$B$8,$F54,0)","v":0},{"$f":"(IF(AND($E54=\"\",$C54=$B$8),1,0))","v":0},{"$f":"IF($C54=$B$9,$F54,0)","v":0},{"$f":"(IF(AND($E54=\"\",$C54=$B$9),1,0))","v":1},{"$f":"IF($C54=$B$10,$F54,0)","v":0},{"$f":"(IF(AND($E54=\"\",$C54=$B$10),1,0))","v":0},{"$f":"IF($C54=$B$11,$F54,0)","v":0},{"$f":"(IF(AND($E54=\"\",$C54=$B$11),1,0))","v":0},{"$f":"IF($C54=$B$12,$F54,0)","v":0},{"$f":"(IF(AND($E54=\"\",$C54=$B$12),1,0))","v":0},{"$f":"IF($C54=$B$13,$F54,0)","v":0},{"$f":"(IF(AND($E54=\"\",$C54=$B$13),1,0))","v":0},{"$nulls":5},{"v":0,"d":"0.0"}]
[40,{"$f":"'Wettkampf 1'!B55","v":"Schütze 40"},{"$f":"'Wettkampf 1'!C55","v":"Verein VIII"},null,null,{"v":0,"d":"0.0"},0,0,0,0,0,0,0,0,0,0,0,0,0,0,0,1,0,0,0,0,0,0,0,0,{"$nulls":5},{"v":0,"d":"0.0"}]
[41,{"$f":"'Wettkampf 1'!B56","v":"Schütze 41"},{"$f":"'Wettkampf 1'!C56","v":"Verein IX"},null,null,{"v":0,"d":"0.0"},0,0,0,0,0,0,0,0,0,0,0,0,0,0,0,0,0,1,0,0,0,0,0,0,{"$nulls":5},{"v":0,"d":"0.0"}]
[42,{"$f":"'Wettkampf 1'!B57","v":"Schütze 42"},{"$f":"'Wettkampf 1'!C57","v":"Verein IX"},null,null,{"v":0,"d":"0.0"},0,0,0,0,0,0,0,0,0,0,0,0,0,0,0,0,0,1,0,0,0,0,0,0,{"$nulls":5},{"v":0,"d":"0.0"}]
[43,{"$f":"'Wettkampf 1'!B58","v":"Schütze 43"},{"$f":"'Wettkampf 1'!C58","v":"Verein IX"},null,null,{"v":0,"d":"0.0"},0,0,0,0,0,0,0,0,0,0,0,0,0,0,0,0,0,1,0,0,0,0,0,0,{"$nulls":5},{"v":0,"d":"0.0"}]
[44,{"$f":"'Wettkampf 1'!B59","v":"Schütze 44"},{"$f":"'Wettkampf 1'!C59","v":"Verein IX"},null,null,{"v":0,"d":"0.0"},0,0,0,0,0,0,0,0,0,0,0,0,0,0,0,0,0,1,0,0,0,0,0,0,{"$nulls":5},{"v":0,"d":"0.0"}]
[45,{"$f":"'Wettkampf 1'!B60","v":"Schütze 45"},{"$f":"'Wettkampf 1'!C60","v":"Verein IX"},null,null,{"v":0,"d":"0.0"},0,0,0,0,0,0,0,0,0,0,0,0,0,0,0,0,0,1,0,0,0,0,0,0,{"$nulls":5},{"v":0,"d":"0.0"}]
[46,{"$f":"'Wettkampf 1'!B61","v":"Schütze 46"},{"$f":"'Wettkampf 1'!C61","v":"Verein X"},null,null,{"v":0,"d":"0.0"},0,0,0,0,0,0,0,0,0,0,0,0,0,0,0,0,0,0,0,1,0,0,0,0,{"$nulls":5},{"v":0,"d":"0.0"}]
[47,{"$f":"'Wettkampf 1'!B62","v":"Schütze 47"},{"$f":"'Wettkampf 1'!C62","v":"Verein X"},null,null,{"v":0,"d":"0.0"},0,0,0,0,0,0,0,0,0,0,0,0,0,0,0,0,0,0,0,1,0,0,0,0,{"$nulls":5},{"v":0,"d":"0.0"}]
[48,{"$f":"'Wettkampf 1'!B63","v":"Schütze 48"},{"$f":"'Wettkampf 1'!C63","v":"Verein X"},null,null,{"v":0,"d":"0.0"},0,0,0,0,0,0,0,0,0,0,0,0,0,0,0,0,0,0,0,1,0,0,0,0,{"$nulls":5},{"v":0,"d":"0.0"}]
[49,{"$f":"'Wettkampf 1'!B64","v":"Schütze 49"},{"$f":"'Wettkampf 1'!C64","v":"Verein X"},null,null,{"v":0,"d":"0.0"},0,0,0,0,0,0,0,0,0,0,0,0,0,0,0,0,0,0,0,1,0,0,0,0,{"$nulls":5},{"v":0,"d":"0.0"}]
[50,{"$f":"'Wettkampf 1'!B65","v":"Schütze 50"},{"$f":"'Wettkampf 1'!C65","v":"Verein X"},null,null,{"v":0,"d":"0.0"},0,0,0,0,0,0,0,0,0,0,0,0,0,0,0,0,0,0,0,1,0,0,0,0,{"$nulls":5},{"v":0,"d":"0.0"}]
[51,{"$f":"'Wettkampf 1'!B66","v":"Schütze 51"},{"$f":"'Wettkampf 1'!C66","v":"Verein XI"},null,null,{"v":0,"d":"0.0"},0,0,0,0,0,0,0,0,0,0,0,0,0,0,0,0,0,0,0,0,0,1,0,0,{"$nulls":5},{"v":0,"d":"0.0"}]
[52,{"$f":"'Wettkampf 1'!B67","v":"Schütze 52"},{"$f":"'Wettkampf 1'!C67","v":"Verein XI"},null,null,{"v":0,"d":"0.0"},0,0,0,0,0,0,0,0,0,0,0,0,0,0,0,0,0,0,0,0,0,1,0,0,{"$nulls":5},{"v":0,"d":"0.0"}]
[53,{"$f":"'Wettkampf 1'!B68","v":"Schütze 53"},{"$f":"'Wettkampf 1'!C68","v":"Verein XI"},null,null,{"v":0,"d":"0.0"},0,0,0,0,0,0,0,0,0,0,0,0,0,0,0,0,0,0,0,0,0,1,0,0,{"$nulls":5},{"v":0,"d":"0.0"}]
[54,{"$f":"'Wettkampf 1'!B69","v":"Schütze 54"},{"$f":"'Wettkampf 1'!C69","v":"Verein XI"},null,null,{"v":0,"d":"0.0"},0,0,0,0,0,0,0,0,0,0,0,0,0,0,0,0,0,0,0,0,0,1,0,0,{"$nulls":5},{"v":0,"d":"0.0"}]
[55,{"$f":"'Wettkampf 1'!B70","v":"Schütze 55"},{"$f":"'Wettkampf 1'!C70","v":"Verein XI"},null,null,{"v":0,"d":"0.0"},0,0,0,0,0,0,0,0,0,0,0,0,0,0,0,0,0,0,0,0,0,1,0,0,{"$nulls":5},{"v":0,"d":"0.0"}]
[56,{"$f":"'Wettkampf 1'!B71","v":"Schütze 56"},{"$f":"'Wettkampf 1'!C71","v":"Verein XII"},null,null,{"v":0,"d":"0.0"},0,0,0,0,0,0,0,0,0,0,0,0,0,0,0,0,0,0,0,0,0,0,0,1,{"$nulls":5},{"v":0,"d":"0.0"}]
[57,{"$f":"'Wettkampf 1'!B72","v":"Schütze 57"},{"$f":"'Wettkampf 1'!C72","v":"Verein XII"},null,null,{"v":0,"d":"0.0"},0,0,0,0,0,0,0,0,0,0,0,0,0,0,0,0,0,0,0,0,0,0,0,1,{"$nulls":5},{"v":0,"d":"0.0"}]
[58,{"$f":"'Wettkampf 1'!B73","v":"Schütze 58"},{"$f":"'Wettkampf 1'!C73","v":"Verein XII"},null,null,{"v":0,"d":"0.0"},0,0,0,0,0,0,0,0,0,0,0,0,0,0,0,0,0,0,0,0,0,0,0,1,{"$nulls":5},{"v":0,"d":"0.0"}]
[59,{"$f":"'Wettkampf 1'!B74","v":"Schütze 59"},{"$f":"'Wettkampf 1'!C74","v":"Verein XII"},null,null,{"v":0,"d":"0.0"},0,0,0,0,0,0,0,0,0,0,0,0,0,0,0,0,0,0,0,0,0,0,0,1,{"$nulls":5},{"v":0,"d":"0.0"}]
[60,{"$f":"'Wettkampf 1'!B75","v":"Schütze 60"},{"$f":"'Wettkampf 1'!C75","v":"Verein XII"},null,null,{"v":0,"d":"0.0"},0,0,0,0,0,0,0,0,0,0,0,0,0,0,0,0,0,0,0,0,0,0,0,1,{"$nulls":5},{"v":0,"d":"0.0"}]
[{"$nulls":6},{"$f":"LARGE(G16:G75,1)+LARGE(G16:G75,2)+LARGE(G16:G75,3)","v":0},{"$f":"SUM(H16:H75)","v":7},{"$f":"LARGE(I16:I75,1)+LARGE(I16:I75,2)+LARGE(I16:I75,3)","v":0},{"$f":"SUM(J16:J75)","v":4},{"$f":"LARGE(K16:K75,1)+LARGE(K16:K75,2)+LARGE(K16:K75,3)","v":0},{"$f":"SUM(L16:L75)","v":5},{"$f":"LARGE(M16:M75,1)+LARGE(M16:M75,2)+LARGE(M16:M75,3)","v":0},{"$f":"SUM(N16:N75)","v":5},{"$f":"LARGE(O16:O75,1)+LARGE(O16:O75,2)+LARGE(O16:O75,3)","v":0},{"$f":"SUM(P16:P75)","v":7},{"$f":"LARGE(Q16:Q75,1)+LARGE(Q16:Q75,2)+LARGE(Q16:Q75,3)","v":0},{"$f":"SUM(R16:R75)","v":4},{"$f":"LARGE(S16:S75,1)+LARGE(S16:S75,2)+LARGE(S16:S75,3)","v":0},{"$f":"SUM(T16:T75)","v":5},{"$f":"LARGE(U16:U75,1)+LARGE(U16:U75,2)+LARGE(U16:U75,3)","v":0},{"$f":"SUM(V16:V75)","v":3},{"$f":"LARGE(W16:W75,1)+LARGE(W16:W75,2)+LARGE(W16:W75,3)","v":0},{"$f":"SUM(X16:X75)","v":5},{"$f":"LARGE(Y16:Y75,1)+LARGE(Y16:Y75,2)+LARGE(Y16:Y75,3)","v":0},{"$f":"SUM(Z16:Z75)","v":5},{"$f":"LARGE(AA16:AA75,1)+LARGE(AA16:AA75,2)+LARGE(AA16:AA75,3)","v":0},{"$f":"SUM(AB16:AB75)","v":5},{"$f":"LARGE(AC16:AC75,1)+LARGE(AC16:AC75,2)+LARGE(AC16:AC75,3)","v":0},{"$f":"SUM(AD16:AD75)","v":5}]
[null,null,"per Email an: sk-huemmling@gmx.de"]

{"sheet":"Ausdruck","index":13,"n_rows":48,"n_cols":29,"rows_kept":48,"merged":[[0,3,0,19],[0,24,0,25],[1,3,1,19],[1,24,1,25],[2,3,2,19],[3,3,3,19],[4,24,4,25],[5,24,5,25],[6,24,6,25],[8,22,8,25]]}
[null,"Verein / Gruppe","Ergebnisse",{"$f":"Übersicht!K1","v":"2023/2024"},{"$nulls":19},"Austragungsort:"]
[1,{"$f":"'Wettkampf 1'!B2","v":"Lorup"},null,"Klasse:",{"$nulls":19},"Wettkampftag:"]
[2,{"$f":"'Wettkampf 1'!B3","v":"Sögel"},null,{"$f":"Übersicht!M1","v":0}]
[3,{"$f":"'Wettkampf 1'!B4","v":"Spahnharenstätte"},null,{"$f":"Übersicht!P1","v":"Schüler"},{"$nulls":21},"Ansprechpartner für Rückfragen:"]
[4,{"$f":"'Wettkampf 1'!B5","v":"Esterwegen"},{"$nulls":21},"Name:"]
[5,{"$f":"'Wettkampf 1'!B6","v":"Lähden"},{"$nulls":21},"Tel:"]
[6,{"$f":"'Wettkampf 1'!B7","v":"Börgermoor"},{"$nulls":21},"Standaufsicht:"]
[]
[null,"Name Schütze","Verein/Gruppe","Ergebnis","AW? ",null,"Verein 1",null,"Verein 2",null,"Verein 3",null,"Verein 4",null,"Verein 5",null,"Verein 6",{"$nulls":3},"Geburts-datum",null,"Proberechnung bei Streifen:"]
[1,{"$f":"'Wettkampf 1'!B16","v":"Wotte Lia"},{"$f":"'Wettkampf 1'!C16","v":"Lorup"},null,null,{"$f":"IF(E10=\"x\",\"0\",D10)","v":0},{"$f":"IF(C10=$B$2,F10,0)","v":0},{"$f":"(IF(AND($E10=\"\",$C10=$B$2),1,0))","v":1},{"$f":"IF($C10=$B$3,F10,0)","v":0},{"$f":"(IF(AND($E10=\"\",$C10=$B$3),1,0))","v":0},{"$f":"IF($C10=$B$4,F10,0)","v":0},{"$f":"(IF(AND($E10=\"\",$C10=$B$4),1,0))","v":0},{"$f":"IF($C10=$B$5,F10,0)","v":0},{"$f":"(IF(AND($E10=\"\",$C10=$B$5),1,0))","v":0},{"$f":"IF($C10=$B$6,F10,0)","v":0},{"$f":"(IF(AND($E10=\"\",$C10=$B$6),1,0))","v":0},{"$f":"IF($C10=$B$7,F10,0)","v":0},{"$f":"(IF(AND($E10=\"\",$C10=$B$7),1,0))","v":0},{"$nulls":8},{"$f":"IF(Z10=D10,1,0)","v":1},{"$f":"IF(Z10=0,0,1)","v":0},{"$f":"IF(AA10+AB10=2,\"Korrekt\",\"\")","v":""}]
[2,{"$f":"'Wettkampf 1'!B17","v":"Wotte Hannes"},{"$f":"'Wettkampf 1'!C17","v":"Lorup"},null,null,{"$f":"IF(E11=\"x\",\"0\",D11)","v":0},{"$f":"IF(C11=$B$2,F11,0)","v":0},{"$f":"(IF(AND($E11=\"\",$C11=$B$2),1,0))","v":1},{"$f":"IF($C11=$B$3,F11,0)","v":0},{"$f":"(IF(AND($E11=\"\",$C11=$B$3),1,0))","v":0},{"$f":"IF($C11=$B$4,F11,0)","v":0},{"$f":"(IF(AND($E11=\"\",$C11=$B$4),1,0))","v":0},{"$f":"IF($C11=$B$5,F11,0)","v":0},{"$f":"(IF(AND($E11=\"\",$C11=$B$5),1,0))","v":0},{"$f":"IF($C11=$B$6,F11,0)","v":0},{"$f":"(IF(AND($E11=\"\",$C11=$B$6),1,0))","v":0},{"$f":"IF($C11=$B$7,F11,0)","v":0},{"$f":"(IF(AND($E11=\"\",$C11=$B$7),1,0))","v":0},{"$nulls":8},{"$f":"IF(Z11=D11,1,0)","v":1},{"$f":"IF(Z11=0,0,1)","v":0},{"$f":"IF(AA11+AB11=2,\"Korrekt\",\"\")","v":""}]
[3,{"$f":"'Wettkampf 1'!B18","v":"Gretenabeln Elias"},{"$f":"'Wettkampf 1'!C18","v":"Lorup"},null,null,0,0,1,0,0,0,0,0,0,0,0,0,0,{"$nulls":8},1,0,""]
[4,{"$f":"'Wettkampf 1'!B19","v":"Helmer Maike"},{"$f":"'Wettkampf 1'!C19","v":"Lorup"},null,null,0,0,1,0,0,0,0,0,0,0,0,0,0,{"$nulls":8},1,0,""]
[5,{"$f":"'Wettkampf 1'!B20","v":"Többen Jannes"},{"$f":"'Wettkampf 1'!C20","v":"Lorup"},null,null,0,0,1,0,0,0,0,0,0,0,0,0,0,{"$nulls":8},1,0,""]
[6,{"$f":"'Wettkampf 1'!B21","v":"Lüken Arne"},{"$f":"'Wettkampf 1'!C21","v":"Lorup"},null,null,0,0,1,0,0,0,0,0,0,0,0,0,0,{"$nulls":8},1,0,""]
[7,{"$f":"'Wettkampf 1'!B22","v":"Schütze 7"},{"$f":"'Wettkampf 1'!C22","v":"Sögel"},null,null,0,0,0,0,1,0,0,0,0,0,0,0,0,{"$nulls":8},1,0,""]
[8,{"$f":"'Wettkampf 1'!B23","v":"Schütze 8"},{"$f":"'Wettkampf 1'!C23","v":"Sögel"},null,null,0,0,0,0,1,0,0,0,0,0,0,0,0,{"$nulls":8},1,0,""]
[9,{"$f":"'Wettkampf 1'!B24","v":"Schütze 9"},{"$f":"'Wettkampf 1'!C24","v":"Sögel"},null,null,0,0,0,0,1,0,0,0,0,0,0,0,0,{"$nulls":8},1,0,""]
[10,{"$f":"'Wettkampf 1'!B25","v":"Schütze 10"},{"$f":"'Wettkampf 1'!C25","v":"Sögel"},null,null,0,0,0,0,1,0,0,0,0,0,0,0,0,{"$nulls":8},1,0,""]
[11,{"$f":"'Wettkampf 1'!B26","v":"Engbers Hannes"},{"$f":"'Wettkampf 1'!C26","v":"Spahnharenstätte"},null,null,0,0,0,0,0,0,1,0,0,0,0,0,0,{"$nulls":8},1,0,""]
[12,{"$f":"'Wettkampf 1'!B27","v":"Runde Marcel"},{"$f":"'Wettkampf 1'!C27","v":"Spahnharenstätte"},null,null,0,0,0,0,0,0,1,0,0,0,0,0,0,{"$nulls":8},1,0,""]
[13,{"$f":"'Wettkampf 1'!B28","v":"Jansen Lars"},{"$f":"'Wettkampf 1'!C28","v":"Spahnharenstätte"},null,null,0,0,0,0,0,0,1,0,0,0,0,0,0,{"$nulls":8},1,0,""]
[14,{"$f":"'Wettkampf 1'!B29","v":"Schütze 14"},{"$f":"'Wettkampf 1'!C29","v":"Spahnharenstätte"},null,null,0,0,0,0,0,0,1,0,0,0,0,0,0,{"$nulls":8},1,0,""]
[15,{"$f":"'Wettkampf 1'!B30","v":"Schütze 15"},{"$f":"'Wettkampf 1'!C30","v":"Spahnharenstätte"},null,null,0,0,0,0,0,0,1,0,0,0,0,0,0,{"$nulls":8},1,0,""]
[16,{"$f":"'Wettkampf 1'!B31","v":"Suhle Annalena"},{"$f":"'Wettkampf 1'!C31","v":"Esterwegen"},null,null,0,0,0,0,0,0,0,0,1,0,0,0,0,{"$nulls":8},1,0,""]
[17,{"$f":"'Wettkampf 1'!B32","v":"Gäken Lena"},{"$f":"'Wettkampf 1'!C32","v":"Esterwegen"},null,null,0,0,0,0,0,0,0,0,1,0,0,0,0,{"$nulls":8},1,0,""]
[18,{"$f":"'Wettkampf 1'!B33","v":"Jansen Daniel"},{"$f":"'Wettkampf 1'!C33","v":"Esterwegen"},null,null,0,0,0,0,0,0,0,0,1,0,0,0,0,{"$nulls":8},1,0,""]
[19,{"$f":"'Wettkampf 1'!B34","v":"Pieper Jonas"},{"$f":"'Wettkampf 1'!C34","v":"Esterwegen"},null,null,0,0,0,0,0,0,0,0,1,0,0,0,0,{"$nulls":8},1,0,""]
[20,{"$f":"'Wettkampf 1'!B35","v":"Schütze 20"},{"$f":"'Wettkampf 1'!C35","v":"Esterwegen"},null,null,0,0,0,0,0,0,0,0,1,0,0,0,0,{"$nulls":8},1,0,""]
[21,{"$f":"'Wettkampf 1'!B36","v":"Hellweg Thea"},{"$f":"'Wettkampf 1'!C36","v":"Lähden"},null,null,0,0,0,0,0,0,0,0,0,0,1,0,0,{"$nulls":8},1,0,""]
[22,{"$f":"'Wettkampf 1'!B37","v":"Bruns Henrik"},{"$f":"'Wettkampf 1'!C37","v":"Lähden"},null,null,0,0,0,0,0,0,0,0,0,0,1,0,0,{"$nulls":8},1,0,""]
[23,{"$f":"'Wettkampf 1'!B38","v":"Buschen Johann "},{"$f":"'Wettkampf 1'!C38","v":"Lähden"},null,null,0,0,0,0,0,0,0,0,0,0,1,0,0,{"$nulls":8},1,0,""]
[24,{"$f":"'Wettkampf 1'!B39","v":"Preut Jannis"},{"$f":"'Wettkampf 1'!C39","v":"Lähden"},null,null,0,0,0,0,0,0,0,0,0,0,1,0,0,{"$nulls":8},1,0,""]
[25,{"$f":"'Wettkampf 1'!B40","v":"Fleschenberg Jana"},{"$f":"'Wettkampf 1'!C40","v":"Lähden"},null,null,0,0,0,0,0,0,0,0,0,0,1,0,0,{"$nulls":8},1,0,""]
[26,{"$f":"'Wettkampf 1'!B41","v":"von Seggern Moritz"},{"$f":"'Wettkampf 1'!C41","v":"Lähden"},null,null,0,0,0,0,0,0,0,0,0,0,1,0,0,{"$nulls":8},1,0,""]
[27,{"$f":"'Wettkampf 1'!B42","v":"Kohnen Saskia"},{"$f":"'Wettkampf 1'!C42","v":"Börgermoor"},null,null,0,0,0,0,0,0,0,0,0,0,0,0,1,{"$nulls":8},1,0,""]
[28,{"$f":"'Wettkampf 1'!B43","v":"Niemann Paul"},{"$f":"'Wettkampf 1'!C43","v":"Börgermoor"},null,null,0,0,0,0,0,0,0,0,0,0,0,0,1,{"$nulls":8},1,0,""]
[29,{"$f":"'Wettkampf 1'!B44","v":"Schütze 29"},{"$f":"'Wettkampf 1'!C44","v":"Börgermoor"},null,null,0,0,0,0,0,0,0,0,0,0,0,0,1,{"$nulls":8},1,0,""]
[30,{"$f":"'Wettkampf 1'!B45","v":"Schütze 30"},{"$f":"'Wettkampf 1'!C45","v":"Börgermoor"},null,null,0,0,0,0,0,0,0,0,0,0,0,0,1,{"$nulls":8},1,0,""]
[31,{"$f":"'Wettkampf 1'!B46","v":"Stümpler Jan Luka "},{"$f":"'Wettkampf 1'!C46","v":"Lähden"},null,null,0,0,0,0,0,0,0,0,0,0,1,0,0,{"$nulls":8},1,0,""]
[32,{"$f":"'Wettkampf 1'!B47","v":"Helmer, Nils"},{"$f":"'Wettkampf 1'!C47","v":"Lorup"},null,null,0,0,1,0,0,0,0,0,0,0,0,0,0,{"$nulls":8},1,0,""]
[33,{"$f":"'Wettkampf 1'!B48","v":"Schütze 33"},{"$f":"'Wettkampf 1'!C48","v":"Verein VII"},null,null,0,0,0,0,0,0,0,0,0,0,0,0,0,{"$nulls":8},1,0,""]
[34,{"$f":"'Wettkampf 1'!B49","v":"Schütze 34"},{"$f":"'Wettkampf 1'!C49","v":"Verein VII"},null,null,0,0,0,0,0,0,0,0,0,0,0,0,0,{"$nulls":8},1,0,""]
[35,{"$f":"'Wettkampf 1'!B50","v":"Schütze 35"},{"$f":"'Wettkampf 1'!C50","v":"Verein VII"},null,null,0,0,0,0,0,0,0,0,0,0,0,0,0,{"$nulls":8},1,0,""]
[36,{"$f":"'Wettkampf 1'!B51","v":"Schütze 36"},{"$f":"'Wettkampf 1'!C51","v":"Verein VII"},null,null,0,0,0,0,0,0,0,0,0,0,0,0,0,{"$nulls":8},1,0,""]
[{"$nulls":6},{"$f":"LARGE(G10:G45,1)+LARGE(G10:G45,2)+LARGE(G10:G45,3)","v":0},{"$f":"SUM(H10:H45)","v":7},{"$f":"LARGE(I10:I45,1)+LARGE(I10:I45,2)+LARGE(I10:I45,3)","v":0},{"$f":"SUM(J10:J45)","v":4},{"$f":"LARGE(K10:K45,1)+LARGE(K10:K45,2)+LARGE(K10:K45,3)","v":0},{"$f":"SUM(L10:L45)","v":5},{"$f":"LARGE(M10:M45,1)+LARGE(M10:M45,2)+LARGE(M10:M45,3)","v":0},{"$f":"SUM(N10:N45)","v":5},{"$f":"LARGE(O10:O45,1)+LARGE(O10:O45,2)+LARGE(O10:O45,3)","v":0},{"$f":"SUM(P10:P45)","v":7},{"$f":"LARGE(Q10:Q45,1)+LARGE(Q10:Q45,2)+LARGE(Q10:Q45,3)","v":0},{"$f":"SUM(R10:S45)","v":4}]
[]
[null,"Bitte beachtet, dass die Standaufsicht benannt werden muss"]

{"sheet":"Ausdruck blank","index":14,"n_rows":48,"n_cols":29,"rows_kept":48,"merged":[[0,3,0,19],[0,24,0,25],[1,3,1,19],[1,24,1,25],[2,3,2,19],[3,3,3,19],[4,24,4,25],[5,24,5,25],[6,24,6,25],[8,22,8,25]]}
[null,"Verein / Gruppe","Ergebnisse",{"$f":"Übersicht!K1","v":"2023/2024"},{"$nulls":19},"Austragungsort:"]
[1,null,null,"Klasse:",{"$nulls":19},"Wettkampftag:"]
[2]
[3,{"$nulls":24},"Ansprechpartner für Rückfragen:"]
[4,{"$nulls":22},"Name:"]
[5,{"$nulls":22},"Tel:"]
[6,{"$nulls":22},"Standaufsicht:"]
[]
[null,"Name Schütze","Verein/Gruppe","Ergebnis","AW? ",null,"Verein 1",null,"Verein 2",null,"Verein 3",null,"Verein 4",null,"Verein 5",null,"Verein 6",{"$nulls":3},"Geburts-datum",null,"Proberechnung bei Streifen:"]
[1,{"$nulls":4},{"$f":"IF(E10=\"x\",\"0\",D10)","v":0},{"$f":"IF(C10=$B$2,F10,0)","v":0},{"$f":"(IF(AND($E10=\"\",$C10=$B$2),1,0))","v":1},{"$f":"IF($C10=$B$3,F10,0)","v":0},{"$f":"(IF(AND($E10=\"\",$C10=$B$3),1,0))","v":1},{"$f":"IF($C10=$B$4,F10,0)","v":0},{"$f":"(IF(AND($E10=\"\",$C10=$B$4),1,0))","v":1},{"$f":"IF($C10=$B$5,F10,0)","v":0},{"$f":"(IF(AND($E10=\"\",$C10=$B$5),1,0))","v":1},{"$f":"IF($C10=$B$6,F10,0)","v":0},{"$f":"(IF(AND($E10=\"\",$C10=$B$6),1,0))","v":1},{"$f":"IF($C10=$B$7,F10,0)","v":0},{"$f":"(IF(AND($E10=\"\",$C10=$B$7),1,0))","v":1},{"$nulls":8},{"$f":"IF(Z10=D10,1,0)","v":1},{"$f":"IF(Z10=0,0,1)","v":0},{"$f":"IF(AA10+AB10=2,\"Korrekt\",\"\")","v":""}]
[2,{"$nulls":4},{"$f":"IF(E11=\"x\",\"0\",D11)","v":0},{"$f":"IF(C11=$B$2,F11,0)","v":0},{"$f":"(IF(AND($E11=\"\",$C11=$B$2),1,0))","v":1},{"$f":"IF($C11=$B$3,F11,0)","v":0},{"$f":"(IF(AND($E11=\"\",$C11=$B$3),1,0))","v":1},{"$f":"IF($C11=$B$4,F11,0)","v":0},{"$f":"(IF(AND($E11=\"\",$C11=$B$4),1,0))","v":1},{"$f":"IF($C11=$B$5,F11,0)","v":0},{"$f":"(IF(AND($E11=\"\",$C11=$B$5),1,0))","v":1},{"$f":"IF($C11=$B$6,F11,0)","v":0},{"$f":"(IF(AND($E11=\"\",$C11=$B$6),1,0))","v":1},{"$f":"IF($C11=$B$7,F11,0)","v":0},{"$f":"(IF(AND($E11=\"\",$C11=$B$7),1,0))","v":1},{"$nulls":8},{"$f":"IF(Z11=D11,1,0)","v":1},{"$f":"IF(Z11=0,0,1)","v":0},{"$f":"IF(AA11+AB11=2,\"Korrekt\",\"\")","v":""}]
[3,{"$nulls":4},0,0,1,0,1,0,1,0,1,0,1,0,1,{"$nulls":8},1,0,""]
[4,{"$nulls":4},0,0,1,0,1,0,1,0,1,0,1,0,1,{"$nulls":8},1,0,""]
[5,{"$nulls":4},0,0,1,0,1,0,1,0,1,0,1,0,1,{"$nulls":8},1,0,""]
[6,{"$nulls":4},0,0,1,0,1,0,1,0,1,0,1,0,1,{"$nulls":8},1,0,""]
[7,{"$nulls":4},0,0,1,0,1,0,1,0,1,0,1,0,1,{"$nulls":8},1,0,""]
[8,{"$nulls":4},0,0,1,0,1,0,1,0,1,0,1,0,1,{"$nulls":8},1,0,""]
[9,{"$nulls":4},0,0,1,0,1,0,1,0,1,0,1,0,1,{"$nulls":8},1,0,""]
[10,{"$nulls":4},0,0,1,0,1,0,1,0,1,0,1,0,1,{"$nulls":8},1,0,""]
[11,{"$nulls":4},0,0,1,0,1,0,1,0,1,0,1,0,1,{"$nulls":8},1,0,""]
[12,{"$nulls":4},0,0,1,0,1,0,1,0,1,0,1,0,1,{"$nulls":8},1,0,""]
[13,{"$nulls":4},0,0,1,0,1,0,1,0,1,0,1,0,1,{"$nulls":8},1,0,""]
[14,{"$nulls":4},0,0,1,0,1,0,1,0,1,0,1,0,1,{"$nulls":8},1,0,""]
[15,{"$nulls":4},0,0,1,0,1,0,1,0,1,0,1,0,1,{"$nulls":8},1,0,""]
[16,{"$nulls":4},0,0,1,0,1,0,1,0,1,0,1,0,1,{"$nulls":8},1,0,""]
[17,{"$nulls":4},0,0,1,0,1,0,1,0,1,0,1,0,1,{"$nulls":8},1,0,""]
[18,{"$nulls":4},0,0,1,0,1,0,1,0,1,0,1,0,1,{"$nulls":8},1,0,""]
[19,{"$nulls":4},0,0,1,0,1,0,1,0,1,0,1,0,1,{"$nulls":8},1,0,""]
[20,{"$nulls":4},0,0,1,0,1,0,1,0,1,0,1,0,1,{"$nulls":8},1,0,""]
[21,{"$nulls":4},0,0,1,0,1,0,1,0,1,0,1,0,1,{"$nulls":8},1,0,""]
[22,{"$nulls":4},0,0,1,0,1,0,1,0,1,0,1,0,1,{"$nulls":8},1,0,""]
[23,{"$nulls":4},0,0,1,0,1,0,1,0,1,0,1,0,1,{"$nulls":8},1,0,""]
[24,{"$nulls":4},0,0,1,0,1,0,1,0,1,0,1,0,1,{"$nulls":8},1,0,""]
[25,{"$nulls":4},0,0,1,0,1,0,1,0,1,0,1,0,1,{"$nulls":8},1,0,""]
[26,{"$nulls":4},0,0,1,0,1,0,1,0,1,0,1,0,1,{"$nulls":8},1,0,""]
[27,{"$nulls":4},0,0,1,0,1,0,1,0,1,0,1,0,1,{"$nulls":8},1,0,""]
[28,{"$nulls":4},0,0,1,0,1,0,1,0,1,0,1,0,1,{"$nulls":8},1,0,""]
[29,{"$nulls":4},0,0,1,0,1,0,1,0,1,0,1,0,1,{"$nulls":8},1,0,""]
[30,{"$nulls":4},0,0,1,0,1,0,1,0,1,0,1,0,1,{"$nulls":8},1,0,""]
[31,{"$nulls":4},0,0,1,0,1,0,1,0,1,0,1,0,1,{"$nulls":8},1,0,""]
[32,{"$nulls":4},0,0,1,0,1,0,1,0,1,0,1,0,1,{"$nulls":8},1,0,""]
[33,{"$nulls":4},0,0,1,0,1,0,1,0,1,0,1,0,1,{"$nulls":8},1,0,""]
[34,{"$nulls":4},0,0,1,0,1,0,1,0,1,0,1,0,1,{"$nulls":8},1,0,""]
[35,{"$nulls":4},0,0,1,0,1,0,1,0,1,0,1,0,1,{"$nulls":8},1,0,""]
[36,{"$nulls":4},0,0,1,0,1,0,1,0,1,0,1,0,1,{"$nulls":8},1,0,""]
[{"$nulls":6},{"$f":"LARGE(G10:G45,1)+LARGE(G10:G45,2)+LARGE(G10:G45,3)","v":0},{"$f":"SUM(H10:H45)","v":36},{"$f":"LARGE(I10:I45,1)+LARGE(I10:I45,2)+LARGE(I10:I45,3)","v":0},{"$f":"SUM(J10:J45)","v":36},{"$f":"LARGE(K10:K45,1)+LARGE(K10:K45,2)+LARGE(K10:K45,3)","v":0},{"$f":"SUM(L10:L45)","v":36},{"$f":"LARGE(M10:M45,1)+LARGE(M10:M45,2)+LARGE(M10:M45,3)","v":0},{"$f":"SUM(N10:N45)","v":36},{"$f":"LARGE(O10:O45,1)+LARGE(O10:O45,2)+LARGE(O10:O45,3)","v":0},{"$f":"SUM(P10:P45)","v":36},{"$f":"LARGE(Q10:Q45,1)+LARGE(Q10:Q45,2)+LARGE(Q10:Q45,3)","v":0},{"$f":"SUM(R10:S45)","v":36}]
[]
[null,"Bitte beachtet, dass die Standaufsicht benannt werden muss"]

{"sheet":"Übersicht Schützen","index":15,"n_rows":61,"n_cols":23,"rows_kept":61,"hidden":true}
[null,null,{"v":1,"d":"1.0"},{"v":2,"d":"2.0"},{"v":3,"d":"3.0"},{"v":4,"d":"4.0"},{"v":5,"d":"5.0"},{"v":6,"d":"6.0"},{"$nulls":3},{"v":7,"d":"7.0"},{"v":8,"d":"8.0"},{"v":9,"d":"9.0"},{"v":10,"d":"10.0"},{"v":11,"d":"11.0"},{"v":12,"d":"12.0"}]
["Buschen Johann ",{"$f":"VLOOKUP(A2,'Wettkampf 1'!$B$16:$C$75,2,FALSE)","v":"Lähden"},{"$f":"VLOOKUP(A2,'Wettkampf 1'!$B$16:$D$75,3,FALSE)","v":188.7},{"$f":"VLOOKUP($A2,Börgermoor!$B$16:$D$75,3,FALSE)","v":190.9},{"$f":"VLOOKUP($A2,'3'!$B$10:$D$75,3,FALSE)","v":194.9},{"$f":"VLOOKUP($A2,'4'!$B$10:$D$75,3,FALSE)","v":184.9},{"$f":"VLOOKUP($A2,'5'!$B$10:$D$75,3,FALSE)","v":{"v":0,"d":"0.0"}},{"$f":"VLOOKUP($A2,'6'!$B$10:$D$75,3,FALSE)","v":{"v":0,"d":"0.0"}},{"$f":"IF(J2 > 0,K2/J2,0)","v":{"v":189.85,"d":"189.9"}},{"$f":"VLOOKUP(A2,Formelhilfe!$A$15:$H$74,8,FALSE)","v":{"v":4,"d":"4.0"}},{"$f":"SUM(C2:H2)","v":759.4},{"$f":"VLOOKUP($A2,'7'!$B$10:$D$75,3,FALSE)","v":195.9},{"$f":"VLOOKUP($A2,'8'!$B$10:$D$75,3,FALSE)","v":179.6},{"$f":"VLOOKUP($A2,'9'!$B$10:$D$75,3,FALSE)","v":189.5},{"$f":"VLOOKUP($A2,'10'!$B$10:$D$75,3,FALSE)","v":184.5},{"$f":"VLOOKUP($A2,'11'!$B$10:$D$75,3,FALSE)","v":192.1},{"$f":"VLOOKUP($A2,'12'!$B$10:$D$75,3,FALSE)","v":{"v":0,"d":"0.0"}},{"$f":"IF(S2 >0,T2/S2,0)","v":{"v":188.32,"d":"188.3"}},{"$f":"VLOOKUP(A2,Formelhilfe!$A$15:$O$74,15,FALSE)","v":{"v":5,"d":"5.0"}},{"$f":"SUM(L2:Q2)","v":941.6},{"$f":"IF(V2>0,W2/V2,0)","v":{"v":188.99999999999997,"d":"189.0"}},{"$f":"VLOOKUP(A2,Formelhilfe!$A$15:$P$74,16,FALSE)","v":{"v":9,"d":"9.0"}},{"$f":"SUM(C2:H2,L2:Q2)","v":{"v":1700.9999999999998,"d":"1,701.0"}}]
["Suhle Annalena",{"$f":"VLOOKUP(A3,'Wettkampf 1'!$B$16:$C$75,2,FALSE)","v":"Esterwegen"},{"$f":"VLOOKUP(A3,'Wettkampf 1'!$B$16:$D$75,3,FALSE)","v":177.9},{"$f":"VLOOKUP($A3,Börgermoor!$B$16:$D$75,3,FALSE)","v":175.9},{"$f":"VLOOKUP($A3,'3'!$B$10:$D$75,3,FALSE)","v":184.4},{"$f":"VLOOKUP($A3,'4'!$B$10:$D$75,3,FALSE)","v":179.3},{"$f":"VLOOKUP($A3,'5'!$B$10:$D$75,3,FALSE)","v":{"v":0,"d":"0.0"}},{"$f":"VLOOKUP($A3,'6'!$B$10:$D$75,3,FALSE)","v":{"v":0,"d":"0.0"}},{"$f":"IF(J3 > 0,K3/J3,0)","v":{"v":179.375,"d":"179.4"}},{"$f":"VLOOKUP(A3,Formelhilfe!$A$15:$H$74,8,FALSE)","v":{"v":4,"d":"4.0"}},{"$f":"SUM(C3:H3)","v":717.5},{"$f":"VLOOKUP($A3,'7'!$B$10:$D$75,3,FALSE)","v":185.3},{"$f":"VLOOKUP($A3,'8'!$B$10:$D$75,3,FALSE)","v":190.5},{"$f":"VLOOKUP($A3,'9'!$B$10:$D$75,3,FALSE)","v":186.4},{"$f":"VLOOKUP($A3,'10'!$B$10:$D$75,3,FALSE)","v":188.9},{"$f":"VLOOKUP($A3,'11'!$B$10:$D$75,3,FALSE)","v":196.1},{"$f":"VLOOKUP($A3,'12'!$B$10:$D$75,3,FALSE)","v":{"v":0,"d":"0.0"}},{"$f":"IF(S3 >0,T3/S3,0)","v":{"v":189.44,"d":"189.4"}},{"$f":"VLOOKUP(A3,Formelhilfe!$A$15:$O$74,15,FALSE)","v":{"v":5,"d":"5.0"}},{"$f":"SUM(L3:Q3)","v":947.2},{"$f":"IF(V3>0,W3/V3,0)","v":{"v":184.96666666666667,"d":"185.0"}},{"$f":"VLOOKUP(A3,Formelhilfe!$A$15:$P$74,16,FALSE)","v":{"v":9,"d":"9.0"}},{"$f":"SUM(C3:H3,L3:Q3)","v":{"v":1664.7,"d":"1,664.7"}}]
["Hellweg Thea",{"$f":"VLOOKUP(A4,'Wettkampf 1'!$B$16:$C$75,2,FALSE)","v":"Lähden"},{"$f":"VLOOKUP(A4,'Wettkampf 1'!$B$16:$D$75,3,FALSE)","v":191.8},{"$f":"VLOOKUP($A4,Börgermoor!$B$16:$D$75,3,FALSE)","v":174.2},{"$f":"VLOOKUP($A4,'3'!$B$10:$D$75,3,FALSE)","v":181.9},{"$f":"VLOOKUP($A4,'4'!$B$10:$D$75,3,FALSE)","v":182.2},{"$f":"VLOOKUP($A4,'5'!$B$10:$D$75,3,FALSE)","v":{"v":0,"d":"0.0"}},{"$f":"VLOOKUP($A4,'6'!$B$10:$D$75,3,FALSE)","v":{"v":0,"d":"0.0"}},{"$f":"IF(J4 > 0,K4/J4,0)","v":{"v":182.52499999999998,"d":"182.5"}},{"$f":"VLOOKUP(A4,Formelhilfe!$A$15:$H$74,8,FALSE)","v":{"v":4,"d":"4.0"}},{"$f":"SUM(C4:H4)","v":{"v":730.0999999999999,"d":"730.1"}},{"$f":"VLOOKUP($A4,'7'!$B$10:$D$75,3,FALSE)","v":183.8},{"$f":"VLOOKUP($A4,'8'!$B$10:$D$75,3,FALSE)","v":180.4},{"$f":"VLOOKUP($A4,'9'!$B$10:$D$75,3,FALSE)","v":175.1},{"$f":"VLOOKUP($A4,'10'!$B$10:$D$75,3,FALSE)","v":188.4},{"$f":"VLOOKUP($A4,'11'!$B$10:$D$75,3,FALSE)","v":181.7},{"$f":"VLOOKUP($A4,'12'!$B$10:$D$75,3,FALSE)","v":{"v":0,"d":"0.0"}},{"$f":"IF(S4 >0,T4/S4,0)","v":{"v":181.88000000000002,"d":"181.9"}},{"$f":"VLOOKUP(A4,Formelhilfe!$A$15:$O$74,15,FALSE)","v":{"v":5,"d":"5.0"}},{"$f":"SUM(L4:Q4)","v":{"v":909.4000000000001,"d":"909.4"}},{"$f":"IF(V4>0,W4/V4,0)","v":{"v":182.16666666666666,"d":"182.2"}},{"$f":"VLOOKUP(A4,Formelhilfe!$A$15:$P$74,16,FALSE)","v":{"v":9,"d":"9.0"}},{"$f":"SUM(C4:H4,L4:Q4)","v":{"v":1639.5,"d":"1,639.5"}}]
["Bruns Henrik",{"$f":"VLOOKUP(A5,'Wettkampf 1'!$B$16:$C$75,2,FALSE)","v":"Lähden"},{"$f":"VLOOKUP(A5,'Wettkampf 1'!$B$16:$D$75,3,FALSE)","v":184.5},{"$f":"VLOOKUP($A5,Börgermoor!$B$16:$D$75,3,FALSE)","v":180.2},{"$f":"VLOOKUP($A5,'3'!$B$10:$D$75,3,FALSE)","v":187.9},{"$f":"VLOOKUP($A5,'4'!$B$10:$D$75,3,FALSE)","v":172.1},{"$f":"VLOOKUP($A5,'5'!$B$10:$D$75,3,FALSE)","v":{"v":0,"d":"0.0"}},{"$f":"VLOOKUP($A5,'6'!$B$10:$D$75,3,FALSE)","v":{"v":0,"d":"0.0"}},{"$f":"IF(J5 > 0,K5/J5,0)","v":{"v":181.175,"d":"181.2"}},{"$f":"VLOOKUP(A5,Formelhilfe!$A$15:$H$74,8,FALSE)","v":{"v":4,"d":"4.0"}},{"$f":"SUM(C5:H5)","v":724.7},{"$f":"VLOOKUP($A5,'7'!$B$10:$D$75,3,FALSE)","v":183.9},{"$f":"VLOOKUP($A5,'8'!$B$10:$D$75,3,FALSE)","v":179.1},{"$f":"VLOOKUP($A5,'9'!$B$10:$D$75,3,FALSE)","v":184.7},{"$f":"VLOOKUP($A5,'10'!$B$10:$D$75,3,FALSE)","v":180.7},{"$f":"VLOOKUP($A5,'11'!$B$10:$D$75,3,FALSE)","v":178.9},{"$f":"VLOOKUP($A5,'12'!$B$10:$D$75,3,FALSE)","v":{"v":0,"d":"0.0"}},{"$f":"IF(S5 >0,T5/S5,0)","v":{"v":181.46,"d":"181.5"}},{"$f":"VLOOKUP(A5,Formelhilfe!$A$15:$O$74,15,FALSE)","v":{"v":5,"d":"5.0"}},{"$f":"SUM(L5:Q5)","v":{"v":907.3000000000001,"d":"907.3"}},{"$f":"IF(V5>0,W5/V5,0)","v":{"v":181.33333333333337,"d":"181.3"}},{"$f":"VLOOKUP(A5,Formelhilfe!$A$15:$P$74,16,FALSE)","v":{"v":9,"d":"9.0"}},{"$f":"SUM(C5:H5,L5:Q5)","v":{"v":1632.0000000000002,"d":"1,632.0"}}]
["Gäken Lena",{"$f":"VLOOKUP(A6,'Wettkampf 1'!$B$16:$C$75,2,FALSE)","v":"Esterwegen"},{"$f":"VLOOKUP(A6,'Wettkampf 1'!$B$16:$D$75,3,FALSE)","v":186.7},{"$f":"VLOOKUP($A6,Börgermoor!$B$16:$D$75,3,FALSE)","v":170.4},{"$f":"VLOOKUP($A6,'3'!$B$10:$D$75,3,FALSE)","v":175.5},{"$f":"VLOOKUP($A6,'4'!$B$10:$D$75,3,FALSE)","v":179.5},{"$f":"VLOOKUP($A6,'5'!$B$10:$D$75,3,FALSE)","v":{"v":0,"d":"0.0"}},{"$f":"VLOOKUP($A6,'6'!$B$10:$D$75,3,FALSE)","v":{"v":0,"d":"0.0"}},{"$f":"IF(J6 > 0,K6/J6,0)","v":{"v":178.025,"d":"178.0"}},{"$f":"VLOOKUP(A6,Formelhilfe!$A$15:$H$74,8,FALSE)","v":{"v":4,"d":"4.0"}},{"$f":"SUM(C6:H6)","v":712.1},{"$f":"VLOOKUP($A6,'7'!$B$10:$D$75,3,FALSE)","v":170.4},{"$f":"VLOOKUP($A6,'8'!$B$10:$D$75,3,FALSE)","v":184.7},{"$f":"VLOOKUP($A6,'9'!$B$10:$D$75,3,FALSE)","v":185.5},{"$f":"VLOOKUP($A6,'10'!$B$10:$D$75,3,FALSE)","v":179.6},{"$f":"VLOOKUP($A6,'11'!$B$10:$D$75,3,FALSE)","v":{"v":188,"d":"188.0"}},{"$f":"VLOOKUP($A6,'12'!$B$10:$D$75,3,FALSE)","v":{"v":0,"d":"0.0"}},{"$f":"IF(S6 >0,T6/S6,0)","v":{"v":181.64000000000001,"d":"181.6"}},{"$f":"VLOOKUP(A6,Formelhilfe!$A$15:$O$74,15,FALSE)","v":{"v":5,"d":"5.0"}},{"$f":"SUM(L6:Q6)","v":908.2},{"$f":"IF(V6>0,W6/V6,0)","v":{"v":180.03333333333333,"d":"180.0"}},{"$f":"VLOOKUP(A6,Formelhilfe!$A$15:$P$74,16,FALSE)","v":{"v":9,"d":"9.0"}},{"$f":"SUM(C6:H6,L6:Q6)","v":{"v":1620.3,"d":"1,620.3"}}]
["Wotte Lia",{"$f":"VLOOKUP(A7,'Wettkampf 1'!$B$16:$C$75,2,FALSE)","v":"Lorup"},{"$f":"VLOOKUP(A7,'Wettkampf 1'!$B$16:$D$75,3,FALSE)","v":148.9},{"$f":"VLOOKUP($A7,Börgermoor!$B$16:$D$75,3,FALSE)","v":166.8},{"$f":"VLOOKUP($A7,'3'!$B$10:$D$75,3,FALSE)","v":165.9},{"$f":"VLOOKUP($A7,'4'!$B$10:$D$75,3,FALSE)","v":170.3},{"$f":"VLOOKUP($A7,'5'!$B$10:$D$75,3,FALSE)","v":{"v":0,"d":"0.0"}},{"$f":"VLOOKUP($A7,'6'!$B$10:$D$75,3,FALSE)","v":{"v":0,"d":"0.0"}},{"$f":"IF(J7 > 0,K7/J7,0)","v":{"v":162.97500000000002,"d":"163.0"}},{"$f":"VLOOKUP(A7,Formelhilfe!$A$15:$H$74,8,FALSE)","v":{"v":4,"d":"4.0"}},{"$f":"SUM(C7:H7)","v":{"v":651.9000000000001,"d":"651.9"}},{"$f":"VLOOKUP($A7,'7'!$B$10:$D$75,3,FALSE)","v":166.3},{"$f":"VLOOKUP($A7,'8'!$B$10:$D$75,3,FALSE)","v":168.8},{"$f":"VLOOKUP($A7,'9'!$B$10:$D$75,3,FALSE)","v":178.6},{"$f":"VLOOKUP($A7,'10'!$B$10:$D$75,3,FALSE)","v":166.4},{"$f":"VLOOKUP($A7,'11'!$B$10:$D$75,3,FALSE)","v":182.2},{"$f":"VLOOKUP($A7,'12'!$B$10:$D$75,3,FALSE)","v":{"v":0,"d":"0.0"}},{"$f":"IF(S7 >0,T7/S7,0)","v":{"v":172.45999999999998,"d":"172.5"}},{"$f":"VLOOKUP(A7,Formelhilfe!$A$15:$O$74,15,FALSE)","v":{"v":5,"d":"5.0"}},{"$f":"SUM(L7:Q7)","v":862.3},{"$f":"IF(V7>0,W7/V7,0)","v":{"v":168.24444444444444,"d":"168.2"}},{"$f":"VLOOKUP(A7,Formelhilfe!$A$15:$P$74,16,FALSE)","v":{"v":9,"d":"9.0"}},{"$f":"SUM(C7:H7,L7:Q7)","v":{"v":1514.2,"d":"1,514.2"}}]
["Preut Jannis",{"$f":"VLOOKUP(A8,'Wettkampf 1'!$B$16:$C$75,2,FALSE)","v":"Lähden"},{"$f":"VLOOKUP(A8,'Wettkampf 1'!$B$16:$D$75,3,FALSE)","v":173.7},{"$f":"VLOOKUP($A8,Börgermoor!$B$16:$D$75,3,FALSE)","v":{"v":0,"d":"0.0"}},{"$f":"VLOOKUP($A8,'3'!$B$10:$D$75,3,FALSE)","v":{"v":173,"d":"173.0"}},{"$f":"VLOOKUP($A8,'4'!$B$10:$D$75,3,FALSE)","v":164.2},{"$f":"VLOOKUP($A8,'5'!$B$10:$D$75,3,FALSE)","v":{"v":0,"d":"0.0"}},{"$f":"VLOOKUP($A8,'6'!$B$10:$D$75,3,FALSE)","v":{"v":0,"d":"0.0"}},{"$f":"IF(J8 > 0,K8/J8,0)","v":{"v":170.29999999999998,"d":"170.3"}},{"$f":"VLOOKUP(A8,Formelhilfe!$A$15:$H$74,8,FALSE)","v":{"v":3,"d":"3.0"}},{"$f":"SUM(C8:H8)","v":510.9},{"$f":"VLOOKUP($A8,'7'!$B$10:$D$75,3,FALSE)","v":173.3},{"$f":"VLOOKUP($A8,'8'!$B$10:$D$75,3,FALSE)","v":166.4},{"$f":"VLOOKUP($A8,'9'!$B$10:$D$75,3,FALSE)","v":150.1},{"$f":"VLOOKUP($A8,'10'!$B$10:$D$75,3,FALSE)","v":149.6},{"$f":"VLOOKUP($A8,'11'!$B$10:$D$75,3,FALSE)","v":159.3},{"$f":"VLOOKUP($A8,'12'!$B$10:$D$75,3,FALSE)","v":{"v":0,"d":"0.0"}},{"$f":"IF(S8 >0,T8/S8,0)","v":{"v":159.74,"d":"159.7"}},{"$f":"VLOOKUP(A8,Formelhilfe!$A$15:$O$74,15,FALSE)","v":{"v":5,"d":"5.0"}},{"$f":"SUM(L8:Q8)","v":798.7},{"$f":"IF(V8>0,W8/V8,0)","v":163.7},{"$f":"VLOOKUP(A8,Formelhilfe!$A$15:$P$74,16,FALSE)","v":{"v":8,"d":"8.0"}},{"$f":"SUM(C8:H8,L8:Q8)","v":{"v":1309.6,"d":"1,309.6"}}]
["Runde Marcel",{"$f":"VLOOKUP(A9,'Wettkampf 1'!$B$16:$C$75,2,FALSE)","v":"Spahnharenstätte"},{"$f":"VLOOKUP(A9,'Wettkampf 1'!$B$16:$D$75,3,FALSE)","v":126.7},{"$f":"VLOOKUP($A9,Börgermoor!$B$16:$D$75,3,FALSE)","v":150.7},{"$f":"VLOOKUP($A9,'3'!$B$10:$D$75,3,FALSE)","v":144.5},{"$f":"VLOOKUP($A9,'4'!$B$10:$D$75,3,FALSE)","v":140.6},{"$f":"VLOOKUP($A9,'5'!$B$10:$D$75,3,FALSE)","v":{"v":0,"d":"0.0"}},{"$f":"VLOOKUP($A9,'6'!$B$10:$D$75,3,FALSE)","v":{"v":0,"d":"0.0"}},{"$f":"IF(J9 > 0,K9/J9,0)","v":{"v":140.625,"d":"140.6"}},{"$f":"VLOOKUP(A9,Formelhilfe!$A$15:$H$74,8,FALSE)","v":{"v":4,"d":"4.0"}},{"$f":"SUM(C9:H9)","v":562.5},{"$f":"VLOOKUP($A9,'7'!$B$10:$D$75,3,FALSE)","v":155.8},{"$f":"VLOOKUP($A9,'8'!$B$10:$D$75,3,FALSE)","v":151.2},{"$f":"VLOOKUP($A9,'9'!$B$10:$D$75,3,FALSE)","v":{"v":137,"d":"137.0"}},{"$f":"VLOOKUP($A9,'10'!$B$10:$D$75,3,FALSE)","v":{"v":147,"d":"147.0"}},{"$f":"VLOOKUP($A9,'11'!$B$10:$D$75,3,FALSE)","v":{"v":154,"d":"154.0"}},{"$f":"VLOOKUP($A9,'12'!$B$10:$D$75,3,FALSE)","v":{"v":0,"d":"0.0"}},{"$f":"IF(S9 >0,T9/S9,0)","v":{"v":149,"d":"149.0"}},{"$f":"VLOOKUP(A9,Formelhilfe!$A$15:$O$74,15,FALSE)","v":{"v":5,"d":"5.0"}},{"$f":"SUM(L9:Q9)","v":{"v":745,"d":"745.0"}},{"$f":"IF(V9>0,W9/V9,0)","v":{"v":145.27777777777777,"d":"145.3"}},{"$f":"VLOOKUP(A9,Formelhilfe!$A$15:$P$74,16,FALSE)","v":{"v":9,"d":"9.0"}},{"$f":"SUM(C9:H9,L9:Q9)","v":{"v":1307.5,"d":"1,307.5"}}]
["Wotte Hannes",{"$f":"VLOOKUP(A10,'Wettkampf 1'!$B$16:$C$75,2,FALSE)","v":"Lorup"},{"$f":"VLOOKUP(A10,'Wettkampf 1'!$B$16:$D$75,3,FALSE)","v":135.3},{"$f":"VLOOKUP($A10,Börgermoor!$B$16:$D$75,3,FALSE)","v":125.8},{"$f":"VLOOKUP($A10,'3'!$B$10:$D$75,3,FALSE)","v":139.7},{"$f":"VLOOKUP($A10,'4'!$B$10:$D$75,3,FALSE)","v":144.1},{"$f":"VLOOKUP($A10,'5'!$B$10:$D$75,3,FALSE)","v":{"v":0,"d":"0.0"}},{"$f":"VLOOKUP($A10,'6'!$B$10:$D$75,3,FALSE)","v":{"v":0,"d":"0.0"}},{"$f":"IF(J10 > 0,K10/J10,0)","v":{"v":136.225,"d":"136.2"}},{"$f":"VLOOKUP(A10,Formelhilfe!$A$15:$H$74,8,FALSE)","v":{"v":4,"d":"4.0"}},{"$f":"SUM(C10:H10)","v":544.9},{"$f":"VLOOKUP($A10,'7'!$B$10:$D$75,3,FALSE)","v":131.3},{"$f":"VLOOKUP($A10,'8'!$B$10:$D$75,3,FALSE)","v":135.9},{"$f":"VLOOKUP($A10,'9'!$B$10:$D$75,3,FALSE)","v":139.8},{"$f":"VLOOKUP($A10,'10'!$B$10:$D$75,3,FALSE)","v":149.6},{"$f":"VLOOKUP($A10,'11'!$B$10:$D$75,3,FALSE)","v":140.3},{"$f":"VLOOKUP($A10,'12'!$B$10:$D$75,3,FALSE)","v":{"v":0,"d":"0.0"}},{"$f":"IF(S10 >0,T10/S10,0)","v":{"v":139.38000000000002,"d":"139.4"}},{"$f":"VLOOKUP(A10,Formelhilfe!$A$15:$O$74,15,FALSE)","v":{"v":5,"d":"5.0"}},{"$f":"SUM(L10:Q10)","v":{"v":696.9000000000001,"d":"696.9"}},{"$f":"IF(V10>0,W10/V10,0)","v":{"v":137.97777777777776,"d":"138.0"}},{"$f":"VLOOKUP(A10,Formelhilfe!$A$15:$P$74,16,FALSE)","v":{"v":9,"d":"9.0"}},{"$f":"SUM(C10:H10,L10:Q10)","v":{"v":1241.8,"d":"1,241.8"}}]
["Helmer Maike",{"$f":"VLOOKUP(A11,'Wettkampf 1'!$B$16:$C$75,2,FALSE)","v":"Lorup"},{"$f":"VLOOKUP(A11,'Wettkampf 1'!$B$16:$D$75,3,FALSE)","v":91.9},{"$f":"VLOOKUP($A11,Börgermoor!$B$16:$D$75,3,FALSE)","v":101.8},{"$f":"VLOOKUP($A11,'3'!$B$10:$D$75,3,FALSE)","v":130.9},{"$f":"VLOOKUP($A11,'4'!$B$10:$D$75,3,FALSE)","v":118.8},{"$f":"VLOOKUP($A11,'5'!$B$10:$D$75,3,FALSE)","v":{"v":0,"d":"0.0"}},{"$f":"VLOOKUP($A11,'6'!$B$10:$D$75,3,FALSE)","v":{"v":0,"d":"0.0"}},{"$f":"IF(J11 > 0,K11/J11,0)","v":{"v":110.85000000000001,"d":"110.9"}},{"$f":"VLOOKUP(A11,Formelhilfe!$A$15:$H$74,8,FALSE)","v":{"v":4,"d":"4.0"}},{"$f":"SUM(C11:H11)","v":{"v":443.40000000000003,"d":"443.4"}},{"$f":"VLOOKUP($A11,'7'!$B$10:$D$75,3,FALSE)","v":127.8},{"$f":"VLOOKUP($A11,'8'!$B$10:$D$75,3,FALSE)","v":139.5},{"$f":"VLOOKUP($A11,'9'!$B$10:$D$75,3,FALSE)","v":180.9},{"$f":"VLOOKUP($A11,'10'!$B$10:$D$75,3,FALSE)","v":155.1},{"$f":"VLOOKUP($A11,'11'!$B$10:$D$75,3,FALSE)","v":{"v":170,"d":"170.0"}},{"$f":"VLOOKUP($A11,'12'!$B$10:$D$75,3,FALSE)","v":{"v":0,"d":"0.0"}},{"$f":"IF(S11 >0,T11/S11,0)","v":{"v":154.66000000000003,"d":"154.7"}},{"$f":"VLOOKUP(A11,Formelhilfe!$A$15:$O$74,15,FALSE)","v":{"v":5,"d":"5.0"}},{"$f":"SUM(L11:Q11)","v":{"v":773.3000000000001,"d":"773.3"}},{"$f":"IF(V11>0,W11/V11,0)","v":{"v":135.1888888888889,"d":"135.2"}},{"$f":"VLOOKUP(A11,Formelhilfe!$A$15:$P$74,16,FALSE)","v":{"v":9,"d":"9.0"}},{"$f":"SUM(C11:H11,L11:Q11)","v":{"v":1216.7,"d":"1,216.7"}}]
["Kohnen Saskia",{"$f":"VLOOKUP(A12,'Wettkampf 1'!$B$16:$C$75,2,FALSE)","v":"Börgermoor"},{"$f":"VLOOKUP(A12,'Wettkampf 1'!$B$16:$D$75,3,FALSE)","v":134.9},{"$f":"VLOOKUP($A12,Börgermoor!$B$16:$D$75,3,FALSE)","v":139.4},{"$f":"VLOOKUP($A12,'3'!$B$10:$D$75,3,FALSE)","v":135.8},{"$f":"VLOOKUP($A12,'4'!$B$10:$D$75,3,FALSE)","v":134.2},{"$f":"VLOOKUP($A12,'5'!$B$10:$D$75,3,FALSE)","v":{"v":0,"d":"0.0"}},{"$f":"VLOOKUP($A12,'6'!$B$10:$D$75,3,FALSE)","v":{"v":0,"d":"0.0"}},{"$f":"IF(J12 > 0,K12/J12,0)","v":{"v":136.075,"d":"136.1"}},{"$f":"VLOOKUP(A12,Formelhilfe!$A$15:$H$74,8,FALSE)","v":{"v":4,"d":"4.0"}},{"$f":"SUM(C12:H12)","v":544.3},{"$f":"VLOOKUP($A12,'7'!$B$10:$D$75,3,FALSE)","v":{"v":0,"d":"0.0"}},{"$f":"VLOOKUP($A12,'8'!$B$10:$D$75,3,FALSE)","v":145.7},{"$f":"VLOOKUP($A12,'9'!$B$10:$D$75,3,FALSE)","v":175.5},{"$f":"VLOOKUP($A12,'10'!$B$10:$D$75,3,FALSE)","v":137.2},{"$f":"VLOOKUP($A12,'11'!$B$10:$D$75,3,FALSE)","v":160.3},{"$f":"VLOOKUP($A12,'12'!$B$10:$D$75,3,FALSE)","v":{"v":0,"d":"0.0"}},{"$f":"IF(S12 >0,T12/S12,0)","v":{"v":154.675,"d":"154.7"}},{"$f":"VLOOKUP(A12,Formelhilfe!$A$15:$O$74,15,FALSE)","v":{"v":4,"d":"4.0"}},{"$f":"SUM(L12:Q12)","v":618.7},{"$f":"IF(V12>0,W12/V12,0)","v":{"v":145.375,"d":"145.4"}},{"$f":"VLOOKUP(A12,Formelhilfe!$A$15:$P$74,16,FALSE)","v":{"v":8,"d":"8.0"}},{"$f":"SUM(C12:H12,L12:Q12)","v":{"v":1163,"d":"1,163.0"}}]
["Jansen Daniel",{"$f":"VLOOKUP(A13,'Wettkampf 1'!$B$16:$C$75,2,FALSE)","v":"Esterwegen"},{"$f":"VLOOKUP(A13,'Wettkampf 1'!$B$16:$D$75,3,FALSE)","v":154.9},{"$f":"VLOOKUP($A13,Börgermoor!$B$16:$D$75,3,FALSE)","v":132.3},{"$f":"VLOOKUP($A13,'3'!$B$10:$D$75,3,FALSE)","v":155.1},{"$f":"VLOOKUP($A13,'4'!$B$10:$D$75,3,FALSE)","v":{"v":134,"d":"134.0"}},{"$f":"VLOOKUP($A13,'5'!$B$10:$D$75,3,FALSE)","v":{"v":0,"d":"0.0"}},{"$f":"VLOOKUP($A13,'6'!$B$10:$D$75,3,FALSE)","v":{"v":0,"d":"0.0"}},{"$f":"IF(J13 > 0,K13/J13,0)","v":{"v":144.07500000000002,"d":"144.1"}},{"$f":"VLOOKUP(A13,Formelhilfe!$A$15:$H$74,8,FALSE)","v":{"v":4,"d":"4.0"}},{"$f":"SUM(C13:H13)","v":{"v":576.3000000000001,"d":"576.3"}},{"$f":"VLOOKUP($A13,'7'!$B$10:$D$75,3,FALSE)","v":166.5},{"$f":"VLOOKUP($A13,'8'!$B$10:$D$75,3,FALSE)","v":126.8},{"$f":"VLOOKUP($A13,'9'!$B$10:$D$75,3,FALSE)","v":{"v":0,"d":"0.0"}},{"$f":"VLOOKUP($A13,'10'!$B$10:$D$75,3,FALSE)","v":139.8},{"$f":"VLOOKUP($A13,'11'!$B$10:$D$75,3,FALSE)","v":123.9},{"$f":"VLOOKUP($A13,'12'!$B$10:$D$75,3,FALSE)","v":{"v":0,"d":"0.0"}},{"$f":"IF(S13 >0,T13/S13,0)","v":{"v":139.25,"d":"139.3"}},{"$f":"VLOOKUP(A13,Formelhilfe!$A$15:$O$74,15,FALSE)","v":{"v":4,"d":"4.0"}},{"$f":"SUM(L13:Q13)","v":{"v":557,"d":"557.0"}},{"$f":"IF(V13>0,W13/V13,0)","v":{"v":141.66250000000002,"d":"141.7"}},{"$f":"VLOOKUP(A13,Formelhilfe!$A$15:$P$74,16,FALSE)","v":{"v":8,"d":"8.0"}},{"$f":"SUM(C13:H13,L13:Q13)","v":{"v":1133.3000000000002,"d":"1,133.3"}}]
["Fleschenberg Jana",{"$f":"VLOOKUP(A14,'Wettkampf 1'!$B$16:$C$75,2,FALSE)","v":"Lähden"},{"$f":"VLOOKUP(A14,'Wettkampf 1'!$B$16:$D$75,3,FALSE)","v":{"v":0,"d":"0.0"}},{"$f":"VLOOKUP($A14,Börgermoor!$B$16:$D$75,3,FALSE)","v":{"v":0,"d":"0.0"}},{"$f":"VLOOKUP($A14,'3'!$B$10:$D$75,3,FALSE)","v":178.6},{"$f":"VLOOKUP($A14,'4'!$B$10:$D$75,3,FALSE)","v":{"v":0,"d":"0.0"}},{"$f":"VLOOKUP($A14,'5'!$B$10:$D$75,3,FALSE)","v":{"v":0,"d":"0.0"}},{"$f":"VLOOKUP($A14,'6'!$B$10:$D$75,3,FALSE)","v":{"v":0,"d":"0.0"}},{"$f":"IF(J14 > 0,K14/J14,0)","v":178.6},{"$f":"VLOOKUP(A14,Formelhilfe!$A$15:$H$74,8,FALSE)","v":{"v":1,"d":"1.0"}},{"$f":"SUM(C14:H14)","v":178.6},{"$f":"VLOOKUP($A14,'7'!$B$10:$D$75,3,FALSE)","v":179.2},{"$f":"VLOOKUP($A14,'8'!$B$10:$D$75,3,FALSE)","v":191.9},{"$f":"VLOOKUP($A14,'9'!$B$10:$D$75,3,FALSE)","v":186.5},{"$f":"VLOOKUP($A14,'10'!$B$10:$D$75,3,FALSE)","v":189.1},{"$f":"VLOOKUP($A14,'11'!$B$10:$D$75,3,FALSE)","v":185.8},{"$f":"VLOOKUP($A14,'12'!$B$10:$D$75,3,FALSE)","v":{"v":0,"d":"0.0"}},{"$f":"IF(S14 >0,T14/S14,0)","v":186.5},{"$f":"VLOOKUP(A14,Formelhilfe!$A$15:$O$74,15,FALSE)","v":{"v":5,"d":"5.0"}},{"$f":"SUM(L14:Q14)","v":932.5},{"$f":"IF(V14>0,W14/V14,0)","v":{"v":185.1833333333333,"d":"185.2"}},{"$f":"VLOOKUP(A14,Formelhilfe!$A$15:$P$74,16,FALSE)","v":{"v":6,"d":"6.0"}},{"$f":"SUM(C14:H14,L14:Q14)","v":{"v":1111.1,"d":"1,111.1"}}]
["Gretenabeln Elias",{"$f":"VLOOKUP(A15,'Wettkampf 1'!$B$16:$C$75,2,FALSE)","v":"Lorup"},{"$f":"VLOOKUP(A15,'Wettkampf 1'!$B$16:$D$75,3,FALSE)","v":110.7},{"$f":"VLOOKUP($A15,Börgermoor!$B$16:$D$75,3,FALSE)","v":111.9},{"$f":"VLOOKUP($A15,'3'!$B$10:$D$75,3,FALSE)","v":82.6},{"$f":"VLOOKUP($A15,'4'!$B$10:$D$75,3,FALSE)","v":128.8},{"$f":"VLOOKUP($A15,'5'!$B$10:$D$75,3,FALSE)","v":{"v":0,"d":"0.0"}},{"$f":"VLOOKUP($A15,'6'!$B$10:$D$75,3,FALSE)","v":{"v":0,"d":"0.0"}},{"$f":"IF(J15 > 0,K15/J15,0)","v":{"v":108.50000000000001,"d":"108.5"}},{"$f":"VLOOKUP(A15,Formelhilfe!$A$15:$H$74,8,FALSE)","v":{"v":4,"d":"4.0"}},{"$f":"SUM(C15:H15)","v":{"v":434.00000000000006,"d":"434.0"}},{"$f":"VLOOKUP($A15,'7'!$B$10:$D$75,3,FALSE)","v":105.2},{"$f":"VLOOKUP($A15,'8'!$B$10:$D$75,3,FALSE)","v":117.5},{"$f":"VLOOKUP($A15,'9'!$B$10:$D$75,3,FALSE)","v":148.2},{"$f":"VLOOKUP($A15,'10'!$B$10:$D$75,3,FALSE)","v":{"v":142,"d":"142.0"}},{"$f":"VLOOKUP($A15,'11'!$B$10:$D$75,3,FALSE)","v":148.2},{"$f":"VLOOKUP($A15,'12'!$B$10:$D$75,3,FALSE)","v":{"v":0,"d":"0.0"}},{"$f":"IF(S15 >0,T15/S15,0)","v":{"v":132.21999999999997,"d":"132.2"}},{"$f":"VLOOKUP(A15,Formelhilfe!$A$15:$O$74,15,FALSE)","v":{"v":5,"d":"5.0"}},{"$f":"SUM(L15:Q15)","v":{"v":661.0999999999999,"d":"661.1"}},{"$f":"IF(V15>0,W15/V15,0)","v":{"v":121.67777777777779,"d":"121.7"}},{"$f":"VLOOKUP(A15,Formelhilfe!$A$15:$P$74,16,FALSE)","v":{"v":9,"d":"9.0"}},{"$f":"SUM(C15:H15,L15:Q15)","v":{"v":1095.1000000000001,"d":"1,095.1"}}]
["Többen Jannes",{"$f":"VLOOKUP(A16,'Wettkampf 1'!$B$16:$C$75,2,FALSE)","v":"Lorup"},{"$f":"VLOOKUP(A16,'Wettkampf 1'!$B$16:$D$75,3,FALSE)","v":108.5},{"$f":"VLOOKUP($A16,Börgermoor!$B$16:$D$75,3,FALSE)","v":{"v":91,"d":"91.0"}},{"$f":"VLOOKUP($A16,'3'!$B$10:$D$75,3,FALSE)","v":{"v":76,"d":"76.0"}},{"$f":"VLOOKUP($A16,'4'!$B$10:$D$75,3,FALSE)","v":105.4},{"$f":"VLOOKUP($A16,'5'!$B$10:$D$75,3,FALSE)","v":{"v":0,"d":"0.0"}},{"$f":"VLOOKUP($A16,'6'!$B$10:$D$75,3,FALSE)","v":{"v":0,"d":"0.0"}},{"$f":"IF(J16 > 0,K16/J16,0)","v":{"v":95.225,"d":"95.2"}},{"$f":"VLOOKUP(A16,Formelhilfe!$A$15:$H$74,8,FALSE)","v":{"v":4,"d":"4.0"}},{"$f":"SUM(C16:H16)","v":380.9},{"$f":"VLOOKUP($A16,'7'!$B$10:$D$75,3,FALSE)","v":109.5},{"$f":"VLOOKUP($A16,'8'!$B$10:$D$75,3,FALSE)","v":125.6},{"$f":"VLOOKUP($A16,'9'!$B$10:$D$75,3,FALSE)","v":115.3},{"$f":"VLOOKUP($A16,'10'!$B$10:$D$75,3,FALSE)","v":131.9},{"$f":"VLOOKUP($A16,'11'!$B$10:$D$75,3,FALSE)","v":128.3},{"$f":"VLOOKUP($A16,'12'!$B$10:$D$75,3,FALSE)","v":{"v":0,"d":"0.0"}},{"$f":"IF(S16 >0,T16/S16,0)","v":{"v":122.11999999999998,"d":"122.1"}},{"$f":"VLOOKUP(A16,Formelhilfe!$A$15:$O$74,15,FALSE)","v":{"v":5,"d":"5.0"}},{"$f":"SUM(L16:Q16)","v":{"v":610.5999999999999,"d":"610.6"}},{"$f":"IF(V16>0,W16/V16,0)","v":{"v":110.16666666666667,"d":"110.2"}},{"$f":"VLOOKUP(A16,Formelhilfe!$A$15:$P$74,16,FALSE)","v":{"v":9,"d":"9.0"}},{"$f":"SUM(C16:H16,L16:Q16)","v":991.5}]
["von Seggern Moritz",{"$f":"VLOOKUP(A17,'Wettkampf 1'!$B$16:$C$75,2,FALSE)","v":"Lähden"},{"$f":"VLOOKUP(A17,'Wettkampf 1'!$B$16:$D$75,3,FALSE)","v":{"v":0,"d":"0.0"}},{"$f":"VLOOKUP($A17,Börgermoor!$B$16:$D$75,3,FALSE)","v":{"v":0,"d":"0.0"}},{"$f":"VLOOKUP($A17,'3'!$B$10:$D$75,3,FALSE)","v":{"v":0,"d":"0.0"}},{"$f":"VLOOKUP($A17,'4'!$B$10:$D$75,3,FALSE)","v":142.7},{"$f":"VLOOKUP($A17,'5'!$B$10:$D$75,3,FALSE)","v":{"v":0,"d":"0.0"}},{"$f":"VLOOKUP($A17,'6'!$B$10:$D$75,3,FALSE)","v":{"v":0,"d":"0.0"}},{"$f":"IF(J17 > 0,K17/J17,0)","v":142.7},{"$f":"VLOOKUP(A17,Formelhilfe!$A$15:$H$74,8,FALSE)","v":{"v":1,"d":"1.0"}},{"$f":"SUM(C17:H17)","v":142.7},{"$f":"VLOOKUP($A17,'7'!$B$10:$D$75,3,FALSE)","v":{"v":133,"d":"133.0"}},{"$f":"VLOOKUP($A17,'8'!$B$10:$D$75,3,FALSE)","v":152.4},{"$f":"VLOOKUP($A17,'9'!$B$10:$D$75,3,FALSE)","v":166.8},{"$f":"VLOOKUP($A17,'10'!$B$10:$D$75,3,FALSE)","v":162.8},{"$f":"VLOOKUP($A17,'11'!$B$10:$D$75,3,FALSE)","v":154.1},{"$f":"VLOOKUP($A17,'12'!$B$10:$D$75,3,FALSE)","v":{"v":0,"d":"0.0"}},{"$f":"IF(S17 >0,T17/S17,0)","v":{"v":153.82,"d":"153.8"}},{"$f":"VLOOKUP(A17,Formelhilfe!$A$15:$O$74,15,FALSE)","v":{"v":5,"d":"5.0"}},{"$f":"SUM(L17:Q17)","v":769.1},{"$f":"IF(V17>0,W17/V17,0)","v":{"v":151.96666666666667,"d":"152.0"}},{"$f":"VLOOKUP(A17,Formelhilfe!$A$15:$P$74,16,FALSE)","v":{"v":6,"d":"6.0"}},{"$f":"SUM(C17:H17,L17:Q17)","v":{"v":911.8000000000001,"d":"911.8"}}]
["Jansen Lars",{"$f":"VLOOKUP(A18,'Wettkampf 1'!$B$16:$C$75,2,FALSE)","v":"Spahnharenstätte"},{"$f":"VLOOKUP(A18,'Wettkampf 1'!$B$16:$D$75,3,FALSE)","v":124.4},{"$f":"VLOOKUP($A18,Börgermoor!$B$16:$D$75,3,FALSE)","v":144.2},{"$f":"VLOOKUP($A18,'3'!$B$10:$D$75,3,FALSE)","v":{"v":119,"d":"119.0"}},{"$f":"VLOOKUP($A18,'4'!$B$10:$D$75,3,FALSE)","v":125.3},{"$f":"VLOOKUP($A18,'5'!$B$10:$D$75,3,FALSE)","v":{"v":0,"d":"0.0"}},{"$f":"VLOOKUP($A18,'6'!$B$10:$D$75,3,FALSE)","v":{"v":0,"d":"0.0"}},{"$f":"IF(J18 > 0,K18/J18,0)","v":{"v":128.225,"d":"128.2"}},{"$f":"VLOOKUP(A18,Formelhilfe!$A$15:$H$74,8,FALSE)","v":{"v":4,"d":"4.0"}},{"$f":"SUM(C18:H18)","v":512.9},{"$f":"VLOOKUP($A18,'7'!$B$10:$D$75,3,FALSE)","v":{"v":0,"d":"0.0"}},{"$f":"VLOOKUP($A18,'8'!$B$10:$D$75,3,FALSE)","v":121.9},{"$f":"VLOOKUP($A18,'9'!$B$10:$D$75,3,FALSE)","v":125.3},{"$f":"VLOOKUP($A18,'10'!$B$10:$D$75,3,FALSE)","v":{"v":0,"d":"0.0"}},{"$f":"VLOOKUP($A18,'11'!$B$10:$D$75,3,FALSE)","v":140.7},{"$f":"VLOOKUP($A18,'12'!$B$10:$D$75,3,FALSE)","v":{"v":0,"d":"0.0"}},{"$f":"IF(S18 >0,T18/S18,0)","v":{"v":129.29999999999998,"d":"129.3"}},{"$f":"VLOOKUP(A18,Formelhilfe!$A$15:$O$74,15,FALSE)","v":{"v":3,"d":"3.0"}},{"$f":"SUM(L18:Q18)","v":387.9},{"$f":"IF(V18>0,W18/V18,0)","v":{"v":128.68571428571428,"d":"128.7"}},{"$f":"VLOOKUP(A18,Formelhilfe!$A$15:$P$74,16,FALSE)","v":{"v":7,"d":"7.0"}},{"$f":"SUM(C18:H18,L18:Q18)","v":900.8}]
["Engbers Hannes",{"$f":"VLOOKUP(A19,'Wettkampf 1'!$B$16:$C$75,2,FALSE)","v":"Spahnharenstätte"},{"$f":"VLOOKUP(A19,'Wettkampf 1'!$B$16:$D$75,3,FALSE)","v":67.5},{"$f":"VLOOKUP($A19,Börgermoor!$B$16:$D$75,3,FALSE)","v":54.2},{"$f":"VLOOKUP($A19,'3'!$B$10:$D$75,3,FALSE)","v":{"v":0,"d":"0.0"}},{"$f":"VLOOKUP($A19,'4'!$B$10:$D$75,3,FALSE)","v":78.5},{"$f":"VLOOKUP($A19,'5'!$B$10:$D$75,3,FALSE)","v":{"v":0,"d":"0.0"}},{"$f":"VLOOKUP($A19,'6'!$B$10:$D$75,3,FALSE)","v":{"v":0,"d":"0.0"}},{"$f":"IF(J19 > 0,K19/J19,0)","v":{"v":66.73333333333333,"d":"66.7"}},{"$f":"VLOOKUP(A19,Formelhilfe!$A$15:$H$74,8,FALSE)","v":{"v":3,"d":"3.0"}},{"$f":"SUM(C19:H19)","v":200.2},{"$f":"VLOOKUP($A19,'7'!$B$10:$D$75,3,FALSE)","v":{"v":70,"d":"70.0"}},{"$f":"VLOOKUP($A19,'8'!$B$10:$D$75,3,FALSE)","v":88.4},{"$f":"VLOOKUP($A19,'9'!$B$10:$D$75,3,FALSE)","v":109.8},{"$f":"VLOOKUP($A19,'10'!$B$10:$D$75,3,FALSE)","v":101.5},{"$f":"VLOOKUP($A19,'11'!$B$10:$D$75,3,FALSE)","v":{"v":0,"d":"0.0"}},{"$f":"VLOOKUP($A19,'12'!$B$10:$D$75,3,FALSE)","v":{"v":0,"d":"0.0"}},{"$f":"IF(S19 >0,T19/S19,0)","v":{"v":92.425,"d":"92.4"}},{"$f":"VLOOKUP(A19,Formelhilfe!$A$15:$O$74,15,FALSE)","v":{"v":4,"d":"4.0"}},{"$f":"SUM(L19:Q19)","v":369.7},{"$f":"IF(V19>0,W19/V19,0)","v":{"v":81.41428571428573,"d":"81.4"}},{"$f":"VLOOKUP(A19,Formelhilfe!$A$15:$P$74,16,FALSE)","v":{"v":7,"d":"7.0"}},{"$f":"SUM(C19:H19,L19:Q19)","v":{"v":569.9000000000001,"d":"569.9"}}]
["Helmer, Nils",{"$f":"VLOOKUP(A20,'Wettkampf 1'!$B$16:$C$75,2,FALSE)","v":"Lorup"},{"$f":"VLOOKUP(A20,'Wettkampf 1'!$B$16:$D$75,3,FALSE)","v":{"v":0,"d":"0.0"}},{"$f":"VLOOKUP($A20,Börgermoor!$B$16:$D$75,3,FALSE)","v":{"v":0,"d":"0.0"}},{"$f":"VLOOKUP($A20,'3'!$B$10:$D$75,3,FALSE)","v":{"v":0,"d":"0.0"}},{"$f":"VLOOKUP($A20,'4'!$B$10:$D$75,3,FALSE)","v":{"v":0,"d":"0.0"}},{"$f":"VLOOKUP($A20,'5'!$B$10:$D$75,3,FALSE)","v":{"v":0,"d":"0.0"}},{"$f":"VLOOKUP($A20,'6'!$B$10:$D$75,3,FALSE)","v":{"v":0,"d":"0.0"}},{"$f":"IF(J20 > 0,K20/J20,0)","v":{"v":0,"d":"0.0"}},{"$f":"VLOOKUP(A20,Formelhilfe!$A$15:$H$74,8,FALSE)","v":{"v":0,"d":"0.0"}},{"$f":"SUM(C20:H20)","v":{"v":0,"d":"0.0"}},{"$f":"VLOOKUP($A20,'7'!$B$10:$D$75,3,FALSE)","v":{"v":0,"d":"0.0"}},{"$f":"VLOOKUP($A20,'8'!$B$10:$D$75,3,FALSE)","v":126.2},{"$f":"VLOOKUP($A20,'9'!$B$10:$D$75,3,FALSE)","v":71.8},{"$f":"VLOOKUP($A20,'10'!$B$10:$D$75,3,FALSE)","v":100.1},{"$f":"VLOOKUP($A20,'11'!$B$10:$D$75,3,FALSE)","v":{"v":142,"d":"142.0"}},{"$f":"VLOOKUP($A20,'12'!$B$10:$D$75,3,FALSE)","v":{"v":0,"d":"0.0"}},{"$f":"IF(S20 >0,T20/S20,0)","v":{"v":110.025,"d":"110.0"}},{"$f":"VLOOKUP(A20,Formelhilfe!$A$15:$O$74,15,FALSE)","v":{"v":4,"d":"4.0"}},{"$f":"SUM(L20:Q20)","v":440.1},{"$f":"IF(V20>0,W20/V20,0)","v":{"v":110.025,"d":"110.0"}},{"$f":"VLOOKUP(A20,Formelhilfe!$A$15:$P$74,16,FALSE)","v":{"v":4,"d":"4.0"}},{"$f":"SUM(C20:H20,L20:Q20)","v":440.1}]
["Pieper Jonas",{"$f":"VLOOKUP(A21,'Wettkampf 1'!$B$16:$C$75,2,FALSE)","v":"Esterwegen"},{"$f":"VLOOKUP(A21,'Wettkampf 1'!$B$16:$D$75,3,FALSE)","v":{"v":0,"d":"0.0"}},{"$f":"VLOOKUP($A21,Börgermoor!$B$16:$D$75,3,FALSE)","v":{"v":0,"d":"0.0"}},{"$f":"VLOOKUP($A21,'3'!$B$10:$D$75,3,FALSE)","v":{"v":0,"d":"0.0"}},{"$f":"VLOOKUP($A21,'4'!$B$10:$D$75,3,FALSE)","v":{"v":0,"d":"0.0"}},{"$f":"VLOOKUP($A21,'5'!$B$10:$D$75,3,FALSE)","v":{"v":0,"d":"0.0"}},{"$f":"VLOOKUP($A21,'6'!$B$10:$D$75,3,FALSE)","v":{"v":0,"d":"0.0"}},{"$f":"IF(J21 > 0,K21/J21,0)","v":{"v":0,"d":"0.0"}},{"$f":"VLOOKUP(A21,Formelhilfe!$A$15:$H$74,8,FALSE)","v":{"v":0,"d":"0.0"}},{"$f":"SUM(C21:H21)","v":{"v":0,"d":"0.0"}},{"$f":"VLOOKUP($A21,'7'!$B$10:$D$75,3,FALSE)","v":{"v":0,"d":"0.0"}},{"$f":"VLOOKUP($A21,'8'!$B$10:$D$75,3,FALSE)","v":147.7},{"$f":"VLOOKUP($A21,'9'!$B$10:$D$75,3,FALSE)","v":118.8},{"$f":"VLOOKUP($A21,'10'!$B$10:$D$75,3,FALSE)","v":117.2},{"$f":"VLOOKUP($A21,'11'!$B$10:$D$75,3,FALSE)","v":{"v":0,"d":"0.0"}},{"$f":"VLOOKUP($A21,'12'!$B$10:$D$75,3,FALSE)","v":{"v":0,"d":"0.0"}},{"$f":"IF(S21 >0,T21/S21,0)","v":{"v":127.89999999999999,"d":"127.9"}},{"$f":"VLOOKUP(A21,Formelhilfe!$A$15:$O$74,15,FALSE)","v":{"v":3,"d":"3.0"}},{"$f":"SUM(L21:Q21)","v":383.7},{"$f":"IF(V21>0,W21/V21,0)","v":{"v":127.89999999999999,"d":"127.9"}},{"$f":"VLOOKUP(A21,Formelhilfe!$A$15:$P$74,16,FALSE)","v":{"v":3,"d":"3.0"}},{"$f":"SUM(C21:H21,L21:Q21)","v":383.7}]
["Lüken Arne",{"$f":"VLOOKUP(A22,'Wettkampf 1'!$B$16:$C$75,2,FALSE)","v":"Lorup"},{"$f":"VLOOKUP(A22,'Wettkampf 1'!$B$16:$D$75,3,FALSE)","v":108.9},{"$f":"VLOOKUP($A22,Börgermoor!$B$16:$D$75,3,FALSE)","v":107.8},{"$f":"VLOOKUP($A22,'3'!$B$10:$D$75,3,FALSE)","v":114.4},{"$f":"VLOOKUP($A22,'4'!$B$10:$D$75,3,FALSE)","v":{"v":0,"d":"0.0"}},{"$f":"VLOOKUP($A22,'5'!$B$10:$D$75,3,FALSE)","v":{"v":0,"d":"0.0"}},{"$f":"VLOOKUP($A22,'6'!$B$10:$D$75,3,FALSE)","v":{"v":0,"d":"0.0"}},{"$f":"IF(J22 > 0,K22/J22,0)","v":{"v":110.36666666666667,"d":"110.4"}},{"$f":"VLOOKUP(A22,Formelhilfe!$A$15:$H$74,8,FALSE)","v":{"v":3,"d":"3.0"}},{"$f":"SUM(C22:H22)","v":331.1},{"$f":"VLOOKUP($A22,'7'!$B$10:$D$75,3,FALSE)","v":{"v":0,"d":"0.0"}},{"$f":"VLOOKUP($A22,'8'!$B$10:$D$75,3,FALSE)","v":{"v":0,"d":"0.0"}},{"$f":"VLOOKUP($A22,'9'!$B$10:$D$75,3,FALSE)","v":{"v":0,"d":"0.0"}},{"$f":"VLOOKUP($A22,'10'!$B$10:$D$75,3,FALSE)","v":{"v":0,"d":"0.0"}},{"$f":"VLOOKUP($A22,'11'!$B$10:$D$75,3,FALSE)","v":{"v":0,"d":"0.0"}},{"$f":"VLOOKUP($A22,'12'!$B$10:$D$75,3,FALSE)","v":{"v":0,"d":"0.0"}},{"$f":"IF(S22 >0,T22/S22,0)","v":{"v":0,"d":"0.0"}},{"$f":"VLOOKUP(A22,Formelhilfe!$A$15:$O$74,15,FALSE)","v":{"v":0,"d":"0.0"}},{"$f":"SUM(L22:Q22)","v":{"v":0,"d":"0.0"}},{"$f":"IF(V22>0,W22/V22,0)","v":{"v":110.36666666666667,"d":"110.4"}},{"$f":"VLOOKUP(A22,Formelhilfe!$A$15:$P$74,16,FALSE)","v":{"v":3,"d":"3.0"}},{"$f":"SUM(C22:H22,L22:Q22)","v":331.1}]
["Niemann Paul",{"$f":"VLOOKUP(A23,'Wettkampf 1'!$B$16:$C$75,2,FALSE)","v":"Börgermoor"},{"$f":"VLOOKUP(A23,'Wettkampf 1'!$B$16:$D$75,3,FALSE)","v":48.5},{"$f":"VLOOKUP($A23,Börgermoor!$B$16:$D$75,3,FALSE)","v":61.7},{"$f":"VLOOKUP($A23,'3'!$B$10:$D$75,3,FALSE)","v":91.5},{"$f":"VLOOKUP($A23,'4'!$B$10:$D$75,3,FALSE)","v":{"v":0,"d":"0.0"}},{"$f":"VLOOKUP($A23,'5'!$B$10:$D$75,3,FALSE)","v":{"v":0,"d":"0.0"}},{"$f":"VLOOKUP($A23,'6'!$B$10:$D$75,3,FALSE)","v":{"v":0,"d":"0.0"}},{"$f":"IF(J23 > 0,K23/J23,0)","v":{"v":67.23333333333333,"d":"67.2"}},{"$f":"VLOOKUP(A23,Formelhilfe!$A$15:$H$74,8,FALSE)","v":{"v":3,"d":"3.0"}},{"$f":"SUM(C23:H23)","v":201.7},{"$f":"VLOOKUP($A23,'7'!$B$10:$D$75,3,FALSE)","v":{"v":0,"d":"0.0"}},{"$f":"VLOOKUP($A23,'8'!$B$10:$D$75,3,FALSE)","v":{"v":0,"d":"0.0"}},{"$f":"VLOOKUP($A23,'9'!$B$10:$D$75,3,FALSE)","v":{"v":0,"d":"0.0"}},{"$f":"VLOOKUP($A23,'10'!$B$10:$D$75,3,FALSE)","v":{"v":0,"d":"0.0"}},{"$f":"VLOOKUP($A23,'11'!$B$10:$D$75,3,FALSE)","v":{"v":0,"d":"0.0"}},{"$f":"VLOOKUP($A23,'12'!$B$10:$D$75,3,FALSE)","v":{"v":0,"d":"0.0"}},{"$f":"IF(S23 >0,T23/S23,0)","v":{"v":0,"d":"0.0"}},{"$f":"VLOOKUP(A23,Formelhilfe!$A$15:$O$74,15,FALSE)","v":{"v":0,"d":"0.0"}},{"$f":"SUM(L23:Q23)","v":{"v":0,"d":"0.0"}},{"$f":"IF(V23>0,W23/V23,0)","v":{"v":67.23333333333333,"d":"67.2"}},{"$f":"VLOOKUP(A23,Formelhilfe!$A$15:$P$74,16,FALSE)","v":{"v":3,"d":"3.0"}},{"$f":"SUM(C23:H23,L23:Q23)","v":201.7}]
["Schütze 7",{"$f":"VLOOKUP(A24,'Wettkampf 1'!$B$16:$C$75,2,FALSE)","v":"Sögel"},{"$f":"VLOOKUP(A24,'Wettkampf 1'!$B$16:$D$75,3,FALSE)","v":{"v":0,"d":"0.0"}},{"$f":"VLOOKUP($A24,Börgermoor!$B$16:$D$75,3,FALSE)","v":{"v":0,"d":"0.0"}},{"$f":"VLOOKUP($A24,'3'!$B$10:$D$75,3,FALSE)","v":{"v":0,"d":"0.0"}},{"$f":"VLOOKUP($A24,'4'!$B$10:$D$75,3,FALSE)","v":{"v":0,"d":"0.0"}},{"$f":"VLOOKUP($A24,'5'!$B$10:$D$75,3,FALSE)","v":{"v":0,"d":"0.0"}},{"$f":"VLOOKUP($A24,'6'!$B$10:$D$75,3,FALSE)","v":{"v":0,"d":"0.0"}},{"$f":"IF(J24 > 0,K24/J24,0)","v":{"v":0,"d":"0.0"}},{"$f":"VLOOKUP(A24,Formelhilfe!$A$15:$H$74,8,FALSE)","v":{"v":0,"d":"0.0"}},{"$f":"SUM(C24:H24)","v":{"v":0,"d":"0.0"}},{"$f":"VLOOKUP($A24,'7'!$B$10:$D$75,3,FALSE)","v":{"v":0,"d":"0.0"}},{"$f":"VLOOKUP($A24,'8'!$B$10:$D$75,3,FALSE)","v":{"v":0,"d":"0.0"}},{"$f":"VLOOKUP($A24,'9'!$B$10:$D$75,3,FALSE)","v":{"v":0,"d":"0.0"}},{"$f":"VLOOKUP($A24,'10'!$B$10:$D$75,3,FALSE)","v":{"v":0,"d":"0.0"}},{"$f":"VLOOKUP($A24,'11'!$B$10:$D$75,3,FALSE)","v":{"v":0,"d":"0.0"}},{"$f":"VLOOKUP($A24,'12'!$B$10:$D$75,3,FALSE)","v":{"v":0,"d":"0.0"}},{"$f":"IF(S24 >0,T24/S24,0)","v":{"v":0,"d":"0.0"}},{"$f":"VLOOKUP(A24,Formelhilfe!$A$15:$O$74,15,FALSE)","v":{"v":0,"d":"0.0"}},{"$f":"SUM(L24:Q24)","v":{"v":0,"d":"0.0"}},{"$f":"IF(V24>0,W24/V24,0)","v":{"v":0,"d":"0.0"}},{"$f":"VLOOKUP(A24,Formelhilfe!$A$15:$P$74,16,FALSE)","v":{"v":0,"d":"0.0"}},{"$f":"SUM(C24:H24,L24:Q24)","v":{"v":0,"d":"0.0"}}]
["Schütze 8",{"$f":"VLOOKUP(A25,'Wettkampf 1'!$B$16:$C$75,2,FALSE)","v":"Sögel"},{"$f":"VLOOKUP(A25,'Wettkampf 1'!$B$16:$D$75,3,FALSE)","v":{"v":0,"d":"0.0"}},{"$f":"VLOOKUP($A25,Börgermoor!$B$16:$D$75,3,FALSE)","v":{"v":0,"d":"0.0"}},{"$f":"VLOOKUP($A25,'3'!$B$10:$D$75,3,FALSE)","v":{"v":0,"d":"0.0"}},{"$f":"VLOOKUP($A25,'4'!$B$10:$D$75,3,FALSE)","v":{"v":0,"d":"0.0"}},{"$f":"VLOOKUP($A25,'5'!$B$10:$D$75,3,FALSE)","v":{"v":0,"d":"0.0"}},{"$f":"VLOOKUP($A25,'6'!$B$10:$D$75,3,FALSE)","v":{"v":0,"d":"0.0"}},{"$f":"IF(J25 > 0,K25/J25,0)","v":{"v":0,"d":"0.0"}},{"$f":"VLOOKUP(A25,Formelhilfe!$A$15:$H$74,8,FALSE)","v":{"v":0,"d":"0.0"}},{"$f":"SUM(C25:H25)","v":{"v":0,"d":"0.0"}},{"$f":"VLOOKUP($A25,'7'!$B$10:$D$75,3,FALSE)","v":{"v":0,"d":"0.0"}},{"$f":"VLOOKUP($A25,'8'!$B$10:$D$75,3,FALSE)","v":{"v":0,"d":"0.0"}},{"$f":"VLOOKUP($A25,'9'!$B$10:$D$75,3,FALSE)","v":{"v":0,"d":"0.0"}},{"$f":"VLOOKUP($A25,'10'!$B$10:$D$75,3,FALSE)","v":{"v":0,"d":"0.0"}},{"$f":"VLOOKUP($A25,'11'!$B$10:$D$75,3,FALSE)","v":{"v":0,"d":"0.0"}},{"$f":"VLOOKUP($A25,'12'!$B$10:$D$75,3,FALSE)","v":{"v":0,"d":"0.0"}},{"$f":"IF(S25 >0,T25/S25,0)","v":{"v":0,"d":"0.0"}},{"$f":"VLOOKUP(A25,Formelhilfe!$A$15:$O$74,15,FALSE)","v":{"v":0,"d":"0.0"}},{"$f":"SUM(L25:Q25)","v":{"v":0,"d":"0.0"}},{"$f":"IF(V25>0,W25/V25,0)","v":{"v":0,"d":"0.0"}},{"$f":"VLOOKUP(A25,Formelhilfe!$A$15:$P$74,16,FALSE)","v":{"v":0,"d":"0.0"}},{"$f":"SUM(C25:H25,L25:Q25)","v":{"v":0,"d":"0.0"}}]
["Schütze 9",{"$f":"VLOOKUP(A26,'Wettkampf 1'!$B$16:$C$75,2,FALSE)","v":"Sögel"},{"$f":"VLOOKUP(A26,'Wettkampf 1'!$B$16:$D$75,3,FALSE)","v":{"v":0,"d":"0.0"}},{"$f":"VLOOKUP($A26,Börgermoor!$B$16:$D$75,3,FALSE)","v":{"v":0,"d":"0.0"}},{"$f":"VLOOKUP($A26,'3'!$B$10:$D$75,3,FALSE)","v":{"v":0,"d":"0.0"}},{"$f":"VLOOKUP($A26,'4'!$B$10:$D$75,3,FALSE)","v":{"v":0,"d":"0.0"}},{"$f":"VLOOKUP($A26,'5'!$B$10:$D$75,3,FALSE)","v":{"v":0,"d":"0.0"}},{"$f":"VLOOKUP($A26,'6'!$B$10:$D$75,3,FALSE)","v":{"v":0,"d":"0.0"}},{"$f":"IF(J26 > 0,K26/J26,0)","v":{"v":0,"d":"0.0"}},{"$f":"VLOOKUP(A26,Formelhilfe!$A$15:$H$74,8,FALSE)","v":{"v":0,"d":"0.0"}},{"$f":"SUM(C26:H26)","v":{"v":0,"d":"0.0"}},{"$f":"VLOOKUP($A26,'7'!$B$10:$D$75,3,FALSE)","v":{"v":0,"d":"0.0"}},{"$f":"VLOOKUP($A26,'8'!$B$10:$D$75,3,FALSE)","v":{"v":0,"d":"0.0"}},{"$f":"VLOOKUP($A26,'9'!$B$10:$D$75,3,FALSE)","v":{"v":0,"d":"0.0"}},{"$f":"VLOOKUP($A26,'10'!$B$10:$D$75,3,FALSE)","v":{"v":0,"d":"0.0"}},{"$f":"VLOOKUP($A26,'11'!$B$10:$D$75,3,FALSE)","v":{"v":0,"d":"0.0"}},{"$f":"VLOOKUP($A26,'12'!$B$10:$D$75,3,FALSE)","v":{"v":0,"d":"0.0"}},{"$f":"IF(S26 >0,T26/S26,0)","v":{"v":0,"d":"0.0"}},{"$f":"VLOOKUP(A26,Formelhilfe!$A$15:$O$74,15,FALSE)","v":{"v":0,"d":"0.0"}},{"$f":"SUM(L26:Q26)","v":{"v":0,"d":"0.0"}},{"$f":"IF(V26>0,W26/V26,0)","v":{"v":0,"d":"0.0"}},{"$f":"VLOOKUP(A26,Formelhilfe!$A$15:$P$74,16,FALSE)","v":{"v":0,"d":"0.0"}},{"$f":"SUM(C26:H26,L26:Q26)","v":{"v":0,"d":"0.0"}}]
["Schütze 10",{"$f":"VLOOKUP(A27,'Wettkampf 1'!$B$16:$C$75,2,FALSE)","v":"Sögel"},{"$f":"VLOOKUP(A27,'Wettkampf 1'!$B$16:$D$75,3,FALSE)","v":{"v":0,"d":"0.0"}},{"$f":"VLOOKUP($A27,Börgermoor!$B$16:$D$75,3,FALSE)","v":{"v":0,"d":"0.0"}},{"$f":"VLOOKUP($A27,'3'!$B$10:$D$75,3,FALSE)","v":{"v":0,"d":"0.0"}},{"$f":"VLOOKUP($A27,'4'!$B$10:$D$75,3,FALSE)","v":{"v":0,"d":"0.0"}},{"$f":"VLOOKUP($A27,'5'!$B$10:$D$75,3,FALSE)","v":{"v":0,"d":"0.0"}},{"$f":"VLOOKUP($A27,'6'!$B$10:$D$75,3,FALSE)","v":{"v":0,"d":"0.0"}},{"$f":"IF(J27 > 0,K27/J27,0)","v":{"v":0,"d":"0.0"}},{"$f":"VLOOKUP(A27,Formelhilfe!$A$15:$H$74,8,FALSE)","v":{"v":0,"d":"0.0"}},{"$f":"SUM(C27:H27)","v":{"v":0,"d":"0.0"}},{"$f":"VLOOKUP($A27,'7'!$B$10:$D$75,3,FALSE)","v":{"v":0,"d":"0.0"}},{"$f":"VLOOKUP($A27,'8'!$B$10:$D$75,3,FALSE)","v":{"v":0,"d":"0.0"}},{"$f":"VLOOKUP($A27,'9'!$B$10:$D$75,3,FALSE)","v":{"v":0,"d":"0.0"}},{"$f":"VLOOKUP($A27,'10'!$B$10:$D$75,3,FALSE)","v":{"v":0,"d":"0.0"}},{"$f":"VLOOKUP($A27,'11'!$B$10:$D$75,3,FALSE)","v":{"v":0,"d":"0.0"}},{"$f":"VLOOKUP($A27,'12'!$B$10:$D$75,3,FALSE)","v":{"v":0,"d":"0.0"}},{"$f":"IF(S27 >0,T27/S27,0)","v":{"v":0,"d":"0.0"}},{"$f":"VLOOKUP(A27,Formelhilfe!$A$15:$O$74,15,FALSE)","v":{"v":0,"d":"0.0"}},{"$f":"SUM(L27:Q27)","v":{"v":0,"d":"0.0"}},{"$f":"IF(V27>0,W27/V27,0)","v":{"v":0,"d":"0.0"}},{"$f":"VLOOKUP(A27,Formelhilfe!$A$15:$P$74,16,FALSE)","v":{"v":0,"d":"0.0"}},{"$f":"SUM(C27:H27,L27:Q27)","v":{"v":0,"d":"0.0"}}]
["Schütze 14",{"$f":"VLOOKUP(A28,'Wettkampf 1'!$B$16:$C$75,2,FALSE)","v":"Spahnharenstätte"},{"$f":"VLOOKUP(A28,'Wettkampf 1'!$B$16:$D$75,3,FALSE)","v":{"v":0,"d":"0.0"}},{"$f":"VLOOKUP($A28,Börgermoor!$B$16:$D$75,3,FALSE)","v":{"v":0,"d":"0.0"}},{"$f":"VLOOKUP($A28,'3'!$B$10:$D$75,3,FALSE)","v":{"v":0,"d":"0.0"}},{"$f":"VLOOKUP($A28,'4'!$B$10:$D$75,3,FALSE)","v":{"v":0,"d":"0.0"}},{"$f":"VLOOKUP($A28,'5'!$B$10:$D$75,3,FALSE)","v":{"v":0,"d":"0.0"}},{"$f":"VLOOKUP($A28,'6'!$B$10:$D$75,3,FALSE)","v":{"v":0,"d":"0.0"}},{"$f":"IF(J28 > 0,K28/J28,0)","v":{"v":0,"d":"0.0"}},{"$f":"VLOOKUP(A28,Formelhilfe!$A$15:$H$74,8,FALSE)","v":{"v":0,"d":"0.0"}},{"$f":"SUM(C28:H28)","v":{"v":0,"d":"0.0"}},{"$f":"VLOOKUP($A28,'7'!$B$10:$D$75,3,FALSE)","v":{"v":0,"d":"0.0"}},{"$f":"VLOOKUP($A28,'8'!$B$10:$D$75,3,FALSE)","v":{"v":0,"d":"0.0"}},{"$f":"VLOOKUP($A28,'9'!$B$10:$D$75,3,FALSE)","v":{"v":0,"d":"0.0"}},{"$f":"VLOOKUP($A28,'10'!$B$10:$D$75,3,FALSE)","v":{"v":0,"d":"0.0"}},{"$f":"VLOOKUP($A28,'11'!$B$10:$D$75,3,FALSE)","v":{"v":0,"d":"0.0"}},{"$f":"VLOOKUP($A28,'12'!$B$10:$D$75,3,FALSE)","v":{"v":0,"d":"0.0"}},{"$f":"IF(S28 >0,T28/S28,0)","v":{"v":0,"d":"0.0"}},{"$f":"VLOOKUP(A28,Formelhilfe!$A$15:$O$74,15,FALSE)","v":{"v":0,"d":"0.0"}},{"$f":"SUM(L28:Q28)","v":{"v":0,"d":"0.0"}},{"$f":"IF(V28>0,W28/V28,0)","v":{"v":0,"d":"0.0"}},{"$f":"VLOOKUP(A28,Formelhilfe!$A$15:$P$74,16,FALSE)","v":{"v":0,"d":"0.0"}},{"$f":"SUM(C28:H28,L28:Q28)","v":{"v":0,"d":"0.0"}}]
["Schütze 15",{"$f":"VLOOKUP(A29,'Wettkampf 1'!$B$16:$C$75,2,FALSE)","v":"Spahnharenstätte"},{"$f":"VLOOKUP(A29,'Wettkampf 1'!$B$16:$D$75,3,FALSE)","v":{"v":0,"d":"0.0"}},{"$f":"VLOOKUP($A29,Börgermoor!$B$16:$D$75,3,FALSE)","v":{"v":0,"d":"0.0"}},{"$f":"VLOOKUP($A29,'3'!$B$10:$D$75,3,FALSE)","v":{"v":0,"d":"0.0"}},{"$f":"VLOOKUP($A29,'4'!$B$10:$D$75,3,FALSE)","v":{"v":0,"d":"0.0"}},{"$f":"VLOOKUP($A29,'5'!$B$10:$D$75,3,FALSE)","v":{"v":0,"d":"0.0"}},{"$f":"VLOOKUP($A29,'6'!$B$10:$D$75,3,FALSE)","v":{"v":0,"d":"0.0"}},{"$f":"IF(J29 > 0,K29/J29,0)","v":{"v":0,"d":"0.0"}},{"$f":"VLOOKUP(A29,Formelhilfe!$A$15:$H$74,8,FALSE)","v":{"v":0,"d":"0.0"}},{"$f":"SUM(C29:H29)","v":{"v":0,"d":"0.0"}},{"$f":"VLOOKUP($A29,'7'!$B$10:$D$75,3,FALSE)","v":{"v":0,"d":"0.0"}},{"$f":"VLOOKUP($A29,'8'!$B$10:$D$75,3,FALSE)","v":{"v":0,"d":"0.0"}},{"$f":"VLOOKUP($A29,'9'!$B$10:$D$75,3,FALSE)","v":{"v":0,"d":"0.0"}},{"$f":"VLOOKUP($A29,'10'!$B$10:$D$75,3,FALSE)","v":{"v":0,"d":"0.0"}},{"$f":"VLOOKUP($A29,'11'!$B$10:$D$75,3,FALSE)","v":{"v":0,"d":"0.0"}},{"$f":"VLOOKUP($A29,'12'!$B$10:$D$75,3,FALSE)","v":{"v":0,"d":"0.0"}},{"$f":"IF(S29 >0,T29/S29,0)","v":{"v":0,"d":"0.0"}},{"$f":"VLOOKUP(A29,Formelhilfe!$A$15:$O$74,15,FALSE)","v":{"v":0,"d":"0.0"}},{"$f":"SUM(L29:Q29)","v":{"v":0,"d":"0.0"}},{"$f":"IF(V29>0,W29/V29,0)","v":{"v":0,"d":"0.0"}},{"$f":"VLOOKUP(A29,Formelhilfe!$A$15:$P$74,16,FALSE)","v":{"v":0,"d":"0.0"}},{"$f":"SUM(C29:H29,L29:Q29)","v":{"v":0,"d":"0.0"}}]
["Schütze 20",{"$f":"VLOOKUP(A30,'Wettkampf 1'!$B$16:$C$75,2,FALSE)","v":"Esterwegen"},{"$f":"VLOOKUP(A30,'Wettkampf 1'!$B$16:$D$75,3,FALSE)","v":{"v":0,"d":"0.0"}},{"$f":"VLOOKUP($A30,Börgermoor!$B$16:$D$75,3,FALSE)","v":{"v":0,"d":"0.0"}},{"$f":"VLOOKUP($A30,'3'!$B$10:$D$75,3,FALSE)","v":{"v":0,"d":"0.0"}},{"$f":"VLOOKUP($A30,'4'!$B$10:$D$75,3,FALSE)","v":{"v":0,"d":"0.0"}},{"$f":"VLOOKUP($A30,'5'!$B$10:$D$75,3,FALSE)","v":{"v":0,"d":"0.0"}},{"$f":"VLOOKUP($A30,'6'!$B$10:$D$75,3,FALSE)","v":{"v":0,"d":"0.0"}},{"$f":"IF(J30 > 0,K30/J30,0)","v":{"v":0,"d":"0.0"}},{"$f":"VLOOKUP(A30,Formelhilfe!$A$15:$H$74,8,FALSE)","v":{"v":0,"d":"0.0"}},{"$f":"SUM(C30:H30)","v":{"v":0,"d":"0.0"}},{"$f":"VLOOKUP($A30,'7'!$B$10:$D$75,3,FALSE)","v":{"v":0,"d":"0.0"}},{"$f":"VLOOKUP($A30,'8'!$B$10:$D$75,3,FALSE)","v":{"v":0,"d":"0.0"}},{"$f":"VLOOKUP($A30,'9'!$B$10:$D$75,3,FALSE)","v":{"v":0,"d":"0.0"}},{"$f":"VLOOKUP($A30,'10'!$B$10:$D$75,3,FALSE)","v":{"v":0,"d":"0.0"}},{"$f":"VLOOKUP($A30,'11'!$B$10:$D$75,3,FALSE)","v":{"v":0,"d":"0.0"}},{"$f":"VLOOKUP($A30,'12'!$B$10:$D$75,3,FALSE)","v":{"v":0,"d":"0.0"}},{"$f":"IF(S30 >0,T30/S30,0)","v":{"v":0,"d":"0.0"}},{"$f":"VLOOKUP(A30,Formelhilfe!$A$15:$O$74,15,FALSE)","v":{"v":0,"d":"0.0"}},{"$f":"SUM(L30:Q30)","v":{"v":0,"d":"0.0"}},{"$f":"IF(V30>0,W30/V30,0)","v":{"v":0,"d":"0.0"}},{"$f":"VLOOKUP(A30,Formelhilfe!$A$15:$P$74,16,FALSE)","v":{"v":0,"d":"0.0"}},{"$f":"SUM(C30:H30,L30:Q30)","v":{"v":0,"d":"0.0"}}]
["Schütze 29",{"$f":"VLOOKUP(A31,'Wettkampf 1'!$B$16:$C$75,2,FALSE)","v":"Börgermoor"},{"$f":"VLOOKUP(A31,'Wettkampf 1'!$B$16:$D$75,3,FALSE)","v":{"v":0,"d":"0.0"}},{"$f":"VLOOKUP($A31,Börgermoor!$B$16:$D$75,3,FALSE)","v":{"v":0,"d":"0.0"}},{"$f":"VLOOKUP($A31,'3'!$B$10:$D$75,3,FALSE)","v":{"v":0,"d":"0.0"}},{"$f":"VLOOKUP($A31,'4'!$B$10:$D$75,3,FALSE)","v":{"v":0,"d":"0.0"}},{"$f":"VLOOKUP($A31,'5'!$B$10:$D$75,3,FALSE)","v":{"v":0,"d":"0.0"}},{"$f":"VLOOKUP($A31,'6'!$B$10:$D$75,3,FALSE)","v":{"v":0,"d":"0.0"}},{"$f":"IF(J31 > 0,K31/J31,0)","v":{"v":0,"d":"0.0"}},{"$f":"VLOOKUP(A31,Formelhilfe!$A$15:$H$74,8,FALSE)","v":{"v":0,"d":"0.0"}},{"$f":"SUM(C31:H31)","v":{"v":0,"d":"0.0"}},{"$f":"VLOOKUP($A31,'7'!$B$10:$D$75,3,FALSE)","v":{"v":0,"d":"0.0"}},{"$f":"VLOOKUP($A31,'8'!$B$10:$D$75,3,FALSE)","v":{"v":0,"d":"0.0"}},{"$f":"VLOOKUP($A31,'9'!$B$10:$D$75,3,FALSE)","v":{"v":0,"d":"0.0"}},{"$f":"VLOOKUP($A31,'10'!$B$10:$D$75,3,FALSE)","v":{"v":0,"d":"0.0"}},{"$f":"VLOOKUP($A31,'11'!$B$10:$D$75,3,FALSE)","v":{"v":0,"d":"0.0"}},{"$f":"VLOOKUP($A31,'12'!$B$10:$D$75,3,FALSE)","v":{"v":0,"d":"0.0"}},{"$f":"IF(S31 >0,T31/S31,0)","v":{"v":0,"d":"0.0"}},{"$f":"VLOOKUP(A31,Formelhilfe!$A$15:$O$74,15,FALSE)","v":{"v":0,"d":"0.0"}},{"$f":"SUM(L31:Q31)","v":{"v":0,"d":"0.0"}},{"$f":"IF(V31>0,W31/V31,0)","v":{"v":0,"d":"0.0"}},{"$f":"VLOOKUP(A31,Formelhilfe!$A$15:$P$74,16,FALSE)","v":{"v":0,"d":"0.0"}},{"$f":"SUM(C31:H31,L31:Q31)","v":{"v":0,"d":"0.0"}}]
["Schütze 30",{"$f":"VLOOKUP(A32,'Wettkampf 1'!$B$16:$C$75,2,FALSE)","v":"Börgermoor"},{"$f":"VLOOKUP(A32,'Wettkampf 1'!$B$16:$D$75,3,FALSE)","v":{"v":0,"d":"0.0"}},{"$f":"VLOOKUP($A32,Börgermoor!$B$16:$D$75,3,FALSE)","v":{"v":0,"d":"0.0"}},{"$f":"VLOOKUP($A32,'3'!$B$10:$D$75,3,FALSE)","v":{"v":0,"d":"0.0"}},{"$f":"VLOOKUP($A32,'4'!$B$10:$D$75,3,FALSE)","v":{"v":0,"d":"0.0"}},{"$f":"VLOOKUP($A32,'5'!$B$10:$D$75,3,FALSE)","v":{"v":0,"d":"0.0"}},{"$f":"VLOOKUP($A32,'6'!$B$10:$D$75,3,FALSE)","v":{"v":0,"d":"0.0"}},{"$f":"IF(J32 > 0,K32/J32,0)","v":{"v":0,"d":"0.0"}},{"$f":"VLOOKUP(A32,Formelhilfe!$A$15:$H$74,8,FALSE)","v":{"v":0,"d":"0.0"}},{"$f":"SUM(C32:H32)","v":{"v":0,"d":"0.0"}},{"$f":"VLOOKUP($A32,'7'!$B$10:$D$75,3,FALSE)","v":{"v":0,"d":"0.0"}},{"$f":"VLOOKUP($A32,'8'!$B$10:$D$75,3,FALSE)","v":{"v":0,"d":"0.0"}},{"$f":"VLOOKUP($A32,'9'!$B$10:$D$75,3,FALSE)","v":{"v":0,"d":"0.0"}},{"$f":"VLOOKUP($A32,'10'!$B$10:$D$75,3,FALSE)","v":{"v":0,"d":"0.0"}},{"$f":"VLOOKUP($A32,'11'!$B$10:$D$75,3,FALSE)","v":{"v":0,"d":"0.0"}},{"$f":"VLOOKUP($A32,'12'!$B$10:$D$75,3,FALSE)","v":{"v":0,"d":"0.0"}},{"$f":"IF(S32 >0,T32/S32,0)","v":{"v":0,"d":"0.0"}},{"$f":"VLOOKUP(A32,Formelhilfe!$A$15:$O$74,15,FALSE)","v":{"v":0,"d":"0.0"}},{"$f":"SUM(L32:Q32)","v":{"v":0,"d":"0.0"}},{"$f":"IF(V32>0,W32/V32,0)","v":{"v":0,"d":"0.0"}},{"$f":"VLOOKUP(A32,Formelhilfe!$A$15:$P$74,16,FALSE)","v":{"v":0,"d":"0.0"}},{"$f":"SUM(C32:H32,L32:Q32)","v":{"v":0,"d":"0.0"}}]
["Stümpler Jan Luka ",{"$f":"VLOOKUP(A33,'Wettkampf 1'!$B$16:$C$75,2,FALSE)","v":"Lähden"},{"$f":"VLOOKUP(A33,'Wettkampf 1'!$B$16:$D$75,3,FALSE)","v":{"v":0,"d":"0.0"}},{"$f":"VLOOKUP($A33,Börgermoor!$B$16:$D$75,3,FALSE)","v":{"v":0,"d":"0.0"}},{"$f":"VLOOKUP($A33,'3'!$B$10:$D$75,3,FALSE)","v":{"v":0,"d":"0.0"}},{"$f":"VLOOKUP($A33,'4'!$B$10:$D$75,3,FALSE)","v":{"v":0,"d":"0.0"}},{"$f":"VLOOKUP($A33,'5'!$B$10:$D$75,3,FALSE)","v":{"v":0,"d":"0.0"}},{"$f":"VLOOKUP($A33,'6'!$B$10:$D$75,3,FALSE)","v":{"v":0,"d":"0.0"}},{"$f":"IF(J33 > 0,K33/J33,0)","v":{"v":0,"d":"0.0"}},{"$f":"VLOOKUP(A33,Formelhilfe!$A$15:$H$74,8,FALSE)","v":{"v":0,"d":"0.0"}},{"$f":"SUM(C33:H33)","v":{"v":0,"d":"0.0"}},{"$f":"VLOOKUP($A33,'7'!$B$10:$D$75,3,FALSE)","v":{"v":0,"d":"0.0"}},{"$f":"VLOOKUP($A33,'8'!$B$10:$D$75,3,FALSE)","v":{"v":0,"d":"0.0"}},{"$f":"VLOOKUP($A33,'9'!$B$10:$D$75,3,FALSE)","v":{"v":0,"d":"0.0"}},{"$f":"VLOOKUP($A33,'10'!$B$10:$D$75,3,FALSE)","v":{"v":0,"d":"0.0"}},{"$f":"VLOOKUP($A33,'11'!$B$10:$D$75,3,FALSE)","v":{"v":0,"d":"0.0"}},{"$f":"VLOOKUP($A33,'12'!$B$10:$D$75,3,FALSE)","v":{"v":0,"d":"0.0"}},{"$f":"IF(S33 >0,T33/S33,0)","v":{"v":0,"d":"0.0"}},{"$f":"VLOOKUP(A33,Formelhilfe!$A$15:$O$74,15,FALSE)","v":{"v":0,"d":"0.0"}},{"$f":"SUM(L33:Q33)","v":{"v":0,"d":"0.0"}},{"$f":"IF(V33>0,W33/V33,0)","v":{"v":0,"d":"0.0"}},{"$f":"VLOOKUP(A33,Formelhilfe!$A$15:$P$74,16,FALSE)","v":{"v":0,"d":"0.0"}},{"$f":"SUM(C33:H33,L33:Q33)","v":{"v":0,"d":"0.0"}}]
["Schütze 33",{"$f":"VLOOKUP(A34,'Wettkampf 1'!$B$16:$C$75,2,FALSE)","v":"Verein VII"},{"$f":"VLOOKUP(A34,'Wettkampf 1'!$B$16:$D$75,3,FALSE)","v":{"v":0,"d":"0.0"}},{"$f":"VLOOKUP($A34,Börgermoor!$B$16:$D$75,3,FALSE)","v":{"v":0,"d":"0.0"}},{"$f":"VLOOKUP($A34,'3'!$B$10:$D$75,3,FALSE)","v":{"v":0,"d":"0.0"}},{"$f":"VLOOKUP($A34,'4'!$B$10:$D$75,3,FALSE)","v":{"v":0,"d":"0.0"}},{"$f":"VLOOKUP($A34,'5'!$B$10:$D$75,3,FALSE)","v":{"v":0,"d":"0.0"}},{"$f":"VLOOKUP($A34,'6'!$B$10:$D$75,3,FALSE)","v":{"v":0,"d":"0.0"}},{"$f":"IF(J34 > 0,K34/J34,0)","v":{"v":0,"d":"0.0"}},{"$f":"VLOOKUP(A34,Formelhilfe!$A$15:$H$74,8,FALSE)","v":{"v":0,"d":"0.0"}},{"$f":"SUM(C34:H34)","v":{"v":0,"d":"0.0"}},{"$f":"VLOOKUP($A34,'7'!$B$10:$D$75,3,FALSE)","v":{"v":0,"d":"0.0"}},{"$f":"VLOOKUP($A34,'8'!$B$10:$D$75,3,FALSE)","v":{"v":0,"d":"0.0"}},{"$f":"VLOOKUP($A34,'9'!$B$10:$D$75,3,FALSE)","v":{"v":0,"d":"0.0"}},{"$f":"VLOOKUP($A34,'10'!$B$10:$D$75,3,FALSE)","v":{"v":0,"d":"0.0"}},{"$f":"VLOOKUP($A34,'11'!$B$10:$D$75,3,FALSE)","v":{"v":0,"d":"0.0"}},{"$f":"VLOOKUP($A34,'12'!$B$10:$D$75,3,FALSE)","v":{"v":0,"d":"0.0"}},{"$f":"IF(S34 >0,T34/S34,0)","v":{"v":0,"d":"0.0"}},{"$f":"VLOOKUP(A34,Formelhilfe!$A$15:$O$74,15,FALSE)","v":{"v":0,"d":"0.0"}},{"$f":"SUM(L34:Q34)","v":{"v":0,"d":"0.0"}},{"$f":"IF(V34>0,W34/V34,0)","v":{"v":0,"d":"0.0"}},{"$f":"VLOOKUP(A34,Formelhilfe!$A$15:$P$74,16,FALSE)","v":{"v":0,"d":"0.0"}},{"$f":"SUM(C34:H34,L34:Q34)","v":{"v":0,"d":"0.0"}}]
["Schütze 34",{"$f":"VLOOKUP(A35,'Wettkampf 1'!$B$16:$C$75,2,FALSE)","v":"Verein VII"},{"$f":"VLOOKUP(A35,'Wettkampf 1'!$B$16:$D$75,3,FALSE)","v":{"v":0,"d":"0.0"}},{"$f":"VLOOKUP($A35,Börgermoor!$B$16:$D$75,3,FALSE)","v":{"v":0,"d":"0.0"}},{"$f":"VLOOKUP($A35,'3'!$B$10:$D$75,3,FALSE)","v":{"v":0,"d":"0.0"}},{"$f":"VLOOKUP($A35,'4'!$B$10:$D$75,3,FALSE)","v":{"v":0,"d":"0.0"}},{"$f":"VLOOKUP($A35,'5'!$B$10:$D$75,3,FALSE)","v":{"v":0,"d":"0.0"}},{"$f":"VLOOKUP($A35,'6'!$B$10:$D$75,3,FALSE)","v":{"v":0,"d":"0.0"}},{"$f":"IF(J35 > 0,K35/J35,0)","v":{"v":0,"d":"0.0"}},{"$f":"VLOOKUP(A35,Formelhilfe!$A$15:$H$74,8,FALSE)","v":{"v":0,"d":"0.0"}},{"$f":"SUM(C35:H35)","v":{"v":0,"d":"0.0"}},{"$f":"VLOOKUP($A35,'7'!$B$10:$D$75,3,FALSE)","v":{"v":0,"d":"0.0"}},{"$f":"VLOOKUP($A35,'8'!$B$10:$D$75,3,FALSE)","v":{"v":0,"d":"0.0"}},{"$f":"VLOOKUP($A35,'9'!$B$10:$D$75,3,FALSE)","v":{"v":0,"d":"0.0"}},{"$f":"VLOOKUP($A35,'10'!$B$10:$D$75,3,FALSE)","v":{"v":0,"d":"0.0"}},{"$f":"VLOOKUP($A35,'11'!$B$10:$D$75,3,FALSE)","v":{"v":0,"d":"0.0"}},{"$f":"VLOOKUP($A35,'12'!$B$10:$D$75,3,FALSE)","v":{"v":0,"d":"0.0"}},{"$f":"IF(S35 >0,T35/S35,0)","v":{"v":0,"d":"0.0"}},{"$f":"VLOOKUP(A35,Formelhilfe!$A$15:$O$74,15,FALSE)","v":{"v":0,"d":"0.0"}},{"$f":"SUM(L35:Q35)","v":{"v":0,"d":"0.0"}},{"$f":"IF(V35>0,W35/V35,0)","v":{"v":0,"d":"0.0"}},{"$f":"VLOOKUP(A35,Formelhilfe!$A$15:$P$74,16,FALSE)","v":{"v":0,"d":"0.0"}},{"$f":"SUM(C35:H35,L35:Q35)","v":{"v":0,"d":"0.0"}}]
["Schütze 35",{"$f":"VLOOKUP(A36,'Wettkampf 1'!$B$16:$C$75,2,FALSE)","v":"Verein VII"},{"$f":"VLOOKUP(A36,'Wettkampf 1'!$B$16:$D$75,3,FALSE)","v":{"v":0,"d":"0.0"}},{"$f":"VLOOKUP($A36,Börgermoor!$B$16:$D$75,3,FALSE)","v":{"v":0,"d":"0.0"}},{"$f":"VLOOKUP($A36,'3'!$B$10:$D$75,3,FALSE)","v":{"v":0,"d":"0.0"}},{"$f":"VLOOKUP($A36,'4'!$B$10:$D$75,3,FALSE)","v":{"v":0,"d":"0.0"}},{"$f":"VLOOKUP($A36,'5'!$B$10:$D$75,3,FALSE)","v":{"v":0,"d":"0.0"}},{"$f":"VLOOKUP($A36,'6'!$B$10:$D$75,3,FALSE)","v":{"v":0,"d":"0.0"}},{"$f":"IF(J36 > 0,K36/J36,0)","v":{"v":0,"d":"0.0"}},{"$f":"VLOOKUP(A36,Formelhilfe!$A$15:$H$74,8,FALSE)","v":{"v":0,"d":"0.0"}},{"$f":"SUM(C36:H36)","v":{"v":0,"d":"0.0"}},{"$f":"VLOOKUP($A36,'7'!$B$10:$D$75,3,FALSE)","v":{"v":0,"d":"0.0"}},{"$f":"VLOOKUP($A36,'8'!$B$10:$D$75,3,FALSE)","v":{"v":0,"d":"0.0"}},{"$f":"VLOOKUP($A36,'9'!$B$10:$D$75,3,FALSE)","v":{"v":0,"d":"0.0"}},{"$f":"VLOOKUP($A36,'10'!$B$10:$D$75,3,FALSE)","v":{"v":0,"d":"0.0"}},{"$f":"VLOOKUP($A36,'11'!$B$10:$D$75,3,FALSE)","v":{"v":0,"d":"0.0"}},{"$f":"VLOOKUP($A36,'12'!$B$10:$D$75,3,FALSE)","v":{"v":0,"d":"0.0"}},{"$f":"IF(S36 >0,T36/S36,0)","v":{"v":0,"d":"0.0"}},{"$f":"VLOOKUP(A36,Formelhilfe!$A$15:$O$74,15,FALSE)","v":{"v":0,"d":"0.0"}},{"$f":"SUM(L36:Q36)","v":{"v":0,"d":"0.0"}},{"$f":"IF(V36>0,W36/V36,0)","v":{"v":0,"d":"0.0"}},{"$f":"VLOOKUP(A36,Formelhilfe!$A$15:$P$74,16,FALSE)","v":{"v":0,"d":"0.0"}},{"$f":"SUM(C36:H36,L36:Q36)","v":{"v":0,"d":"0.0"}}]
["Schütze 36",{"$f":"VLOOKUP(A37,'Wettkampf 1'!$B$16:$C$75,2,FALSE)","v":"Verein VII"},{"$f":"VLOOKUP(A37,'Wettkampf 1'!$B$16:$D$75,3,FALSE)","v":{"v":0,"d":"0.0"}},{"$f":"VLOOKUP($A37,Börgermoor!$B$16:$D$75,3,FALSE)","v":{"v":0,"d":"0.0"}},{"$f":"VLOOKUP($A37,'3'!$B$10:$D$75,3,FALSE)","v":{"v":0,"d":"0.0"}},{"$f":"VLOOKUP($A37,'4'!$B$10:$D$75,3,FALSE)","v":{"v":0,"d":"0.0"}},{"$f":"VLOOKUP($A37,'5'!$B$10:$D$75,3,FALSE)","v":{"v":0,"d":"0.0"}},{"$f":"VLOOKUP($A37,'6'!$B$10:$D$75,3,FALSE)","v":{"v":0,"d":"0.0"}},{"$f":"IF(J37 > 0,K37/J37,0)","v":{"v":0,"d":"0.0"}},{"$f":"VLOOKUP(A37,Formelhilfe!$A$15:$H$74,8,FALSE)","v":{"v":0,"d":"0.0"}},{"$f":"SUM(C37:H37)","v":{"v":0,"d":"0.0"}},{"$f":"VLOOKUP($A37,'7'!$B$10:$D$75,3,FALSE)","v":{"v":0,"d":"0.0"}},{"$f":"VLOOKUP($A37,'8'!$B$10:$D$75,3,FALSE)","v":{"v":0,"d":"0.0"}},{"$f":"VLOOKUP($A37,'9'!$B$10:$D$75,3,FALSE)","v":{"v":0,"d":"0.0"}},{"$f":"VLOOKUP($A37,'10'!$B$10:$D$75,3,FALSE)","v":{"v":0,"d":"0.0"}},{"$f":"VLOOKUP($A37,'11'!$B$10:$D$75,3,FALSE)","v":{"v":0,"d":"0.0"}},{"$f":"VLOOKUP($A37,'12'!$B$10:$D$75,3,FALSE)","v":{"v":0,"d":"0.0"}},{"$f":"IF(S37 >0,T37/S37,0)","v":{"v":0,"d":"0.0"}},{"$f":"VLOOKUP(A37,Formelhilfe!$A$15:$O$74,15,FALSE)","v":{"v":0,"d":"0.0"}},{"$f":"SUM(L37:Q37)","v":{"v":0,"d":"0.0"}},{"$f":"IF(V37>0,W37/V37,0)","v":{"v":0,"d":"0.0"}},{"$f":"VLOOKUP(A37,Formelhilfe!$A$15:$P$74,16,FALSE)","v":{"v":0,"d":"0.0"}},{"$f":"SUM(C37:H37,L37:Q37)","v":{"v":0,"d":"0.0"}}]
["Schütze 37",{"$f":"VLOOKUP(A38,'Wettkampf 1'!$B$16:$C$75,2,FALSE)","v":"Verein VII"},{"$f":"VLOOKUP(A38,'Wettkampf 1'!$B$16:$D$75,3,FALSE)","v":{"v":0,"d":"0.0"}},{"$f":"VLOOKUP($A38,Börgermoor!$B$16:$D$75,3,FALSE)","v":{"v":0,"d":"0.0"}},{"$f":"VLOOKUP($A38,'3'!$B$10:$D$75,3,FALSE)","v":{"v":0,"d":"0.0"}},{"$f":"VLOOKUP($A38,'4'!$B$10:$D$75,3,FALSE)","v":{"v":0,"d":"0.0"}},{"$f":"VLOOKUP($A38,'5'!$B$10:$D$75,3,FALSE)","v":{"v":0,"d":"0.0"}},{"$f":"VLOOKUP($A38,'6'!$B$10:$D$75,3,FALSE)","v":{"v":0,"d":"0.0"}},{"$f":"IF(J38 > 0,K38/J38,0)","v":{"v":0,"d":"0.0"}},{"$f":"VLOOKUP(A38,Formelhilfe!$A$15:$H$74,8,FALSE)","v":{"v":0,"d":"0.0"}},{"$f":"SUM(C38:H38)","v":{"v":0,"d":"0.0"}},{"$f":"VLOOKUP($A38,'7'!$B$10:$D$75,3,FALSE)","v":{"v":0,"d":"0.0"}},{"$f":"VLOOKUP($A38,'8'!$B$10:$D$75,3,FALSE)","v":{"v":0,"d":"0.0"}},{"$f":"VLOOKUP($A38,'9'!$B$10:$D$75,3,FALSE)","v":{"v":0,"d":"0.0"}},{"$f":"VLOOKUP($A38,'10'!$B$10:$D$75,3,FALSE)","v":{"v":0,"d":"0.0"}},{"$f":"VLOOKUP($A38,'11'!$B$10:$D$75,3,FALSE)","v":{"v":0,"d":"0.0"}},{"$f":"VLOOKUP($A38,'12'!$B$10:$D$75,3,FALSE)","v":{"v":0,"d":"0.0"}},{"$f":"IF(S38 >0,T38/S38,0)","v":{"v":0,"d":"0.0"}},{"$f":"VLOOKUP(A38,Formelhilfe!$A$15:$O$74,15,FALSE)","v":{"v":0,"d":"0.0"}},{"$f":"SUM(L38:Q38)","v":{"v":0,"d":"0.0"}},{"$f":"IF(V38>0,W38/V38,0)","v":{"v":0,"d":"0.0"}},{"$f":"VLOOKUP(A38,Formelhilfe!$A$15:$P$74,16,FALSE)","v":{"v":0,"d":"0.0"}},{"$f":"SUM(C38:H38,L38:Q38)","v":{"v":0,"d":"0.0"}}]
["Schütze 38",{"$f":"VLOOKUP(A39,'Wettkampf 1'!$B$16:$C$75,2,FALSE)","v":"Verein VIII"},{"$f":"VLOOKUP(A39,'Wettkampf 1'!$B$16:$D$75,3,FALSE)","v":{"v":0,"d":"0.0"}},{"$f":"VLOOKUP($A39,Börgermoor!$B$16:$D$75,3,FALSE)","v":{"v":0,"d":"0.0"}},{"$f":"VLOOKUP($A39,'3'!$B$10:$D$75,3,FALSE)","v":{"v":0,"d":"0.0"}},{"$f":"VLOOKUP($A39,'4'!$B$10:$D$75,3,FALSE)","v":{"v":0,"d":"0.0"}},{"$f":"VLOOKUP($A39,'5'!$B$10:$D$75,3,FALSE)","v":{"v":0,"d":"0.0"}},{"$f":"VLOOKUP($A39,'6'!$B$10:$D$75,3,FALSE)","v":{"v":0,"d":"0.0"}},{"$f":"IF(J39 > 0,K39/J39,0)","v":{"v":0,"d":"0.0"}},{"$f":"VLOOKUP(A39,Formelhilfe!$A$15:$H$74,8,FALSE)","v":{"v":0,"d":"0.0"}},{"$f":"SUM(C39:H39)","v":{"v":0,"d":"0.0"}},{"$f":"VLOOKUP($A39,'7'!$B$10:$D$75,3,FALSE)","v":{"v":0,"d":"0.0"}},{"$f":"VLOOKUP($A39,'8'!$B$10:$D$75,3,FALSE)","v":{"v":0,"d":"0.0"}},{"$f":"VLOOKUP($A39,'9'!$B$10:$D$75,3,FALSE)","v":{"v":0,"d":"0.0"}},{"$f":"VLOOKUP($A39,'10'!$B$10:$D$75,3,FALSE)","v":{"v":0,"d":"0.0"}},{"$f":"VLOOKUP($A39,'11'!$B$10:$D$75,3,FALSE)","v":{"v":0,"d":"0.0"}},{"$f":"VLOOKUP($A39,'12'!$B$10:$D$75,3,FALSE)","v":{"v":0,"d":"0.0"}},{"$f":"IF(S39 >0,T39/S39,0)","v":{"v":0,"d":"0.0"}},{"$f":"VLOOKUP(A39,Formelhilfe!$A$15:$O$74,15,FALSE)","v":{"v":0,"d":"0.0"}},{"$f":"SUM(L39:Q39)","v":{"v":0,"d":"0.0"}},{"$f":"IF(V39>0,W39/V39,0)","v":{"v":0,"d":"0.0"}},{"$f":"VLOOKUP(A39,Formelhilfe!$A$15:$P$74,16,FALSE)","v":{"v":0,"d":"0.0"}},{"$f":"SUM(C39:H39,L39:Q39)","v":{"v":0,"d":"0.0"}}]
["Schütze 39",{"$f":"VLOOKUP(A40,'Wettkampf 1'!$B$16:$C$75,2,FALSE)","v":"Verein VIII"},{"$f":"VLOOKUP(A40,'Wettkampf 1'!$B$16:$D$75,3,FALSE)","v":{"v":0,"d":"0.0"}},{"$f":"VLOOKUP($A40,Börgermoor!$B$16:$D$75,3,FALSE)","v":{"v":0,"d":"0.0"}},{"$f":"VLOOKUP($A40,'3'!$B$10:$D$75,3,FALSE)","v":{"v":0,"d":"0.0"}},{"$f":"VLOOKUP($A40,'4'!$B$10:$D$75,3,FALSE)","v":{"v":0,"d":"0.0"}},{"$f":"VLOOKUP($A40,'5'!$B$10:$D$75,3,FALSE)","v":{"v":0,"d":"0.0"}},{"$f":"VLOOKUP($A40,'6'!$B$10:$D$75,3,FALSE)","v":{"v":0,"d":"0.0"}},{"$f":"IF(J40 > 0,K40/J40,0)","v":{"v":0,"d":"0.0"}},{"$f":"VLOOKUP(A40,Formelhilfe!$A$15:$H$74,8,FALSE)","v":{"v":0,"d":"0.0"}},{"$f":"SUM(C40:H40)","v":{"v":0,"d":"0.0"}},{"$f":"VLOOKUP($A40,'7'!$B$10:$D$75,3,FALSE)","v":{"v":0,"d":"0.0"}},{"$f":"VLOOKUP($A40,'8'!$B$10:$D$75,3,FALSE)","v":{"v":0,"d":"0.0"}},{"$f":"VLOOKUP($A40,'9'!$B$10:$D$75,3,FALSE)","v":{"v":0,"d":"0.0"}},{"$f":"VLOOKUP($A40,'10'!$B$10:$D$75,3,FALSE)","v":{"v":0,"d":"0.0"}},{"$f":"VLOOKUP($A40,'11'!$B$10:$D$75,3,FALSE)","v":{"v":0,"d":"0.0"}},{"$f":"VLOOKUP($A40,'12'!$B$10:$D$75,3,FALSE)","v":{"v":0,"d":"0.0"}},{"$f":"IF(S40 >0,T40/S40,0)","v":{"v":0,"d":"0.0"}},{"$f":"VLOOKUP(A40,Formelhilfe!$A$15:$O$74,15,FALSE)","v":{"v":0,"d":"0.0"}},{"$f":"SUM(L40:Q40)","v":{"v":0,"d":"0.0"}},{"$f":"IF(V40>0,W40/V40,0)","v":{"v":0,"d":"0.0"}},{"$f":"VLOOKUP(A40,Formelhilfe!$A$15:$P$74,16,FALSE)","v":{"v":0,"d":"0.0"}},{"$f":"SUM(C40:H40,L40:Q40)","v":{"v":0,"d":"0.0"}}]
["Schütze 40",{"$f":"VLOOKUP(A41,'Wettkampf 1'!$B$16:$C$75,2,FALSE)","v":"Verein VIII"},{"$f":"VLOOKUP(A41,'Wettkampf 1'!$B$16:$D$75,3,FALSE)","v":{"v":0,"d":"0.0"}},{"$f":"VLOOKUP($A41,Börgermoor!$B$16:$D$75,3,FALSE)","v":{"v":0,"d":"0.0"}},{"$f":"VLOOKUP($A41,'3'!$B$10:$D$75,3,FALSE)","v":{"v":0,"d":"0.0"}},{"$f":"VLOOKUP($A41,'4'!$B$10:$D$75,3,FALSE)","v":{"v":0,"d":"0.0"}},{"$f":"VLOOKUP($A41,'5'!$B$10:$D$75,3,FALSE)","v":{"v":0,"d":"0.0"}},{"$f":"VLOOKUP($A41,'6'!$B$10:$D$75,3,FALSE)","v":{"v":0,"d":"0.0"}},{"$f":"IF(J41 > 0,K41/J41,0)","v":{"v":0,"d":"0.0"}},{"$f":"VLOOKUP(A41,Formelhilfe!$A$15:$H$74,8,FALSE)","v":{"v":0,"d":"0.0"}},{"$f":"SUM(C41:H41)","v":{"v":0,"d":"0.0"}},{"$f":"VLOOKUP($A41,'7'!$B$10:$D$75,3,FALSE)","v":{"v":0,"d":"0.0"}},{"$f":"VLOOKUP($A41,'8'!$B$10:$D$75,3,FALSE)","v":{"v":0,"d":"0.0"}},{"$f":"VLOOKUP($A41,'9'!$B$10:$D$75,3,FALSE)","v":{"v":0,"d":"0.0"}},{"$f":"VLOOKUP($A41,'10'!$B$10:$D$75,3,FALSE)","v":{"v":0,"d":"0.0"}},{"$f":"VLOOKUP($A41,'11'!$B$10:$D$75,3,FALSE)","v":{"v":0,"d":"0.0"}},{"$f":"VLOOKUP($A41,'12'!$B$10:$D$75,3,FALSE)","v":{"v":0,"d":"0.0"}},{"$f":"IF(S41 >0,T41/S41,0)","v":{"v":0,"d":"0.0"}},{"$f":"VLOOKUP(A41,Formelhilfe!$A$15:$O$74,15,FALSE)","v":{"v":0,"d":"0.0"}},{"$f":"SUM(L41:Q41)","v":{"v":0,"d":"0.0"}},{"$f":"IF(V41>0,W41/V41,0)","v":{"v":0,"d":"0.0"}},{"$f":"VLOOKUP(A41,Formelhilfe!$A$15:$P$74,16,FALSE)","v":{"v":0,"d":"0.0"}},{"$f":"SUM(C41:H41,L41:Q41)","v":{"v":0,"d":"0.0"}}]
["Schütze 41",{"$f":"VLOOKUP(A42,'Wettkampf 1'!$B$16:$C$75,2,FALSE)","v":"Verein IX"},{"$f":"VLOOKUP(A42,'Wettkampf 1'!$B$16:$D$75,3,FALSE)","v":{"v":0,"d":"0.0"}},{"$f":"VLOOKUP($A42,Börgermoor!$B$16:$D$75,3,FALSE)","v":{"v":0,"d":"0.0"}},{"$f":"VLOOKUP($A42,'3'!$B$10:$D$75,3,FALSE)","v":{"v":0,"d":"0.0"}},{"$f":"VLOOKUP($A42,'4'!$B$10:$D$75,3,FALSE)","v":{"v":0,"d":"0.0"}},{"$f":"VLOOKUP($A42,'5'!$B$10:$D$75,3,FALSE)","v":{"v":0,"d":"0.0"}},{"$f":"VLOOKUP($A42,'6'!$B$10:$D$75,3,FALSE)","v":{"v":0,"d":"0.0"}},{"$f":"IF(J42 > 0,K42/J42,0)","v":{"v":0,"d":"0.0"}},{"$f":"VLOOKUP(A42,Formelhilfe!$A$15:$H$74,8,FALSE)","v":{"v":0,"d":"0.0"}},{"$f":"SUM(C42:H42)","v":{"v":0,"d":"0.0"}},{"$f":"VLOOKUP($A42,'7'!$B$10:$D$75,3,FALSE)","v":{"v":0,"d":"0.0"}},{"$f":"VLOOKUP($A42,'8'!$B$10:$D$75,3,FALSE)","v":{"v":0,"d":"0.0"}},{"$f":"VLOOKUP($A42,'9'!$B$10:$D$75,3,FALSE)","v":{"v":0,"d":"0.0"}},{"$f":"VLOOKUP($A42,'10'!$B$10:$D$75,3,FALSE)","v":{"v":0,"d":"0.0"}},{"$f":"VLOOKUP($A42,'11'!$B$10:$D$75,3,FALSE)","v":{"v":0,"d":"0.0"}},{"$f":"VLOOKUP($A42,'12'!$B$10:$D$75,3,FALSE)","v":{"v":0,"d":"0.0"}},{"$f":"IF(S42 >0,T42/S42,0)","v":{"v":0,"d":"0.0"}},{"$f":"VLOOKUP(A42,Formelhilfe!$A$15:$O$74,15,FALSE)","v":{"v":0,"d":"0.0"}},{"$f":"SUM(L42:Q42)","v":{"v":0,"d":"0.0"}},{"$f":"IF(V42>0,W42/V42,0)","v":{"v":0,"d":"0.0"}},{"$f":"VLOOKUP(A42,Formelhilfe!$A$15:$P$74,16,FALSE)","v":{"v":0,"d":"0.0"}},{"$f":"SUM(C42:H42,L42:Q42)","v":{"v":0,"d":"0.0"}}]
["Schütze 42",{"$f":"VLOOKUP(A43,'Wettkampf 1'!$B$16:$C$75,2,FALSE)","v":"Verein IX"},{"$f":"VLOOKUP(A43,'Wettkampf 1'!$B$16:$D$75,3,FALSE)","v":{"v":0,"d":"0.0"}},{"$f":"VLOOKUP($A43,Börgermoor!$B$16:$D$75,3,FALSE)","v":{"v":0,"d":"0.0"}},{"$f":"VLOOKUP($A43,'3'!$B$10:$D$75,3,FALSE)","v":{"v":0,"d":"0.0"}},{"$f":"VLOOKUP($A43,'4'!$B$10:$D$75,3,FALSE)","v":{"v":0,"d":"0.0"}},{"$f":"VLOOKUP($A43,'5'!$B$10:$D$75,3,FALSE)","v":{"v":0,"d":"0.0"}},{"$f":"VLOOKUP($A43,'6'!$B$10:$D$75,3,FALSE)","v":{"v":0,"d":"0.0"}},{"$f":"IF(J43 > 0,K43/J43,0)","v":{"v":0,"d":"0.0"}},{"$f":"VLOOKUP(A43,Formelhilfe!$A$15:$H$74,8,FALSE)","v":{"v":0,"d":"0.0"}},{"$f":"SUM(C43:H43)","v":{"v":0,"d":"0.0"}},{"$f":"VLOOKUP($A43,'7'!$B$10:$D$75,3,FALSE)","v":{"v":0,"d":"0.0"}},{"$f":"VLOOKUP($A43,'8'!$B$10:$D$75,3,FALSE)","v":{"v":0,"d":"0.0"}},{"$f":"VLOOKUP($A43,'9'!$B$10:$D$75,3,FALSE)","v":{"v":0,"d":"0.0"}},{"$f":"VLOOKUP($A43,'10'!$B$10:$D$75,3,FALSE)","v":{"v":0,"d":"0.0"}},{"$f":"VLOOKUP($A43,'11'!$B$10:$D$75,3,FALSE)","v":{"v":0,"d":"0.0"}},{"$f":"VLOOKUP($A43,'12'!$B$10:$D$75,3,FALSE)","v":{"v":0,"d":"0.0"}},{"$f":"IF(S43 >0,T43/S43,0)","v":{"v":0,"d":"0.0"}},{"$f":"VLOOKUP(A43,Formelhilfe!$A$15:$O$74,15,FALSE)","v":{"v":0,"d":"0.0"}},{"$f":"SUM(L43:Q43)","v":{"v":0,"d":"0.0"}},{"$f":"IF(V43>0,W43/V43,0)","v":{"v":0,"d":"0.0"}},{"$f":"VLOOKUP(A43,Formelhilfe!$A$15:$P$74,16,FALSE)","v":{"v":0,"d":"0.0"}},{"$f":"SUM(C43:H43,L43:Q43)","v":{"v":0,"d":"0.0"}}]
["Schütze 43",{"$f":"VLOOKUP(A44,'Wettkampf 1'!$B$16:$C$75,2,FALSE)","v":"Verein IX"},{"$f":"VLOOKUP(A44,'Wettkampf 1'!$B$16:$D$75,3,FALSE)","v":{"v":0,"d":"0.0"}},{"$f":"VLOOKUP($A44,Börgermoor!$B$16:$D$75,3,FALSE)","v":{"v":0,"d":"0.0"}},{"$f":"VLOOKUP($A44,'3'!$B$10:$D$75,3,FALSE)","v":{"v":0,"d":"0.0"}},{"$f":"VLOOKUP($A44,'4'!$B$10:$D$75,3,FALSE)","v":{"v":0,"d":"0.0"}},{"$f":"VLOOKUP($A44,'5'!$B$10:$D$75,3,FALSE)","v":{"v":0,"d":"0.0"}},{"$f":"VLOOKUP($A44,'6'!$B$10:$D$75,3,FALSE)","v":{"v":0,"d":"0.0"}},{"$f":"IF(J44 > 0,K44/J44,0)","v":{"v":0,"d":"0.0"}},{"$f":"VLOOKUP(A44,Formelhilfe!$A$15:$H$74,8,FALSE)","v":{"v":0,"d":"0.0"}},{"$f":"SUM(C44:H44)","v":{"v":0,"d":"0.0"}},{"$f":"VLOOKUP($A44,'7'!$B$10:$D$75,3,FALSE)","v":{"v":0,"d":"0.0"}},{"$f":"VLOOKUP($A44,'8'!$B$10:$D$75,3,FALSE)","v":{"v":0,"d":"0.0"}},{"$f":"VLOOKUP($A44,'9'!$B$10:$D$75,3,FALSE)","v":{"v":0,"d":"0.0"}},{"$f":"VLOOKUP($A44,'10'!$B$10:$D$75,3,FALSE)","v":{"v":0,"d":"0.0"}},{"$f":"VLOOKUP($A44,'11'!$B$10:$D$75,3,FALSE)","v":{"v":0,"d":"0.0"}},{"$f":"VLOOKUP($A44,'12'!$B$10:$D$75,3,FALSE)","v":{"v":0,"d":"0.0"}},{"$f":"IF(S44 >0,T44/S44,0)","v":{"v":0,"d":"0.0"}},{"$f":"VLOOKUP(A44,Formelhilfe!$A$15:$O$74,15,FALSE)","v":{"v":0,"d":"0.0"}},{"$f":"SUM(L44:Q44)","v":{"v":0,"d":"0.0"}},{"$f":"IF(V44>0,W44/V44,0)","v":{"v":0,"d":"0.0"}},{"$f":"VLOOKUP(A44,Formelhilfe!$A$15:$P$74,16,FALSE)","v":{"v":0,"d":"0.0"}},{"$f":"SUM(C44:H44,L44:Q44)","v":{"v":0,"d":"0.0"}}]
["Schütze 44",{"$f":"VLOOKUP(A45,'Wettkampf 1'!$B$16:$C$75,2,FALSE)","v":"Verein IX"},{"$f":"VLOOKUP(A45,'Wettkampf 1'!$B$16:$D$75,3,FALSE)","v":{"v":0,"d":"0.0"}},{"$f":"VLOOKUP($A45,Börgermoor!$B$16:$D$75,3,FALSE)","v":{"v":0,"d":"0.0"}},{"$f":"VLOOKUP($A45,'3'!$B$10:$D$75,3,FALSE)","v":{"v":0,"d":"0.0"}},{"$f":"VLOOKUP($A45,'4'!$B$10:$D$75,3,FALSE)","v":{"v":0,"d":"0.0"}},{"$f":"VLOOKUP($A45,'5'!$B$10:$D$75,3,FALSE)","v":{"v":0,"d":"0.0"}},{"$f":"VLOOKUP($A45,'6'!$B$10:$D$75,3,FALSE)","v":{"v":0,"d":"0.0"}},{"$f":"IF(J45 > 0,K45/J45,0)","v":{"v":0,"d":"0.0"}},{"$f":"VLOOKUP(A45,Formelhilfe!$A$15:$H$74,8,FALSE)","v":{"v":0,"d":"0.0"}},{"$f":"SUM(C45:H45)","v":{"v":0,"d":"0.0"}},{"$f":"VLOOKUP($A45,'7'!$B$10:$D$75,3,FALSE)","v":{"v":0,"d":"0.0"}},{"$f":"VLOOKUP($A45,'8'!$B$10:$D$75,3,FALSE)","v":{"v":0,"d":"0.0"}},{"$f":"VLOOKUP($A45,'9'!$B$10:$D$75,3,FALSE)","v":{"v":0,"d":"0.0"}},{"$f":"VLOOKUP($A45,'10'!$B$10:$D$75,3,FALSE)","v":{"v":0,"d":"0.0"}},{"$f":"VLOOKUP($A45,'11'!$B$10:$D$75,3,FALSE)","v":{"v":0,"d":"0.0"}},{"$f":"VLOOKUP($A45,'12'!$B$10:$D$75,3,FALSE)","v":{"v":0,"d":"0.0"}},{"$f":"IF(S45 >0,T45/S45,0)","v":{"v":0,"d":"0.0"}},{"$f":"VLOOKUP(A45,Formelhilfe!$A$15:$O$74,15,FALSE)","v":{"v":0,"d":"0.0"}},{"$f":"SUM(L45:Q45)","v":{"v":0,"d":"0.0"}},{"$f":"IF(V45>0,W45/V45,0)","v":{"v":0,"d":"0.0"}},{"$f":"VLOOKUP(A45,Formelhilfe!$A$15:$P$74,16,FALSE)","v":{"v":0,"d":"0.0"}},{"$f":"SUM(C45:H45,L45:Q45)","v":{"v":0,"d":"0.0"}}]
["Schütze 45",{"$f":"VLOOKUP(A46,'Wettkampf 1'!$B$16:$C$75,2,FALSE)","v":"Verein IX"},{"$f":"VLOOKUP(A46,'Wettkampf 1'!$B$16:$D$75,3,FALSE)","v":{"v":0,"d":"0.0"}},{"$f":"VLOOKUP($A46,Börgermoor!$B$16:$D$75,3,FALSE)","v":{"v":0,"d":"0.0"}},{"$f":"VLOOKUP($A46,'3'!$B$10:$D$75,3,FALSE)","v":{"v":0,"d":"0.0"}},{"$f":"VLOOKUP($A46,'4'!$B$10:$D$75,3,FALSE)","v":{"v":0,"d":"0.0"}},{"$f":"VLOOKUP($A46,'5'!$B$10:$D$75,3,FALSE)","v":{"v":0,"d":"0.0"}},{"$f":"VLOOKUP($A46,'6'!$B$10:$D$75,3,FALSE)","v":{"v":0,"d":"0.0"}},{"$f":"IF(J46 > 0,K46/J46,0)","v":{"v":0,"d":"0.0"}},{"$f":"VLOOKUP(A46,Formelhilfe!$A$15:$H$74,8,FALSE)","v":{"v":0,"d":"0.0"}},{"$f":"SUM(C46:H46)","v":{"v":0,"d":"0.0"}},{"$f":"VLOOKUP($A46,'7'!$B$10:$D$75,3,FALSE)","v":{"v":0,"d":"0.0"}},{"$f":"VLOOKUP($A46,'8'!$B$10:$D$75,3,FALSE)","v":{"v":0,"d":"0.0"}},{"$f":"VLOOKUP($A46,'9'!$B$10:$D$75,3,FALSE)","v":{"v":0,"d":"0.0"}},{"$f":"VLOOKUP($A46,'10'!$B$10:$D$75,3,FALSE)","v":{"v":0,"d":"0.0"}},{"$f":"VLOOKUP($A46,'11'!$B$10:$D$75,3,FALSE)","v":{"v":0,"d":"0.0"}},{"$f":"VLOOKUP($A46,'12'!$B$10:$D$75,3,FALSE)","v":{"v":0,"d":"0.0"}},{"$f":"IF(S46 >0,T46/S46,0)","v":{"v":0,"d":"0.0"}},{"$f":"VLOOKUP(A46,Formelhilfe!$A$15:$O$74,15,FALSE)","v":{"v":0,"d":"0.0"}},{"$f":"SUM(L46:Q46)","v":{"v":0,"d":"0.0"}},{"$f":"IF(V46>0,W46/V46,0)","v":{"v":0,"d":"0.0"}},{"$f":"VLOOKUP(A46,Formelhilfe!$A$15:$P$74,16,FALSE)","v":{"v":0,"d":"0.0"}},{"$f":"SUM(C46:H46,L46:Q46)","v":{"v":0,"d":"0.0"}}]
["Schütze 46",{"$f":"VLOOKUP(A47,'Wettkampf 1'!$B$16:$C$75,2,FALSE)","v":"Verein X"},{"$f":"VLOOKUP(A47,'Wettkampf 1'!$B$16:$D$75,3,FALSE)","v":{"v":0,"d":"0.0"}},{"$f":"VLOOKUP($A47,Börgermoor!$B$16:$D$75,3,FALSE)","v":{"v":0,"d":"0.0"}},{"$f":"VLOOKUP($A47,'3'!$B$10:$D$75,3,FALSE)","v":{"v":0,"d":"0.0"}},{"$f":"VLOOKUP($A47,'4'!$B$10:$D$75,3,FALSE)","v":{"v":0,"d":"0.0"}},{"$f":"VLOOKUP($A47,'5'!$B$10:$D$75,3,FALSE)","v":{"v":0,"d":"0.0"}},{"$f":"VLOOKUP($A47,'6'!$B$10:$D$75,3,FALSE)","v":{"v":0,"d":"0.0"}},{"$f":"IF(J47 > 0,K47/J47,0)","v":{"v":0,"d":"0.0"}},{"$f":"VLOOKUP(A47,Formelhilfe!$A$15:$H$74,8,FALSE)","v":{"v":0,"d":"0.0"}},{"$f":"SUM(C47:H47)","v":{"v":0,"d":"0.0"}},{"$f":"VLOOKUP($A47,'7'!$B$10:$D$75,3,FALSE)","v":{"v":0,"d":"0.0"}},{"$f":"VLOOKUP($A47,'8'!$B$10:$D$75,3,FALSE)","v":{"v":0,"d":"0.0"}},{"$f":"VLOOKUP($A47,'9'!$B$10:$D$75,3,FALSE)","v":{"v":0,"d":"0.0"}},{"$f":"VLOOKUP($A47,'10'!$B$10:$D$75,3,FALSE)","v":{"v":0,"d":"0.0"}},{"$f":"VLOOKUP($A47,'11'!$B$10:$D$75,3,FALSE)","v":{"v":0,"d":"0.0"}},{"$f":"VLOOKUP($A47,'12'!$B$10:$D$75,3,FALSE)","v":{"v":0,"d":"0.0"}},{"$f":"IF(S47 >0,T47/S47,0)","v":{"v":0,"d":"0.0"}},{"$f":"VLOOKUP(A47,Formelhilfe!$A$15:$O$74,15,FALSE)","v":{"v":0,"d":"0.0"}},{"$f":"SUM(L47:Q47)","v":{"v":0,"d":"0.0"}},{"$f":"IF(V47>0,W47/V47,0)","v":{"v":0,"d":"0.0"}},{"$f":"VLOOKUP(A47,Formelhilfe!$A$15:$P$74,16,FALSE)","v":{"v":0,"d":"0.0"}},{"$f":"SUM(C47:H47,L47:Q47)","v":{"v":0,"d":"0.0"}}]
["Schütze 47",{"$f":"VLOOKUP(A48,'Wettkampf 1'!$B$16:$C$75,2,FALSE)","v":"Verein X"},{"$f":"VLOOKUP(A48,'Wettkampf 1'!$B$16:$D$75,3,FALSE)","v":{"v":0,"d":"0.0"}},{"$f":"VLOOKUP($A48,Börgermoor!$B$16:$D$75,3,FALSE)","v":{"v":0,"d":"0.0"}},{"$f":"VLOOKUP($A48,'3'!$B$10:$D$75,3,FALSE)","v":{"v":0,"d":"0.0"}},{"$f":"VLOOKUP($A48,'4'!$B$10:$D$75,3,FALSE)","v":{"v":0,"d":"0.0"}},{"$f":"VLOOKUP($A48,'5'!$B$10:$D$75,3,FALSE)","v":{"v":0,"d":"0.0"}},{"$f":"VLOOKUP($A48,'6'!$B$10:$D$75,3,FALSE)","v":{"v":0,"d":"0.0"}},{"$f":"IF(J48 > 0,K48/J48,0)","v":{"v":0,"d":"0.0"}},{"$f":"VLOOKUP(A48,Formelhilfe!$A$15:$H$74,8,FALSE)","v":{"v":0,"d":"0.0"}},{"$f":"SUM(C48:H48)","v":{"v":0,"d":"0.0"}},{"$f":"VLOOKUP($A48,'7'!$B$10:$D$75,3,FALSE)","v":{"v":0,"d":"0.0"}},{"$f":"VLOOKUP($A48,'8'!$B$10:$D$75,3,FALSE)","v":{"v":0,"d":"0.0"}},{"$f":"VLOOKUP($A48,'9'!$B$10:$D$75,3,FALSE)","v":{"v":0,"d":"0.0"}},{"$f":"VLOOKUP($A48,'10'!$B$10:$D$75,3,FALSE)","v":{"v":0,"d":"0.0"}},{"$f":"VLOOKUP($A48,'11'!$B$10:$D$75,3,FALSE)","v":{"v":0,"d":"0.0"}},{"$f":"VLOOKUP($A48,'12'!$B$10:$D$75,3,FALSE)","v":{"v":0,"d":"0.0"}},{"$f":"IF(S48 >0,T48/S48,0)","v":{"v":0,"d":"0.0"}},{"$f":"VLOOKUP(A48,Formelhilfe!$A$15:$O$74,15,FALSE)","v":{"v":0,"d":"0.0"}},{"$f":"SUM(L48:Q48)","v":{"v":0,"d":"0.0"}},{"$f":"IF(V48>0,W48/V48,0)","v":{"v":0,"d":"0.0"}},{"$f":"VLOOKUP(A48,Formelhilfe!$A$15:$P$74,16,FALSE)","v":{"v":0,"d":"0.0"}},{"$f":"SUM(C48:H48,L48:Q48)","v":{"v":0,"d":"0.0"}}]
["Schütze 48",{"$f":"VLOOKUP(A49,'Wettkampf 1'!$B$16:$C$75,2,FALSE)","v":"Verein X"},{"$f":"VLOOKUP(A49,'Wettkampf 1'!$B$16:$D$75,3,FALSE)","v":{"v":0,"d":"0.0"}},{"$f":"VLOOKUP($A49,Börgermoor!$B$16:$D$75,3,FALSE)","v":{"v":0,"d":"0.0"}},{"$f":"VLOOKUP($A49,'3'!$B$10:$D$75,3,FALSE)","v":{"v":0,"d":"0.0"}},{"$f":"VLOOKUP($A49,'4'!$B$10:$D$75,3,FALSE)","v":{"v":0,"d":"0.0"}},{"$f":"VLOOKUP($A49,'5'!$B$10:$D$75,3,FALSE)","v":{"v":0,"d":"0.0"}},{"$f":"VLOOKUP($A49,'6'!$B$10:$D$75,3,FALSE)","v":{"v":0,"d":"0.0"}},{"$f":"IF(J49 > 0,K49/J49,0)","v":{"v":0,"d":"0.0"}},{"$f":"VLOOKUP(A49,Formelhilfe!$A$15:$H$74,8,FALSE)","v":{"v":0,"d":"0.0"}},{"$f":"SUM(C49:H49)","v":{"v":0,"d":"0.0"}},{"$f":"VLOOKUP($A49,'7'!$B$10:$D$75,3,FALSE)","v":{"v":0,"d":"0.0"}},{"$f":"VLOOKUP($A49,'8'!$B$10:$D$75,3,FALSE)","v":{"v":0,"d":"0.0"}},{"$f":"VLOOKUP($A49,'9'!$B$10:$D$75,3,FALSE)","v":{"v":0,"d":"0.0"}},{"$f":"VLOOKUP($A49,'10'!$B$10:$D$75,3,FALSE)","v":{"v":0,"d":"0.0"}},{"$f":"VLOOKUP($A49,'11'!$B$10:$D$75,3,FALSE)","v":{"v":0,"d":"0.0"}},{"$f":"VLOOKUP($A49,'12'!$B$10:$D$75,3,FALSE)","v":{"v":0,"d":"0.0"}},{"$f":"IF(S49 >0,T49/S49,0)","v":{"v":0,"d":"0.0"}},{"$f":"VLOOKUP(A49,Formelhilfe!$A$15:$O$74,15,FALSE)","v":{"v":0,"d":"0.0"}},{"$f":"SUM(L49:Q49)","v":{"v":0,"d":"0.0"}},{"$f":"IF(V49>0,W49/V49,0)","v":{"v":0,"d":"0.0"}},{"$f":"VLOOKUP(A49,Formelhilfe!$A$15:$P$74,16,FALSE)","v":{"v":0,"d":"0.0"}},{"$f":"SUM(C49:H49,L49:Q49)","v":{"v":0,"d":"0.0"}}]
["Schütze 49",{"$f":"VLOOKUP(A50,'Wettkampf 1'!$B$16:$C$75,2,FALSE)","v":"Verein X"},{"$f":"VLOOKUP(A50,'Wettkampf 1'!$B$16:$D$75,3,FALSE)","v":{"v":0,"d":"0.0"}},{"$f":"VLOOKUP($A50,Börgermoor!$B$16:$D$75,3,FALSE)","v":{"v":0,"d":"0.0"}},{"$f":"VLOOKUP($A50,'3'!$B$10:$D$75,3,FALSE)","v":{"v":0,"d":"0.0"}},{"$f":"VLOOKUP($A50,'4'!$B$10:$D$75,3,FALSE)","v":{"v":0,"d":"0.0"}},{"$f":"VLOOKUP($A50,'5'!$B$10:$D$75,3,FALSE)","v":{"v":0,"d":"0.0"}},{"$f":"VLOOKUP($A50,'6'!$B$10:$D$75,3,FALSE)","v":{"v":0,"d":"0.0"}},{"$f":"IF(J50 > 0,K50/J50,0)","v":{"v":0,"d":"0.0"}},{"$f":"VLOOKUP(A50,Formelhilfe!$A$15:$H$74,8,FALSE)","v":{"v":0,"d":"0.0"}},{"$f":"SUM(C50:H50)","v":{"v":0,"d":"0.0"}},{"$f":"VLOOKUP($A50,'7'!$B$10:$D$75,3,FALSE)","v":{"v":0,"d":"0.0"}},{"$f":"VLOOKUP($A50,'8'!$B$10:$D$75,3,FALSE)","v":{"v":0,"d":"0.0"}},{"$f":"VLOOKUP($A50,'9'!$B$10:$D$75,3,FALSE)","v":{"v":0,"d":"0.0"}},{"$f":"VLOOKUP($A50,'10'!$B$10:$D$75,3,FALSE)","v":{"v":0,"d":"0.0"}},{"$f":"VLOOKUP($A50,'11'!$B$10:$D$75,3,FALSE)","v":{"v":0,"d":"0.0"}},{"$f":"VLOOKUP($A50,'12'!$B$10:$D$75,3,FALSE)","v":{"v":0,"d":"0.0"}},{"$f":"IF(S50 >0,T50/S50,0)","v":{"v":0,"d":"0.0"}},{"$f":"VLOOKUP(A50,Formelhilfe!$A$15:$O$74,15,FALSE)","v":{"v":0,"d":"0.0"}},{"$f":"SUM(L50:Q50)","v":{"v":0,"d":"0.0"}},{"$f":"IF(V50>0,W50/V50,0)","v":{"v":0,"d":"0.0"}},{"$f":"VLOOKUP(A50,Formelhilfe!$A$15:$P$74,16,FALSE)","v":{"v":0,"d":"0.0"}},{"$f":"SUM(C50:H50,L50:Q50)","v":{"v":0,"d":"0.0"}}]
["Schütze 50",{"$f":"VLOOKUP(A51,'Wettkampf 1'!$B$16:$C$75,2,FALSE)","v":"Verein X"},{"$f":"VLOOKUP(A51,'Wettkampf 1'!$B$16:$D$75,3,FALSE)","v":{"v":0,"d":"0.0"}},{"$f":"VLOOKUP($A51,Börgermoor!$B$16:$D$75,3,FALSE)","v":{"v":0,"d":"0.0"}},{"$f":"VLOOKUP($A51,'3'!$B$10:$D$75,3,FALSE)","v":{"v":0,"d":"0.0"}},{"$f":"VLOOKUP($A51,'4'!$B$10:$D$75,3,FALSE)","v":{"v":0,"d":"0.0"}},{"$f":"VLOOKUP($A51,'5'!$B$10:$D$75,3,FALSE)","v":{"v":0,"d":"0.0"}},{"$f":"VLOOKUP($A51,'6'!$B$10:$D$75,3,FALSE)","v":{"v":0,"d":"0.0"}},{"$f":"IF(J51 > 0,K51/J51,0)","v":{"v":0,"d":"0.0"}},{"$f":"VLOOKUP(A51,Formelhilfe!$A$15:$H$74,8,FALSE)","v":{"v":0,"d":"0.0"}},{"$f":"SUM(C51:H51)","v":{"v":0,"d":"0.0"}},{"$f":"VLOOKUP($A51,'7'!$B$10:$D$75,3,FALSE)","v":{"v":0,"d":"0.0"}},{"$f":"VLOOKUP($A51,'8'!$B$10:$D$75,3,FALSE)","v":{"v":0,"d":"0.0"}},{"$f":"VLOOKUP($A51,'9'!$B$10:$D$75,3,FALSE)","v":{"v":0,"d":"0.0"}},{"$f":"VLOOKUP($A51,'10'!$B$10:$D$75,3,FALSE)","v":{"v":0,"d":"0.0"}},{"$f":"VLOOKUP($A51,'11'!$B$10:$D$75,3,FALSE)","v":{"v":0,"d":"0.0"}},{"$f":"VLOOKUP($A51,'12'!$B$10:$D$75,3,FALSE)","v":{"v":0,"d":"0.0"}},{"$f":"IF(S51 >0,T51/S51,0)","v":{"v":0,"d":"0.0"}},{"$f":"VLOOKUP(A51,Formelhilfe!$A$15:$O$74,15,FALSE)","v":{"v":0,"d":"0.0"}},{"$f":"SUM(L51:Q51)","v":{"v":0,"d":"0.0"}},{"$f":"IF(V51>0,W51/V51,0)","v":{"v":0,"d":"0.0"}},{"$f":"VLOOKUP(A51,Formelhilfe!$A$15:$P$74,16,FALSE)","v":{"v":0,"d":"0.0"}},{"$f":"SUM(C51:H51,L51:Q51)","v":{"v":0,"d":"0.0"}}]
["Schütze 51",{"$f":"VLOOKUP(A52,'Wettkampf 1'!$B$16:$C$75,2,FALSE)","v":"Verein XI"},{"$f":"VLOOKUP(A52,'Wettkampf 1'!$B$16:$D$75,3,FALSE)","v":{"v":0,"d":"0.0"}},{"$f":"VLOOKUP($A52,Börgermoor!$B$16:$D$75,3,FALSE)","v":{"v":0,"d":"0.0"}},{"$f":"VLOOKUP($A52,'3'!$B$10:$D$75,3,FALSE)","v":{"v":0,"d":"0.0"}},{"$f":"VLOOKUP($A52,'4'!$B$10:$D$75,3,FALSE)","v":{"v":0,"d":"0.0"}},{"$f":"VLOOKUP($A52,'5'!$B$10:$D$75,3,FALSE)","v":{"v":0,"d":"0.0"}},{"$f":"VLOOKUP($A52,'6'!$B$10:$D$75,3,FALSE)","v":{"v":0,"d":"0.0"}},{"$f":"IF(J52 > 0,K52/J52,0)","v":{"v":0,"d":"0.0"}},{"$f":"VLOOKUP(A52,Formelhilfe!$A$15:$H$74,8,FALSE)","v":{"v":0,"d":"0.0"}},{"$f":"SUM(C52:H52)","v":{"v":0,"d":"0.0"}},{"$f":"VLOOKUP($A52,'7'!$B$10:$D$75,3,FALSE)","v":{"v":0,"d":"0.0"}},{"$f":"VLOOKUP($A52,'8'!$B$10:$D$75,3,FALSE)","v":{"v":0,"d":"0.0"}},{"$f":"VLOOKUP($A52,'9'!$B$10:$D$75,3,FALSE)","v":{"v":0,"d":"0.0"}},{"$f":"VLOOKUP($A52,'10'!$B$10:$D$75,3,FALSE)","v":{"v":0,"d":"0.0"}},{"$f":"VLOOKUP($A52,'11'!$B$10:$D$75,3,FALSE)","v":{"v":0,"d":"0.0"}},{"$f":"VLOOKUP($A52,'12'!$B$10:$D$75,3,FALSE)","v":{"v":0,"d":"0.0"}},{"$f":"IF(S52 >0,T52/S52,0)","v":{"v":0,"d":"0.0"}},{"$f":"VLOOKUP(A52,Formelhilfe!$A$15:$O$74,15,FALSE)","v":{"v":0,"d":"0.0"}},{"$f":"SUM(L52:Q52)","v":{"v":0,"d":"0.0"}},{"$f":"IF(V52>0,W52/V52,0)","v":{"v":0,"d":"0.0"}},{"$f":"VLOOKUP(A52,Formelhilfe!$A$15:$P$74,16,FALSE)","v":{"v":0,"d":"0.0"}},{"$f":"SUM(C52:H52,L52:Q52)","v":{"v":0,"d":"0.0"}}]
["Schütze 52",{"$f":"VLOOKUP(A53,'Wettkampf 1'!$B$16:$C$75,2,FALSE)","v":"Verein XI"},{"$f":"VLOOKUP(A53,'Wettkampf 1'!$B$16:$D$75,3,FALSE)","v":{"v":0,"d":"0.0"}},{"$f":"VLOOKUP($A53,Börgermoor!$B$16:$D$75,3,FALSE)","v":{"v":0,"d":"0.0"}},{"$f":"VLOOKUP($A53,'3'!$B$10:$D$75,3,FALSE)","v":{"v":0,"d":"0.0"}},{"$f":"VLOOKUP($A53,'4'!$B$10:$D$75,3,FALSE)","v":{"v":0,"d":"0.0"}},{"$f":"VLOOKUP($A53,'5'!$B$10:$D$75,3,FALSE)","v":{"v":0,"d":"0.0"}},{"$f":"VLOOKUP($A53,'6'!$B$10:$D$75,3,FALSE)","v":{"v":0,"d":"0.0"}},{"$f":"IF(J53 > 0,K53/J53,0)","v":{"v":0,"d":"0.0"}},{"$f":"VLOOKUP(A53,Formelhilfe!$A$15:$H$74,8,FALSE)","v":{"v":0,"d":"0.0"}},{"$f":"SUM(C53:H53)","v":{"v":0,"d":"0.0"}},{"$f":"VLOOKUP($A53,'7'!$B$10:$D$75,3,FALSE)","v":{"v":0,"d":"0.0"}},{"$f":"VLOOKUP($A53,'8'!$B$10:$D$75,3,FALSE)","v":{"v":0,"d":"0.0"}},{"$f":"VLOOKUP($A53,'9'!$B$10:$D$75,3,FALSE)","v":{"v":0,"d":"0.0"}},{"$f":"VLOOKUP($A53,'10'!$B$10:$D$75,3,FALSE)","v":{"v":0,"d":"0.0"}},{"$f":"VLOOKUP($A53,'11'!$B$10:$D$75,3,FALSE)","v":{"v":0,"d":"0.0"}},{"$f":"VLOOKUP($A53,'12'!$B$10:$D$75,3,FALSE)","v":{"v":0,"d":"0.0"}},{"$f":"IF(S53 >0,T53/S53,0)","v":{"v":0,"d":"0.0"}},{"$f":"VLOOKUP(A53,Formelhilfe!$A$15:$O$74,15,FALSE)","v":{"v":0,"d":"0.0"}},{"$f":"SUM(L53:Q53)","v":{"v":0,"d":"0.0"}},{"$f":"IF(V53>0,W53/V53,0)","v":{"v":0,"d":"0.0"}},{"$f":"VLOOKUP(A53,Formelhilfe!$A$15:$P$74,16,FALSE)","v":{"v":0,"d":"0.0"}},{"$f":"SUM(C53:H53,L53:Q53)","v":{"v":0,"d":"0.0"}}]
["Schütze 53",{"$f":"VLOOKUP(A54,'Wettkampf 1'!$B$16:$C$75,2,FALSE)","v":"Verein XI"},{"$f":"VLOOKUP(A54,'Wettkampf 1'!$B$16:$D$75,3,FALSE)","v":{"v":0,"d":"0.0"}},{"$f":"VLOOKUP($A54,Börgermoor!$B$16:$D$75,3,FALSE)","v":{"v":0,"d":"0.0"}},{"$f":"VLOOKUP($A54,'3'!$B$10:$D$75,3,FALSE)","v":{"v":0,"d":"0.0"}},{"$f":"VLOOKUP($A54,'4'!$B$10:$D$75,3,FALSE)","v":{"v":0,"d":"0.0"}},{"$f":"VLOOKUP($A54,'5'!$B$10:$D$75,3,FALSE)","v":{"v":0,"d":"0.0"}},{"$f":"VLOOKUP($A54,'6'!$B$10:$D$75,3,FALSE)","v":{"v":0,"d":"0.0"}},{"$f":"IF(J54 > 0,K54/J54,0)","v":{"v":0,"d":"0.0"}},{"$f":"VLOOKUP(A54,Formelhilfe!$A$15:$H$74,8,FALSE)","v":{"v":0,"d":"0.0"}},{"$f":"SUM(C54:H54)","v":{"v":0,"d":"0.0"}},{"$f":"VLOOKUP($A54,'7'!$B$10:$D$75,3,FALSE)","v":{"v":0,"d":"0.0"}},{"$f":"VLOOKUP($A54,'8'!$B$10:$D$75,3,FALSE)","v":{"v":0,"d":"0.0"}},{"$f":"VLOOKUP($A54,'9'!$B$10:$D$75,3,FALSE)","v":{"v":0,"d":"0.0"}},{"$f":"VLOOKUP($A54,'10'!$B$10:$D$75,3,FALSE)","v":{"v":0,"d":"0.0"}},{"$f":"VLOOKUP($A54,'11'!$B$10:$D$75,3,FALSE)","v":{"v":0,"d":"0.0"}},{"$f":"VLOOKUP($A54,'12'!$B$10:$D$75,3,FALSE)","v":{"v":0,"d":"0.0"}},{"$f":"IF(S54 >0,T54/S54,0)","v":{"v":0,"d":"0.0"}},{"$f":"VLOOKUP(A54,Formelhilfe!$A$15:$O$74,15,FALSE)","v":{"v":0,"d":"0.0"}},{"$f":"SUM(L54:Q54)","v":{"v":0,"d":"0.0"}},{"$f":"IF(V54>0,W54/V54,0)","v":{"v":0,"d":"0.0"}},{"$f":"VLOOKUP(A54,Formelhilfe!$A$15:$P$74,16,FALSE)","v":{"v":0,"d":"0.0"}},{"$f":"SUM(C54:H54,L54:Q54)","v":{"v":0,"d":"0.0"}}]
["Schütze 54",{"$f":"VLOOKUP(A55,'Wettkampf 1'!$B$16:$C$75,2,FALSE)","v":"Verein XI"},{"$f":"VLOOKUP(A55,'Wettkampf 1'!$B$16:$D$75,3,FALSE)","v":{"v":0,"d":"0.0"}},{"$f":"VLOOKUP($A55,Börgermoor!$B$16:$D$75,3,FALSE)","v":{"v":0,"d":"0.0"}},{"$f":"VLOOKUP($A55,'3'!$B$10:$D$75,3,FALSE)","v":{"v":0,"d":"0.0"}},{"$f":"VLOOKUP($A55,'4'!$B$10:$D$75,3,FALSE)","v":{"v":0,"d":"0.0"}},{"$f":"VLOOKUP($A55,'5'!$B$10:$D$75,3,FALSE)","v":{"v":0,"d":"0.0"}},{"$f":"VLOOKUP($A55,'6'!$B$10:$D$75,3,FALSE)","v":{"v":0,"d":"0.0"}},{"$f":"IF(J55 > 0,K55/J55,0)","v":{"v":0,"d":"0.0"}},{"$f":"VLOOKUP(A55,Formelhilfe!$A$15:$H$74,8,FALSE)","v":{"v":0,"d":"0.0"}},{"$f":"SUM(C55:H55)","v":{"v":0,"d":"0.0"}},{"$f":"VLOOKUP($A55,'7'!$B$10:$D$75,3,FALSE)","v":{"v":0,"d":"0.0"}},{"$f":"VLOOKUP($A55,'8'!$B$10:$D$75,3,FALSE)","v":{"v":0,"d":"0.0"}},{"$f":"VLOOKUP($A55,'9'!$B$10:$D$75,3,FALSE)","v":{"v":0,"d":"0.0"}},{"$f":"VLOOKUP($A55,'10'!$B$10:$D$75,3,FALSE)","v":{"v":0,"d":"0.0"}},{"$f":"VLOOKUP($A55,'11'!$B$10:$D$75,3,FALSE)","v":{"v":0,"d":"0.0"}},{"$f":"VLOOKUP($A55,'12'!$B$10:$D$75,3,FALSE)","v":{"v":0,"d":"0.0"}},{"$f":"IF(S55 >0,T55/S55,0)","v":{"v":0,"d":"0.0"}},{"$f":"VLOOKUP(A55,Formelhilfe!$A$15:$O$74,15,FALSE)","v":{"v":0,"d":"0.0"}},{"$f":"SUM(L55:Q55)","v":{"v":0,"d":"0.0"}},{"$f":"IF(V55>0,W55/V55,0)","v":{"v":0,"d":"0.0"}},{"$f":"VLOOKUP(A55,Formelhilfe!$A$15:$P$74,16,FALSE)","v":{"v":0,"d":"0.0"}},{"$f":"SUM(C55:H55,L55:Q55)","v":{"v":0,"d":"0.0"}}]
["Schütze 55",{"$f":"VLOOKUP(A56,'Wettkampf 1'!$B$16:$C$75,2,FALSE)","v":"Verein XI"},{"$f":"VLOOKUP(A56,'Wettkampf 1'!$B$16:$D$75,3,FALSE)","v":{"v":0,"d":"0.0"}},{"$f":"VLOOKUP($A56,Börgermoor!$B$16:$D$75,3,FALSE)","v":{"v":0,"d":"0.0"}},{"$f":"VLOOKUP($A56,'3'!$B$10:$D$75,3,FALSE)","v":{"v":0,"d":"0.0"}},{"$f":"VLOOKUP($A56,'4'!$B$10:$D$75,3,FALSE)","v":{"v":0,"d":"0.0"}},{"$f":"VLOOKUP($A56,'5'!$B$10:$D$75,3,FALSE)","v":{"v":0,"d":"0.0"}},{"$f":"VLOOKUP($A56,'6'!$B$10:$D$75,3,FALSE)","v":{"v":0,"d":"0.0"}},{"$f":"IF(J56 > 0,K56/J56,0)","v":{"v":0,"d":"0.0"}},{"$f":"VLOOKUP(A56,Formelhilfe!$A$15:$H$74,8,FALSE)","v":{"v":0,"d":"0.0"}},{"$f":"SUM(C56:H56)","v":{"v":0,"d":"0.0"}},{"$f":"VLOOKUP($A56,'7'!$B$10:$D$75,3,FALSE)","v":{"v":0,"d":"0.0"}},{"$f":"VLOOKUP($A56,'8'!$B$10:$D$75,3,FALSE)","v":{"v":0,"d":"0.0"}},{"$f":"VLOOKUP($A56,'9'!$B$10:$D$75,3,FALSE)","v":{"v":0,"d":"0.0"}},{"$f":"VLOOKUP($A56,'10'!$B$10:$D$75,3,FALSE)","v":{"v":0,"d":"0.0"}},{"$f":"VLOOKUP($A56,'11'!$B$10:$D$75,3,FALSE)","v":{"v":0,"d":"0.0"}},{"$f":"VLOOKUP($A56,'12'!$B$10:$D$75,3,FALSE)","v":{"v":0,"d":"0.0"}},{"$f":"IF(S56 >0,T56/S56,0)","v":{"v":0,"d":"0.0"}},{"$f":"VLOOKUP(A56,Formelhilfe!$A$15:$O$74,15,FALSE)","v":{"v":0,"d":"0.0"}},{"$f":"SUM(L56:Q56)","v":{"v":0,"d":"0.0"}},{"$f":"IF(V56>0,W56/V56,0)","v":{"v":0,"d":"0.0"}},{"$f":"VLOOKUP(A56,Formelhilfe!$A$15:$P$74,16,FALSE)","v":{"v":0,"d":"0.0"}},{"$f":"SUM(C56:H56,L56:Q56)","v":{"v":0,"d":"0.0"}}]
["Schütze 56",{"$f":"VLOOKUP(A57,'Wettkampf 1'!$B$16:$C$75,2,FALSE)","v":"Verein XII"},{"$f":"VLOOKUP(A57,'Wettkampf 1'!$B$16:$D$75,3,FALSE)","v":{"v":0,"d":"0.0"}},{"$f":"VLOOKUP($A57,Börgermoor!$B$16:$D$75,3,FALSE)","v":{"v":0,"d":"0.0"}},{"$f":"VLOOKUP($A57,'3'!$B$10:$D$75,3,FALSE)","v":{"v":0,"d":"0.0"}},{"$f":"VLOOKUP($A57,'4'!$B$10:$D$75,3,FALSE)","v":{"v":0,"d":"0.0"}},{"$f":"VLOOKUP($A57,'5'!$B$10:$D$75,3,FALSE)","v":{"v":0,"d":"0.0"}},{"$f":"VLOOKUP($A57,'6'!$B$10:$D$75,3,FALSE)","v":{"v":0,"d":"0.0"}},{"$f":"IF(J57 > 0,K57/J57,0)","v":{"v":0,"d":"0.0"}},{"$f":"VLOOKUP(A57,Formelhilfe!$A$15:$H$74,8,FALSE)","v":{"v":0,"d":"0.0"}},{"$f":"SUM(C57:H57)","v":{"v":0,"d":"0.0"}},{"$f":"VLOOKUP($A57,'7'!$B$10:$D$75,3,FALSE)","v":{"v":0,"d":"0.0"}},{"$f":"VLOOKUP($A57,'8'!$B$10:$D$75,3,FALSE)","v":{"v":0,"d":"0.0"}},{"$f":"VLOOKUP($A57,'9'!$B$10:$D$75,3,FALSE)","v":{"v":0,"d":"0.0"}},{"$f":"VLOOKUP($A57,'10'!$B$10:$D$75,3,FALSE)","v":{"v":0,"d":"0.0"}},{"$f":"VLOOKUP($A57,'11'!$B$10:$D$75,3,FALSE)","v":{"v":0,"d":"0.0"}},{"$f":"VLOOKUP($A57,'12'!$B$10:$D$75,3,FALSE)","v":{"v":0,"d":"0.0"}},{"$f":"IF(S57 >0,T57/S57,0)","v":{"v":0,"d":"0.0"}},{"$f":"VLOOKUP(A57,Formelhilfe!$A$15:$O$74,15,FALSE)","v":{"v":0,"d":"0.0"}},{"$f":"SUM(L57:Q57)","v":{"v":0,"d":"0.0"}},{"$f":"IF(V57>0,W57/V57,0)","v":{"v":0,"d":"0.0"}},{"$f":"VLOOKUP(A57,Formelhilfe!$A$15:$P$74,16,FALSE)","v":{"v":0,"d":"0.0"}},{"$f":"SUM(C57:H57,L57:Q57)","v":{"v":0,"d":"0.0"}}]
["Schütze 57",{"$f":"VLOOKUP(A58,'Wettkampf 1'!$B$16:$C$75,2,FALSE)","v":"Verein XII"},{"$f":"VLOOKUP(A58,'Wettkampf 1'!$B$16:$D$75,3,FALSE)","v":{"v":0,"d":"0.0"}},{"$f":"VLOOKUP($A58,Börgermoor!$B$16:$D$75,3,FALSE)","v":{"v":0,"d":"0.0"}},{"$f":"VLOOKUP($A58,'3'!$B$10:$D$75,3,FALSE)","v":{"v":0,"d":"0.0"}},{"$f":"VLOOKUP($A58,'4'!$B$10:$D$75,3,FALSE)","v":{"v":0,"d":"0.0"}},{"$f":"VLOOKUP($A58,'5'!$B$10:$D$75,3,FALSE)","v":{"v":0,"d":"0.0"}},{"$f":"VLOOKUP($A58,'6'!$B$10:$D$75,3,FALSE)","v":{"v":0,"d":"0.0"}},{"$f":"IF(J58 > 0,K58/J58,0)","v":{"v":0,"d":"0.0"}},{"$f":"VLOOKUP(A58,Formelhilfe!$A$15:$H$74,8,FALSE)","v":{"v":0,"d":"0.0"}},{"$f":"SUM(C58:H58)","v":{"v":0,"d":"0.0"}},{"$f":"VLOOKUP($A58,'7'!$B$10:$D$75,3,FALSE)","v":{"v":0,"d":"0.0"}},{"$f":"VLOOKUP($A58,'8'!$B$10:$D$75,3,FALSE)","v":{"v":0,"d":"0.0"}},{"$f":"VLOOKUP($A58,'9'!$B$10:$D$75,3,FALSE)","v":{"v":0,"d":"0.0"}},{"$f":"VLOOKUP($A58,'10'!$B$10:$D$75,3,FALSE)","v":{"v":0,"d":"0.0"}},{"$f":"VLOOKUP($A58,'11'!$B$10:$D$75,3,FALSE)","v":{"v":0,"d":"0.0"}},{"$f":"VLOOKUP($A58,'12'!$B$10:$D$75,3,FALSE)","v":{"v":0,"d":"0.0"}},{"$f":"IF(S58 >0,T58/S58,0)","v":{"v":0,"d":"0.0"}},{"$f":"VLOOKUP(A58,Formelhilfe!$A$15:$O$74,15,FALSE)","v":{"v":0,"d":"0.0"}},{"$f":"SUM(L58:Q58)","v":{"v":0,"d":"0.0"}},{"$f":"IF(V58>0,W58/V58,0)","v":{"v":0,"d":"0.0"}},{"$f":"VLOOKUP(A58,Formelhilfe!$A$15:$P$74,16,FALSE)","v":{"v":0,"d":"0.0"}},{"$f":"SUM(C58:H58,L58:Q58)","v":{"v":0,"d":"0.0"}}]
["Schütze 58",{"$f":"VLOOKUP(A59,'Wettkampf 1'!$B$16:$C$75,2,FALSE)","v":"Verein XII"},{"$f":"VLOOKUP(A59,'Wettkampf 1'!$B$16:$D$75,3,FALSE)","v":{"v":0,"d":"0.0"}},{"$f":"VLOOKUP($A59,Börgermoor!$B$16:$D$75,3,FALSE)","v":{"v":0,"d":"0.0"}},{"$f":"VLOOKUP($A59,'3'!$B$10:$D$75,3,FALSE)","v":{"v":0,"d":"0.0"}},{"$f":"VLOOKUP($A59,'4'!$B$10:$D$75,3,FALSE)","v":{"v":0,"d":"0.0"}},{"$f":"VLOOKUP($A59,'5'!$B$10:$D$75,3,FALSE)","v":{"v":0,"d":"0.0"}},{"$f":"VLOOKUP($A59,'6'!$B$10:$D$75,3,FALSE)","v":{"v":0,"d":"0.0"}},{"$f":"IF(J59 > 0,K59/J59,0)","v":{"v":0,"d":"0.0"}},{"$f":"VLOOKUP(A59,Formelhilfe!$A$15:$H$74,8,FALSE)","v":{"v":0,"d":"0.0"}},{"$f":"SUM(C59:H59)","v":{"v":0,"d":"0.0"}},{"$f":"VLOOKUP($A59,'7'!$B$10:$D$75,3,FALSE)","v":{"v":0,"d":"0.0"}},{"$f":"VLOOKUP($A59,'8'!$B$10:$D$75,3,FALSE)","v":{"v":0,"d":"0.0"}},{"$f":"VLOOKUP($A59,'9'!$B$10:$D$75,3,FALSE)","v":{"v":0,"d":"0.0"}},{"$f":"VLOOKUP($A59,'10'!$B$10:$D$75,3,FALSE)","v":{"v":0,"d":"0.0"}},{"$f":"VLOOKUP($A59,'11'!$B$10:$D$75,3,FALSE)","v":{"v":0,"d":"0.0"}},{"$f":"VLOOKUP($A59,'12'!$B$10:$D$75,3,FALSE)","v":{"v":0,"d":"0.0"}},{"$f":"IF(S59 >0,T59/S59,0)","v":{"v":0,"d":"0.0"}},{"$f":"VLOOKUP(A59,Formelhilfe!$A$15:$O$74,15,FALSE)","v":{"v":0,"d":"0.0"}},{"$f":"SUM(L59:Q59)","v":{"v":0,"d":"0.0"}},{"$f":"IF(V59>0,W59/V59,0)","v":{"v":0,"d":"0.0"}},{"$f":"VLOOKUP(A59,Formelhilfe!$A$15:$P$74,16,FALSE)","v":{"v":0,"d":"0.0"}},{"$f":"SUM(C59:H59,L59:Q59)","v":{"v":0,"d":"0.0"}}]
["Schütze 59",{"$f":"VLOOKUP(A60,'Wettkampf 1'!$B$16:$C$75,2,FALSE)","v":"Verein XII"},{"$f":"VLOOKUP(A60,'Wettkampf 1'!$B$16:$D$75,3,FALSE)","v":{"v":0,"d":"0.0"}},{"$f":"VLOOKUP($A60,Börgermoor!$B$16:$D$75,3,FALSE)","v":{"v":0,"d":"0.0"}},{"$f":"VLOOKUP($A60,'3'!$B$10:$D$75,3,FALSE)","v":{"v":0,"d":"0.0"}},{"$f":"VLOOKUP($A60,'4'!$B$10:$D$75,3,FALSE)","v":{"v":0,"d":"0.0"}},{"$f":"VLOOKUP($A60,'5'!$B$10:$D$75,3,FALSE)","v":{"v":0,"d":"0.0"}},{"$f":"VLOOKUP($A60,'6'!$B$10:$D$75,3,FALSE)","v":{"v":0,"d":"0.0"}},{"$f":"IF(J60 > 0,K60/J60,0)","v":{"v":0,"d":"0.0"}},{"$f":"VLOOKUP(A60,Formelhilfe!$A$15:$H$74,8,FALSE)","v":{"v":0,"d":"0.0"}},{"$f":"SUM(C60:H60)","v":{"v":0,"d":"0.0"}},{"$f":"VLOOKUP($A60,'7'!$B$10:$D$75,3,FALSE)","v":{"v":0,"d":"0.0"}},{"$f":"VLOOKUP($A60,'8'!$B$10:$D$75,3,FALSE)","v":{"v":0,"d":"0.0"}},{"$f":"VLOOKUP($A60,'9'!$B$10:$D$75,3,FALSE)","v":{"v":0,"d":"0.0"}},{"$f":"VLOOKUP($A60,'10'!$B$10:$D$75,3,FALSE)","v":{"v":0,"d":"0.0"}},{"$f":"VLOOKUP($A60,'11'!$B$10:$D$75,3,FALSE)","v":{"v":0,"d":"0.0"}},{"$f":"VLOOKUP($A60,'12'!$B$10:$D$75,3,FALSE)","v":{"v":0,"d":"0.0"}},{"$f":"IF(S60 >0,T60/S60,0)","v":{"v":0,"d":"0.0"}},{"$f":"VLOOKUP(A60,Formelhilfe!$A$15:$O$74,15,FALSE)","v":{"v":0,"d":"0.0"}},{"$f":"SUM(L60:Q60)","v":{"v":0,"d":"0.0"}},{"$f":"IF(V60>0,W60/V60,0)","v":{"v":0,"d":"0.0"}},{"$f":"VLOOKUP(A60,Formelhilfe!$A$15:$P$74,16,FALSE)","v":{"v":0,"d":"0.0"}},{"$f":"SUM(C60:H60,L60:Q60)","v":{"v":0,"d":"0.0"}}]
["Schütze 60",{"$f":"VLOOKUP(A61,'Wettkampf 1'!$B$16:$C$75,2,FALSE)","v":"Verein XII"},{"$f":"VLOOKUP(A61,'Wettkampf 1'!$B$16:$D$75,3,FALSE)","v":{"v":0,"d":"0.0"}},{"$f":"VLOOKUP($A61,Börgermoor!$B$16:$D$75,3,FALSE)","v":{"v":0,"d":"0.0"}},{"$f":"VLOOKUP($A61,'3'!$B$10:$D$75,3,FALSE)","v":{"v":0,"d":"0.0"}},{"$f":"VLOOKUP($A61,'4'!$B$10:$D$75,3,FALSE)","v":{"v":0,"d":"0.0"}},{"$f":"VLOOKUP($A61,'5'!$B$10:$D$75,3,FALSE)","v":{"v":0,"d":"0.0"}},{"$f":"VLOOKUP($A61,'6'!$B$10:$D$75,3,FALSE)","v":{"v":0,"d":"0.0"}},{"$f":"IF(J61 > 0,K61/J61,0)","v":{"v":0,"d":"0.0"}},{"$f":"VLOOKUP(A61,Formelhilfe!$A$15:$H$74,8,FALSE)","v":{"v":0,"d":"0.0"}},{"$f":"SUM(C61:H61)","v":{"v":0,"d":"0.0"}},{"$f":"VLOOKUP($A61,'7'!$B$10:$D$75,3,FALSE)","v":{"v":0,"d":"0.0"}},{"$f":"VLOOKUP($A61,'8'!$B$10:$D$75,3,FALSE)","v":{"v":0,"d":"0.0"}},{"$f":"VLOOKUP($A61,'9'!$B$10:$D$75,3,FALSE)","v":{"v":0,"d":"0.0"}},{"$f":"VLOOKUP($A61,'10'!$B$10:$D$75,3,FALSE)","v":{"v":0,"d":"0.0"}},{"$f":"VLOOKUP($A61,'11'!$B$10:$D$75,3,FALSE)","v":{"v":0,"d":"0.0"}},{"$f":"VLOOKUP($A61,'12'!$B$10:$D$75,3,FALSE)","v":{"v":0,"d":"0.0"}},{"$f":"IF(S61 >0,T61/S61,0)","v":{"v":0,"d":"0.0"}},{"$f":"VLOOKUP(A61,Formelhilfe!$A$15:$O$74,15,FALSE)","v":{"v":0,"d":"0.0"}},{"$f":"SUM(L61:Q61)","v":{"v":0,"d":"0.0"}},{"$f":"IF(V61>0,W61/V61,0)","v":{"v":0,"d":"0.0"}},{"$f":"VLOOKUP(A61,Formelhilfe!$A$15:$P$74,16,FALSE)","v":{"v":0,"d":"0.0"}},{"$f":"SUM(C61:H61,L61:Q61)","v":{"v":0,"d":"0.0"}}]

{"sheet":"Formelhilfe","index":16,"n_rows":75,"n_cols":21,"rows_kept":75,"hidden":true}
[null,1,2,3,4,5,6,"Hinrunde Schnitt",7,8,9,10,11,12,"Rückrunde Schnitt","Gesamt Schnitt",null,null,"Kreisoberliga","Schützen","2023/2024"]
[{"$f":"'Wettkampf 1'!B2","v":"Lorup"},{"$f":"IF('Wettkampf 1'!D2>0,1,0)","v":1},{"$f":"IF(Börgermoor!$D2>0,1,0)","v":1},{"$f":"IF('3'!$D2>0,1,0)","v":1},{"$f":"IF('4'!$D2>0,1,0)","v":1},{"$f":"IF('5'!$D2>0,1,0)","v":0},{"$f":"IF('6'!$D2>0,1,0)","v":0},{"$f":"SUM(B2:G2)","v":4},{"$f":"IF('7'!$D2>0,1,0)","v":1},{"$f":"IF('8'!$D2>0,1,0)","v":1},{"$f":"IF('9'!$D2>0,1,0)","v":1},{"$f":"IF('10'!$D2>0,1,0)","v":1},{"$f":"IF('11'!$D2>0,1,0)","v":1},{"$f":"IF('12'!$D2>0,1,0)","v":0},{"$f":"SUM(I2:N2)","v":5},{"$f":"O2+H2","v":9},null,null,"1. Kreisliga","Damen","2024/2025"]
[{"$f":"'Wettkampf 1'!B3","v":"Sögel"},{"$f":"IF('Wettkampf 1'!D3>0,1,0)","v":0},{"$f":"IF(Börgermoor!$D3>0,1,0)","v":0},{"$f":"IF('3'!$D3>0,1,0)","v":0},{"$f":"IF('4'!$D3>0,1,0)","v":0},{"$f":"IF('5'!$D3>0,1,0)","v":0},{"$f":"IF('6'!$D3>0,1,0)","v":0},{"$f":"SUM(B3:G3)","v":0},{"$f":"IF('7'!$D3>0,1,0)","v":0},{"$f":"IF('8'!$D3>0,1,0)","v":0},{"$f":"IF('9'!$D3>0,1,0)","v":0},{"$f":"IF('10'!$D3>0,1,0)","v":0},{"$f":"IF('11'!$D3>0,1,0)","v":0},{"$f":"IF('12'!$D3>0,1,0)","v":0},{"$f":"SUM(I3:N3)","v":0},{"$f":"O3+H3","v":0},null,null,"2. Kreisliga","Altersgruppe","2025/2026"]
[{"$f":"'Wettkampf 1'!B4","v":"Spahnharenstätte"},{"$f":"IF('Wettkampf 1'!D4>0,1,0)","v":1},{"$f":"IF(Börgermoor!$D4>0,1,0)","v":1},{"$f":"IF('3'!$D4>0,1,0)","v":1},{"$f":"IF('4'!$D4>0,1,0)","v":1},{"$f":"IF('5'!$D4>0,1,0)","v":0},{"$f":"IF('6'!$D4>0,1,0)","v":0},4,{"$f":"IF('7'!$D4>0,1,0)","v":1},{"$f":"IF('8'!$D4>0,1,0)","v":1},{"$f":"IF('9'!$D4>0,1,0)","v":1},{"$f":"IF('10'!$D4>0,1,0)","v":1},{"$f":"IF('11'!$D4>0,1,0)","v":1},{"$f":"IF('12'!$D4>0,1,0)","v":0},5,9,null,null,"1. Kreisklasse","Senioren","2026/2027"]
[{"$f":"'Wettkampf 1'!B5","v":"Esterwegen"},{"$f":"IF('Wettkampf 1'!D5>0,1,0)","v":1},{"$f":"IF(Börgermoor!$D5>0,1,0)","v":1},{"$f":"IF('3'!$D5>0,1,0)","v":1},{"$f":"IF('4'!$D5>0,1,0)","v":1},{"$f":"IF('5'!$D5>0,1,0)","v":0},{"$f":"IF('6'!$D5>0,1,0)","v":0},4,{"$f":"IF('7'!$D5>0,1,0)","v":1},{"$f":"IF('8'!$D5>0,1,0)","v":1},{"$f":"IF('9'!$D5>0,1,0)","v":1},{"$f":"IF('10'!$D5>0,1,0)","v":1},{"$f":"IF('11'!$D5>0,1,0)","v":1},{"$f":"IF('12'!$D5>0,1,0)","v":0},5,9,null,null,"2. Kreisklasse","Jugend","2027/2028"]
[{"$f":"'Wettkampf 1'!B6","v":"Lähden"},{"$f":"IF('Wettkampf 1'!D6>0,1,0)","v":1},{"$f":"IF(Börgermoor!$D6>0,1,0)","v":1},{"$f":"IF('3'!$D6>0,1,0)","v":1},{"$f":"IF('4'!$D6>0,1,0)","v":1},{"$f":"IF('5'!$D6>0,1,0)","v":0},{"$f":"IF('6'!$D6>0,1,0)","v":0},4,{"$f":"IF('7'!$D6>0,1,0)","v":1},{"$f":"IF('8'!$D6>0,1,0)","v":1},{"$f":"IF('9'!$D6>0,1,0)","v":1},{"$f":"IF('10'!$D6>0,1,0)","v":1},{"$f":"IF('11'!$D6>0,1,0)","v":1},{"$f":"IF('12'!$D6>0,1,0)","v":0},5,9,null,null,"3. Kreisklasse","Schüler","2028/2029"]
[{"$f":"'Wettkampf 1'!B7","v":"Börgermoor"},{"$f":"IF('Wettkampf 1'!D7>0,1,0)","v":1},{"$f":"IF(Börgermoor!$D7>0,1,0)","v":1},{"$f":"IF('3'!$D7>0,1,0)","v":1},{"$f":"IF('4'!$D7>0,1,0)","v":1},{"$f":"IF('5'!$D7>0,1,0)","v":0},{"$f":"IF('6'!$D7>0,1,0)","v":0},4,{"$f":"IF('7'!$D7>0,1,0)","v":0},{"$f":"IF('8'!$D7>0,1,0)","v":1},{"$f":"IF('9'!$D7>0,1,0)","v":1},{"$f":"IF('10'!$D7>0,1,0)","v":1},{"$f":"IF('11'!$D7>0,1,0)","v":1},{"$f":"IF('12'!$D7>0,1,0)","v":0},4,8,null,null,"4. Kreisklasse","offene Klasse FHLG","2039/2030"]
[{"$f":"'Wettkampf 1'!B8","v":"Verein VII"},{"$f":"IF('Wettkampf 1'!D8>0,1,0)","v":0},{"$f":"IF(Börgermoor!$D8>0,1,0)","v":0},{"$f":"IF('3'!$D8>0,1,0)","v":0},{"$f":"IF('4'!$D8>0,1,0)","v":0},{"$f":"IF('5'!$D8>0,1,0)","v":0},{"$f":"IF('6'!$D8>0,1,0)","v":0},0,{"$f":"IF('7'!$D8>0,1,0)","v":0},{"$f":"IF('8'!$D8>0,1,0)","v":0},{"$f":"IF('9'!$D8>0,1,0)","v":0},{"$f":"IF('10'!$D8>0,1,0)","v":0},{"$f":"IF('11'!$D8>0,1,0)","v":0},{"$f":"IF('12'!$D8>0,1,0)","v":0},0,0,null,null,"5. Kreisklasse","Luftpistole"]
[{"$f":"'Wettkampf 1'!B9","v":"Verein VIII"},{"$f":"IF('Wettkampf 1'!D9>0,1,0)","v":0},{"$f":"IF(Börgermoor!$D9>0,1,0)","v":0},{"$f":"IF('3'!$D9>0,1,0)","v":0},{"$f":"IF('4'!$D9>0,1,0)","v":0},{"$f":"IF('5'!$D9>0,1,0)","v":0},{"$f":"IF('6'!$D9>0,1,0)","v":0},0,{"$f":"IF('7'!$D9>0,1,0)","v":0},{"$f":"IF('8'!$D9>0,1,0)","v":0},{"$f":"IF('9'!$D9>0,1,0)","v":0},{"$f":"IF('10'!$D9>0,1,0)","v":0},{"$f":"IF('11'!$D9>0,1,0)","v":0},{"$f":"IF('12'!$D9>0,1,0)","v":0},0,0,null,null,"6. Kreisklasse"]
[{"$f":"'Wettkampf 1'!B10","v":"Verein IX"},{"$f":"IF('Wettkampf 1'!D10>0,1,0)","v":0},{"$f":"IF(Börgermoor!$D10>0,1,0)","v":0},{"$f":"IF('3'!$D10>0,1,0)","v":0},{"$f":"IF('4'!$D10>0,1,0)","v":0},{"$f":"IF('5'!$D10>0,1,0)","v":0},{"$f":"IF('6'!$D10>0,1,0)","v":0},0,{"$f":"IF('7'!$D10>0,1,0)","v":0},{"$f":"IF('8'!$D10>0,1,0)","v":0},{"$f":"IF('9'!$D10>0,1,0)","v":0},{"$f":"IF('10'!$D10>0,1,0)","v":0},{"$f":"IF('11'!$D10>0,1,0)","v":0},{"$f":"IF('12'!$D10>0,1,0)","v":0},0,0,null,null,"7. Kreisklasse"]
[{"$f":"'Wettkampf 1'!B11","v":"Verein X"},{"$f":"IF('Wettkampf 1'!D11>0,1,0)","v":0},{"$f":"IF(Börgermoor!$D11>0,1,0)","v":0},{"$f":"IF('3'!$D11>0,1,0)","v":0},{"$f":"IF('4'!$D11>0,1,0)","v":0},{"$f":"IF('5'!$D11>0,1,0)","v":0},{"$f":"IF('6'!$D11>0,1,0)","v":0},0,{"$f":"IF('7'!$D11>0,1,0)","v":0},{"$f":"IF('8'!$D11>0,1,0)","v":0},{"$f":"IF('9'!$D11>0,1,0)","v":0},{"$f":"IF('10'!$D11>0,1,0)","v":0},{"$f":"IF('11'!$D11>0,1,0)","v":0},{"$f":"IF('12'!$D11>0,1,0)","v":0},0,0]
[{"$f":"'Wettkampf 1'!B12","v":"Verein XI"},{"$f":"IF('Wettkampf 1'!D12>0,1,0)","v":0},{"$f":"IF(Börgermoor!$D12>0,1,0)","v":0},{"$f":"IF('3'!$D12>0,1,0)","v":0},{"$f":"IF('4'!$D12>0,1,0)","v":0},{"$f":"IF('5'!$D12>0,1,0)","v":0},{"$f":"IF('6'!$D12>0,1,0)","v":0},0,{"$f":"IF('7'!$D12>0,1,0)","v":0},{"$f":"IF('8'!$D12>0,1,0)","v":0},{"$f":"IF('9'!$D12>0,1,0)","v":0},{"$f":"IF('10'!$D12>0,1,0)","v":0},{"$f":"IF('11'!$D12>0,1,0)","v":0},{"$f":"IF('12'!$D12>0,1,0)","v":0},0,0]
[{"$f":"'Wettkampf 1'!B13","v":"Verein XII"},{"$f":"IF('Wettkampf 1'!D13>0,1,0)","v":0},{"$f":"IF(Börgermoor!$D13>0,1,0)","v":0},{"$f":"IF('3'!$D13>0,1,0)","v":0},{"$f":"IF('4'!$D13>0,1,0)","v":0},{"$f":"IF('5'!$D13>0,1,0)","v":0},{"$f":"IF('6'!$D13>0,1,0)","v":0},0,{"$f":"IF('7'!$D13>0,1,0)","v":0},{"$f":"IF('8'!$D13>0,1,0)","v":0},{"$f":"IF('9'!$D13>0,1,0)","v":0},{"$f":"IF('10'!$D13>0,1,0)","v":0},{"$f":"IF('11'!$D13>0,1,0)","v":0},{"$f":"IF('12'!$D13>0,1,0)","v":0},0,0]
["Einzelergebnisse:"]
["Wotte Lia",{"$f":"IF('Wettkampf 1'!D16>0,1,0)","v":1},{"$f":"IF(Börgermoor!$D16>0,1,0)","v":1},{"$f":"IF('3'!$D16>0,1,0)","v":1},{"$f":"IF('4'!$D16>0,1,0)","v":1},{"$f":"IF('5'!$D16>0,1,0)","v":0},{"$f":"IF('6'!$D16>0,1,0)","v":0},4,{"$f":"IF('7'!$D16>0,1,0)","v":1},{"$f":"IF('8'!$D16>0,1,0)","v":1},{"$f":"IF('9'!$D16>0,1,0)","v":1},{"$f":"IF('10'!$D16>0,1,0)","v":1},{"$f":"IF('11'!$D16>0,1,0)","v":1},{"$f":"IF('12'!$D16>0,1,0)","v":0},5,{"$f":"O15+H15","v":9}]
["Wotte Hannes",{"$f":"IF('Wettkampf 1'!D17>0,1,0)","v":1},{"$f":"IF(Börgermoor!$D17>0,1,0)","v":1},{"$f":"IF('3'!$D17>0,1,0)","v":1},{"$f":"IF('4'!$D17>0,1,0)","v":1},{"$f":"IF('5'!$D17>0,1,0)","v":0},{"$f":"IF('6'!$D17>0,1,0)","v":0},4,{"$f":"IF('7'!$D17>0,1,0)","v":1},{"$f":"IF('8'!$D17>0,1,0)","v":1},{"$f":"IF('9'!$D17>0,1,0)","v":1},{"$f":"IF('10'!$D17>0,1,0)","v":1},{"$f":"IF('11'!$D17>0,1,0)","v":1},{"$f":"IF('12'!$D17>0,1,0)","v":0},5,{"$f":"O16+H16","v":9}]
["Gretenabeln Elias",{"$f":"IF('Wettkampf 1'!D18>0,1,0)","v":1},{"$f":"IF(Börgermoor!$D18>0,1,0)","v":1},{"$f":"IF('3'!$D18>0,1,0)","v":1},{"$f":"IF('4'!$D18>0,1,0)","v":1},{"$f":"IF('5'!$D18>0,1,0)","v":0},{"$f":"IF('6'!$D18>0,1,0)","v":0},4,{"$f":"IF('7'!$D18>0,1,0)","v":1},{"$f":"IF('8'!$D18>0,1,0)","v":1},{"$f":"IF('9'!$D18>0,1,0)","v":1},{"$f":"IF('10'!$D18>0,1,0)","v":1},{"$f":"IF('11'!$D18>0,1,0)","v":1},{"$f":"IF('12'!$D18>0,1,0)","v":0},5,9]
["Helmer Maike",{"$f":"IF('Wettkampf 1'!D19>0,1,0)","v":1},{"$f":"IF(Börgermoor!$D19>0,1,0)","v":1},{"$f":"IF('3'!$D19>0,1,0)","v":1},{"$f":"IF('4'!$D19>0,1,0)","v":1},{"$f":"IF('5'!$D19>0,1,0)","v":0},{"$f":"IF('6'!$D19>0,1,0)","v":0},4,{"$f":"IF('7'!$D19>0,1,0)","v":1},{"$f":"IF('8'!$D19>0,1,0)","v":1},{"$f":"IF('9'!$D19>0,1,0)","v":1},{"$f":"IF('10'!$D19>0,1,0)","v":1},{"$f":"IF('11'!$D19>0,1,0)","v":1},{"$f":"IF('12'!$D19>0,1,0)","v":0},5,9]
["Többen Jannes",{"$f":"IF('Wettkampf 1'!D20>0,1,0)","v":1},{"$f":"IF(Börgermoor!$D20>0,1,0)","v":1},{"$f":"IF('3'!$D20>0,1,0)","v":1},{"$f":"IF('4'!$D20>0,1,0)","v":1},{"$f":"IF('5'!$D20>0,1,0)","v":0},{"$f":"IF('6'!$D20>0,1,0)","v":0},4,{"$f":"IF('7'!$D20>0,1,0)","v":1},{"$f":"IF('8'!$D20>0,1,0)","v":1},{"$f":"IF('9'!$D20>0,1,0)","v":1},{"$f":"IF('10'!$D20>0,1,0)","v":1},{"$f":"IF('11'!$D20>0,1,0)","v":1},{"$f":"IF('12'!$D20>0,1,0)","v":0},5,9]
["Lüken Arne",{"$f":"IF('Wettkampf 1'!D21>0,1,0)","v":1},{"$f":"IF(Börgermoor!$D21>0,1,0)","v":1},{"$f":"IF('3'!$D21>0,1,0)","v":1},{"$f":"IF('4'!$D21>0,1,0)","v":0},{"$f":"IF('5'!$D21>0,1,0)","v":0},{"$f":"IF('6'!$D21>0,1,0)","v":0},3,{"$f":"IF('7'!$D21>0,1,0)","v":0},{"$f":"IF('8'!$D21>0,1,0)","v":0},{"$f":"IF('9'!$D21>0,1,0)","v":0},{"$f":"IF('10'!$D21>0,1,0)","v":0},{"$f":"IF('11'!$D21>0,1,0)","v":0},{"$f":"IF('12'!$D21>0,1,0)","v":0},0,3]
["Schütze 7",{"$f":"IF('Wettkampf 1'!D22>0,1,0)","v":0},{"$f":"IF(Börgermoor!$D22>0,1,0)","v":0},{"$f":"IF('3'!$D22>0,1,0)","v":0},{"$f":"IF('4'!$D22>0,1,0)","v":0},{"$f":"IF('5'!$D22>0,1,0)","v":0},{"$f":"IF('6'!$D22>0,1,0)","v":0},0,{"$f":"IF('7'!$D22>0,1,0)","v":0},{"$f":"IF('8'!$D22>0,1,0)","v":0},{"$f":"IF('9'!$D22>0,1,0)","v":0},{"$f":"IF('10'!$D22>0,1,0)","v":0},{"$f":"IF('11'!$D22>0,1,0)","v":0},{"$f":"IF('12'!$D22>0,1,0)","v":0},0,0]
["Schütze 8",{"$f":"IF('Wettkampf 1'!D23>0,1,0)","v":0},{"$f":"IF(Börgermoor!$D23>0,1,0)","v":0},{"$f":"IF('3'!$D23>0,1,0)","v":0},{"$f":"IF('4'!$D23>0,1,0)","v":0},{"$f":"IF('5'!$D23>0,1,0)","v":0},{"$f":"IF('6'!$D23>0,1,0)","v":0},0,{"$f":"IF('7'!$D23>0,1,0)","v":0},{"$f":"IF('8'!$D23>0,1,0)","v":0},{"$f":"IF('9'!$D23>0,1,0)","v":0},{"$f":"IF('10'!$D23>0,1,0)","v":0},{"$f":"IF('11'!$D23>0,1,0)","v":0},{"$f":"IF('12'!$D23>0,1,0)","v":0},0,0]
["Schütze 9",{"$f":"IF('Wettkampf 1'!D24>0,1,0)","v":0},{"$f":"IF(Börgermoor!$D24>0,1,0)","v":0},{"$f":"IF('3'!$D24>0,1,0)","v":0},{"$f":"IF('4'!$D24>0,1,0)","v":0},{"$f":"IF('5'!$D24>0,1,0)","v":0},{"$f":"IF('6'!$D24>0,1,0)","v":0},0,{"$f":"IF('7'!$D24>0,1,0)","v":0},{"$f":"IF('8'!$D24>0,1,0)","v":0},{"$f":"IF('9'!$D24>0,1,0)","v":0},{"$f":"IF('10'!$D24>0,1,0)","v":0},{"$f":"IF('11'!$D24>0,1,0)","v":0},{"$f":"IF('12'!$D24>0,1,0)","v":0},0,0]
["Schütze 10",{"$f":"IF('Wettkampf 1'!D25>0,1,0)","v":0},{"$f":"IF(Börgermoor!$D25>0,1,0)","v":0},{"$f":"IF('3'!$D25>0,1,0)","v":0},{"$f":"IF('4'!$D25>0,1,0)","v":0},{"$f":"IF('5'!$D25>0,1,0)","v":0},{"$f":"IF('6'!$D25>0,1,0)","v":0},0,{"$f":"IF('7'!$D25>0,1,0)","v":0},{"$f":"IF('8'!$D25>0,1,0)","v":0},{"$f":"IF('9'!$D25>0,1,0)","v":0},{"$f":"IF('10'!$D25>0,1,0)","v":0},{"$f":"IF('11'!$D25>0,1,0)","v":0},{"$f":"IF('12'!$D25>0,1,0)","v":0},0,0]
["Engbers Hannes",{"$f":"IF('Wettkampf 1'!D26>0,1,0)","v":1},{"$f":"IF(Börgermoor!$D26>0,1,0)","v":1},{"$f":"IF('3'!$D26>0,1,0)","v":0},{"$f":"IF('4'!$D26>0,1,0)","v":1},{"$f":"IF('5'!$D26>0,1,0)","v":0},{"$f":"IF('6'!$D26>0,1,0)","v":0},3,{"$f":"IF('7'!$D26>0,1,0)","v":1},{"$f":"IF('8'!$D26>0,1,0)","v":1},{"$f":"IF('9'!$D26>0,1,0)","v":1},{"$f":"IF('10'!$D26>0,1,0)","v":1},{"$f":"IF('11'!$D26>0,1,0)","v":0},{"$f":"IF('12'!$D26>0,1,0)","v":0},4,7]
["Runde Marcel",{"$f":"IF('Wettkampf 1'!D27>0,1,0)","v":1},{"$f":"IF(Börgermoor!$D27>0,1,0)","v":1},{"$f":"IF('3'!$D27>0,1,0)","v":1},{"$f":"IF('4'!$D27>0,1,0)","v":1},{"$f":"IF('5'!$D27>0,1,0)","v":0},{"$f":"IF('6'!$D27>0,1,0)","v":0},4,{"$f":"IF('7'!$D27>0,1,0)","v":1},{"$f":"IF('8'!$D27>0,1,0)","v":1},{"$f":"IF('9'!$D27>0,1,0)","v":1},{"$f":"IF('10'!$D27>0,1,0)","v":1},{"$f":"IF('11'!$D27>0,1,0)","v":1},{"$f":"IF('12'!$D27>0,1,0)","v":0},5,9]
["Jansen Lars",{"$f":"IF('Wettkampf 1'!D28>0,1,0)","v":1},{"$f":"IF(Börgermoor!$D28>0,1,0)","v":1},{"$f":"IF('3'!$D28>0,1,0)","v":1},{"$f":"IF('4'!$D28>0,1,0)","v":1},{"$f":"IF('5'!$D28>0,1,0)","v":0},{"$f":"IF('6'!$D28>0,1,0)","v":0},4,{"$f":"IF('7'!$D28>0,1,0)","v":0},{"$f":"IF('8'!$D28>0,1,0)","v":1},{"$f":"IF('9'!$D28>0,1,0)","v":1},{"$f":"IF('10'!$D28>0,1,0)","v":0},{"$f":"IF('11'!$D28>0,1,0)","v":1},{"$f":"IF('12'!$D28>0,1,0)","v":0},3,7]
["Schütze 14",{"$f":"IF('Wettkampf 1'!D29>0,1,0)","v":0},{"$f":"IF(Börgermoor!$D29>0,1,0)","v":0},{"$f":"IF('3'!$D29>0,1,0)","v":0},{"$f":"IF('4'!$D29>0,1,0)","v":0},{"$f":"IF('5'!$D29>0,1,0)","v":0},{"$f":"IF('6'!$D29>0,1,0)","v":0},0,{"$f":"IF('7'!$D29>0,1,0)","v":0},{"$f":"IF('8'!$D29>0,1,0)","v":0},{"$f":"IF('9'!$D29>0,1,0)","v":0},{"$f":"IF('10'!$D29>0,1,0)","v":0},{"$f":"IF('11'!$D29>0,1,0)","v":0},{"$f":"IF('12'!$D29>0,1,0)","v":0},0,0]
["Schütze 15",{"$f":"IF('Wettkampf 1'!D30>0,1,0)","v":0},{"$f":"IF(Börgermoor!$D30>0,1,0)","v":0},{"$f":"IF('3'!$D30>0,1,0)","v":0},{"$f":"IF('4'!$D30>0,1,0)","v":0},{"$f":"IF('5'!$D30>0,1,0)","v":0},{"$f":"IF('6'!$D30>0,1,0)","v":0},0,{"$f":"IF('7'!$D30>0,1,0)","v":0},{"$f":"IF('8'!$D30>0,1,0)","v":0},{"$f":"IF('9'!$D30>0,1,0)","v":0},{"$f":"IF('10'!$D30>0,1,0)","v":0},{"$f":"IF('11'!$D30>0,1,0)","v":0},{"$f":"IF('12'!$D30>0,1,0)","v":0},0,0]
["Suhle Annalena",{"$f":"IF('Wettkampf 1'!D31>0,1,0)","v":1},{"$f":"IF(Börgermoor!$D31>0,1,0)","v":1},{"$f":"IF('3'!$D31>0,1,0)","v":1},{"$f":"IF('4'!$D31>0,1,0)","v":1},{"$f":"IF('5'!$D31>0,1,0)","v":0},{"$f":"IF('6'!$D31>0,1,0)","v":0},4,{"$f":"IF('7'!$D31>0,1,0)","v":1},{"$f":"IF('8'!$D31>0,1,0)","v":1},{"$f":"IF('9'!$D31>0,1,0)","v":1},{"$f":"IF('10'!$D31>0,1,0)","v":1},{"$f":"IF('11'!$D31>0,1,0)","v":1},{"$f":"IF('12'!$D31>0,1,0)","v":0},5,9]
["Gäken Lena",{"$f":"IF('Wettkampf 1'!D32>0,1,0)","v":1},{"$f":"IF(Börgermoor!$D32>0,1,0)","v":1},{"$f":"IF('3'!$D32>0,1,0)","v":1},{"$f":"IF('4'!$D32>0,1,0)","v":1},{"$f":"IF('5'!$D32>0,1,0)","v":0},{"$f":"IF('6'!$D32>0,1,0)","v":0},4,{"$f":"IF('7'!$D32>0,1,0)","v":1},{"$f":"IF('8'!$D32>0,1,0)","v":1},{"$f":"IF('9'!$D32>0,1,0)","v":1},{"$f":"IF('10'!$D32>0,1,0)","v":1},{"$f":"IF('11'!$D32>0,1,0)","v":1},{"$f":"IF('12'!$D32>0,1,0)","v":0},5,9]
["Jansen Daniel",{"$f":"IF('Wettkampf 1'!D33>0,1,0)","v":1},{"$f":"IF(Börgermoor!$D33>0,1,0)","v":1},{"$f":"IF('3'!$D33>0,1,0)","v":1},{"$f":"IF('4'!$D33>0,1,0)","v":1},{"$f":"IF('5'!$D33>0,1,0)","v":0},{"$f":"IF('6'!$D33>0,1,0)","v":0},4,{"$f":"IF('7'!$D33>0,1,0)","v":1},{"$f":"IF('8'!$D33>0,1,0)","v":1},{"$f":"IF('9'!$D33>0,1,0)","v":0},{"$f":"IF('10'!$D33>0,1,0)","v":1},{"$f":"IF('11'!$D33>0,1,0)","v":1},{"$f":"IF('12'!$D33>0,1,0)","v":0},4,8]
["Pieper Jonas",{"$f":"IF('Wettkampf 1'!D34>0,1,0)","v":0},{"$f":"IF(Börgermoor!$D34>0,1,0)","v":0},{"$f":"IF('3'!$D34>0,1,0)","v":0},{"$f":"IF('4'!$D34>0,1,0)","v":0},{"$f":"IF('5'!$D34>0,1,0)","v":0},{"$f":"IF('6'!$D34>0,1,0)","v":0},0,{"$f":"IF('7'!$D34>0,1,0)","v":0},{"$f":"IF('8'!$D34>0,1,0)","v":1},{"$f":"IF('9'!$D34>0,1,0)","v":1},{"$f":"IF('10'!$D34>0,1,0)","v":1},{"$f":"IF('11'!$D34>0,1,0)","v":0},{"$f":"IF('12'!$D34>0,1,0)","v":0},3,3]
["Schütze 20",{"$f":"IF('Wettkampf 1'!D35>0,1,0)","v":0},{"$f":"IF(Börgermoor!$D35>0,1,0)","v":0},{"$f":"IF('3'!$D35>0,1,0)","v":0},{"$f":"IF('4'!$D35>0,1,0)","v":0},{"$f":"IF('5'!$D35>0,1,0)","v":0},{"$f":"IF('6'!$D35>0,1,0)","v":0},0,{"$f":"IF('7'!$D35>0,1,0)","v":0},{"$f":"IF('8'!$D35>0,1,0)","v":0},{"$f":"IF('9'!$D35>0,1,0)","v":0},{"$f":"IF('10'!$D35>0,1,0)","v":0},{"$f":"IF('11'!$D35>0,1,0)","v":0},{"$f":"IF('12'!$D35>0,1,0)","v":0},0,0]
["Hellweg Thea",{"$f":"IF('Wettkampf 1'!D36>0,1,0)","v":1},{"$f":"IF(Börgermoor!$D36>0,1,0)","v":1},{"$f":"IF('3'!$D36>0,1,0)","v":1},{"$f":"IF('4'!$D36>0,1,0)","v":1},{"$f":"IF('5'!$D36>0,1,0)","v":0},{"$f":"IF('6'!$D36>0,1,0)","v":0},4,{"$f":"IF('7'!$D36>0,1,0)","v":1},{"$f":"IF('8'!$D36>0,1,0)","v":1},{"$f":"IF('9'!$D36>0,1,0)","v":1},{"$f":"IF('10'!$D36>0,1,0)","v":1},{"$f":"IF('11'!$D36>0,1,0)","v":1},{"$f":"IF('12'!$D36>0,1,0)","v":0},5,9]
["Bruns Henrik",{"$f":"IF('Wettkampf 1'!D37>0,1,0)","v":1},{"$f":"IF(Börgermoor!$D37>0,1,0)","v":1},{"$f":"IF('3'!$D37>0,1,0)","v":1},{"$f":"IF('4'!$D37>0,1,0)","v":1},{"$f":"IF('5'!$D37>0,1,0)","v":0},{"$f":"IF('6'!$D37>0,1,0)","v":0},4,{"$f":"IF('7'!$D37>0,1,0)","v":1},{"$f":"IF('8'!$D37>0,1,0)","v":1},{"$f":"IF('9'!$D37>0,1,0)","v":1},{"$f":"IF('10'!$D37>0,1,0)","v":1},{"$f":"IF('11'!$D37>0,1,0)","v":1},{"$f":"IF('12'!$D37>0,1,0)","v":0},5,9]
["Buschen Johann ",{"$f":"IF('Wettkampf 1'!D38>0,1,0)","v":1},{"$f":"IF(Börgermoor!$D38>0,1,0)","v":1},{"$f":"IF('3'!$D38>0,1,0)","v":1},{"$f":"IF('4'!$D38>0,1,0)","v":1},{"$f":"IF('5'!$D38>0,1,0)","v":0},{"$f":"IF('6'!$D38>0,1,0)","v":0},4,{"$f":"IF('7'!$D38>0,1,0)","v":1},{"$f":"IF('8'!$D38>0,1,0)","v":1},{"$f":"IF('9'!$D38>0,1,0)","v":1},{"$f":"IF('10'!$D38>0,1,0)","v":1},{"$f":"IF('11'!$D38>0,1,0)","v":1},{"$f":"IF('12'!$D38>0,1,0)","v":0},5,9]
["Preut Jannis",{"$f":"IF('Wettkampf 1'!D39>0,1,0)","v":1},{"$f":"IF(Börgermoor!$D39>0,1,0)","v":0},{"$f":"IF('3'!$D39>0,1,0)","v":1},{"$f":"IF('4'!$D39>0,1,0)","v":1},{"$f":"IF('5'!$D39>0,1,0)","v":0},{"$f":"IF('6'!$D39>0,1,0)","v":0},3,{"$f":"IF('7'!$D39>0,1,0)","v":1},{"$f":"IF('8'!$D39>0,1,0)","v":1},{"$f":"IF('9'!$D39>0,1,0)","v":1},{"$f":"IF('10'!$D39>0,1,0)","v":1},{"$f":"IF('11'!$D39>0,1,0)","v":1},{"$f":"IF('12'!$D39>0,1,0)","v":0},5,8]
["Fleschenberg Jana",{"$f":"IF('Wettkampf 1'!D40>0,1,0)","v":0},{"$f":"IF(Börgermoor!$D40>0,1,0)","v":0},{"$f":"IF('3'!$D40>0,1,0)","v":1},{"$f":"IF('4'!$D40>0,1,0)","v":0},{"$f":"IF('5'!$D40>0,1,0)","v":0},{"$f":"IF('6'!$D40>0,1,0)","v":0},1,{"$f":"IF('7'!$D40>0,1,0)","v":1},{"$f":"IF('8'!$D40>0,1,0)","v":1},{"$f":"IF('9'!$D40>0,1,0)","v":1},{"$f":"IF('10'!$D40>0,1,0)","v":1},{"$f":"IF('11'!$D40>0,1,0)","v":1},{"$f":"IF('12'!$D40>0,1,0)","v":0},5,6]
["von Seggern Moritz",{"$f":"IF('Wettkampf 1'!D41>0,1,0)","v":0},{"$f":"IF(Börgermoor!$D41>0,1,0)","v":0},{"$f":"IF('3'!$D41>0,1,0)","v":0},{"$f":"IF('4'!$D41>0,1,0)","v":1},{"$f":"IF('5'!$D41>0,1,0)","v":0},{"$f":"IF('6'!$D41>0,1,0)","v":0},1,{"$f":"IF('7'!$D41>0,1,0)","v":1},{"$f":"IF('8'!$D41>0,1,0)","v":1},{"$f":"IF('9'!$D41>0,1,0)","v":1},{"$f":"IF('10'!$D41>0,1,0)","v":1},{"$f":"IF('11'!$D41>0,1,0)","v":1},{"$f":"IF('12'!$D41>0,1,0)","v":0},5,6]
["Kohnen Saskia",{"$f":"IF('Wettkampf 1'!D42>0,1,0)","v":1},{"$f":"IF(Börgermoor!$D42>0,1,0)","v":1},{"$f":"IF('3'!$D42>0,1,0)","v":1},{"$f":"IF('4'!$D42>0,1,0)","v":1},{"$f":"IF('5'!$D42>0,1,0)","v":0},{"$f":"IF('6'!$D42>0,1,0)","v":0},4,{"$f":"IF('7'!$D42>0,1,0)","v":0},{"$f":"IF('8'!$D42>0,1,0)","v":1},{"$f":"IF('9'!$D42>0,1,0)","v":1},{"$f":"IF('10'!$D42>0,1,0)","v":1},{"$f":"IF('11'!$D42>0,1,0)","v":1},{"$f":"IF('12'!$D42>0,1,0)","v":0},4,8]
["Niemann Paul",{"$f":"IF('Wettkampf 1'!D43>0,1,0)","v":1},{"$f":"IF(Börgermoor!$D43>0,1,0)","v":1},{"$f":"IF('3'!$D43>0,1,0)","v":1},{"$f":"IF('4'!$D43>0,1,0)","v":0},{"$f":"IF('5'!$D43>0,1,0)","v":0},{"$f":"IF('6'!$D43>0,1,0)","v":0},3,{"$f":"IF('7'!$D43>0,1,0)","v":0},{"$f":"IF('8'!$D43>0,1,0)","v":0},{"$f":"IF('9'!$D43>0,1,0)","v":0},{"$f":"IF('10'!$D43>0,1,0)","v":0},{"$f":"IF('11'!$D43>0,1,0)","v":0},{"$f":"IF('12'!$D43>0,1,0)","v":0},0,3]
["Schütze 29",{"$f":"IF('Wettkampf 1'!D44>0,1,0)","v":0},{"$f":"IF(Börgermoor!$D44>0,1,0)","v":0},{"$f":"IF('3'!$D44>0,1,0)","v":0},{"$f":"IF('4'!$D44>0,1,0)","v":0},{"$f":"IF('5'!$D44>0,1,0)","v":0},{"$f":"IF('6'!$D44>0,1,0)","v":0},0,{"$f":"IF('7'!$D44>0,1,0)","v":0},{"$f":"IF('8'!$D44>0,1,0)","v":0},{"$f":"IF('9'!$D44>0,1,0)","v":0},{"$f":"IF('10'!$D44>0,1,0)","v":0},{"$f":"IF('11'!$D44>0,1,0)","v":0},{"$f":"IF('12'!$D44>0,1,0)","v":0},0,0]
["Schütze 30",{"$f":"IF('Wettkampf 1'!D45>0,1,0)","v":0},{"$f":"IF(Börgermoor!$D45>0,1,0)","v":0},{"$f":"IF('3'!$D45>0,1,0)","v":0},{"$f":"IF('4'!$D45>0,1,0)","v":0},{"$f":"IF('5'!$D45>0,1,0)","v":0},{"$f":"IF('6'!$D45>0,1,0)","v":0},0,{"$f":"IF('7'!$D45>0,1,0)","v":0},{"$f":"IF('8'!$D45>0,1,0)","v":0},{"$f":"IF('9'!$D45>0,1,0)","v":0},{"$f":"IF('10'!$D45>0,1,0)","v":0},{"$f":"IF('11'!$D45>0,1,0)","v":0},{"$f":"IF('12'!$D45>0,1,0)","v":0},0,0]
["Stümpler Jan Luka ",{"$f":"IF('Wettkampf 1'!D46>0,1,0)","v":0},{"$f":"IF(Börgermoor!$D46>0,1,0)","v":0},{"$f":"IF('3'!$D46>0,1,0)","v":0},{"$f":"IF('4'!$D46>0,1,0)","v":0},{"$f":"IF('5'!$D46>0,1,0)","v":0},{"$f":"IF('6'!$D46>0,1,0)","v":0},0,{"$f":"IF('7'!$D46>0,1,0)","v":0},{"$f":"IF('8'!$D46>0,1,0)","v":0},{"$f":"IF('9'!$D46>0,1,0)","v":0},{"$f":"IF('10'!$D46>0,1,0)","v":0},{"$f":"IF('11'!$D46>0,1,0)","v":0},{"$f":"IF('12'!$D46>0,1,0)","v":0},0,{"$f":"O45+H45","v":0}]
["Helmer, Nils",{"$f":"IF('Wettkampf 1'!D47>0,1,0)","v":0},{"$f":"IF(Börgermoor!$D47>0,1,0)","v":0},{"$f":"IF('3'!$D47>0,1,0)","v":0},{"$f":"IF('4'!$D47>0,1,0)","v":0},{"$f":"IF('5'!$D47>0,1,0)","v":0},{"$f":"IF('6'!$D47>0,1,0)","v":0},0,{"$f":"IF('7'!$D47>0,1,0)","v":0},{"$f":"IF('8'!$D47>0,1,0)","v":1},{"$f":"IF('9'!$D47>0,1,0)","v":1},{"$f":"IF('10'!$D47>0,1,0)","v":1},{"$f":"IF('11'!$D47>0,1,0)","v":1},{"$f":"IF('12'!$D47>0,1,0)","v":0},4,4]
["Schütze 33",{"$f":"IF('Wettkampf 1'!D48>0,1,0)","v":0},{"$f":"IF(Börgermoor!$D48>0,1,0)","v":0},{"$f":"IF('3'!$D48>0,1,0)","v":0},{"$f":"IF('4'!$D48>0,1,0)","v":0},{"$f":"IF('5'!$D48>0,1,0)","v":0},{"$f":"IF('6'!$D48>0,1,0)","v":0},0,{"$f":"IF('7'!$D48>0,1,0)","v":0},{"$f":"IF('8'!$D48>0,1,0)","v":0},{"$f":"IF('9'!$D48>0,1,0)","v":0},{"$f":"IF('10'!$D48>0,1,0)","v":0},{"$f":"IF('11'!$D48>0,1,0)","v":0},{"$f":"IF('12'!$D48>0,1,0)","v":0},0,0]
["Schütze 34",{"$f":"IF('Wettkampf 1'!D49>0,1,0)","v":0},{"$f":"IF(Börgermoor!$D49>0,1,0)","v":0},{"$f":"IF('3'!$D49>0,1,0)","v":0},{"$f":"IF('4'!$D49>0,1,0)","v":0},{"$f":"IF('5'!$D49>0,1,0)","v":0},{"$f":"IF('6'!$D49>0,1,0)","v":0},0,{"$f":"IF('7'!$D49>0,1,0)","v":0},{"$f":"IF('8'!$D49>0,1,0)","v":0},{"$f":"IF('9'!$D49>0,1,0)","v":0},{"$f":"IF('10'!$D49>0,1,0)","v":0},{"$f":"IF('11'!$D49>0,1,0)","v":0},{"$f":"IF('12'!$D49>0,1,0)","v":0},0,0]
["Schütze 35",{"$f":"IF('Wettkampf 1'!D50>0,1,0)","v":0},{"$f":"IF(Börgermoor!$D50>0,1,0)","v":0},{"$f":"IF('3'!$D50>0,1,0)","v":0},{"$f":"IF('4'!$D50>0,1,0)","v":0},{"$f":"IF('5'!$D50>0,1,0)","v":0},{"$f":"IF('6'!$D50>0,1,0)","v":0},0,{"$f":"IF('7'!$D50>0,1,0)","v":0},{"$f":"IF('8'!$D50>0,1,0)","v":0},{"$f":"IF('9'!$D50>0,1,0)","v":0},{"$f":"IF('10'!$D50>0,1,0)","v":0},{"$f":"IF('11'!$D50>0,1,0)","v":0},{"$f":"IF('12'!$D50>0,1,0)","v":0},0,0]
["Schütze 36",{"$f":"IF('Wettkampf 1'!D51>0,1,0)","v":0},{"$f":"IF(Börgermoor!$D51>0,1,0)","v":0},{"$f":"IF('3'!$D51>0,1,0)","v":0},{"$f":"IF('4'!$D51>0,1,0)","v":0},{"$f":"IF('5'!$D51>0,1,0)","v":0},{"$f":"IF('6'!$D51>0,1,0)","v":0},0,{"$f":"IF('7'!$D51>0,1,0)","v":0},{"$f":"IF('8'!$D51>0,1,0)","v":0},{"$f":"IF('9'!$D51>0,1,0)","v":0},{"$f":"IF('10'!$D51>0,1,0)","v":0},{"$f":"IF('11'!$D51>0,1,0)","v":0},{"$f":"IF('12'!$D51>0,1,0)","v":0},0,0]
["Schütze 37",{"$f":"IF('Wettkampf 1'!D52>0,1,0)","v":0},{"$f":"IF(Börgermoor!$D52>0,1,0)","v":0},{"$f":"IF('3'!$D52>0,1,0)","v":0},{"$f":"IF('4'!$D52>0,1,0)","v":0},{"$f":"IF('5'!$D52>0,1,0)","v":0},{"$f":"IF('6'!$D52>0,1,0)","v":0},0,{"$f":"IF('7'!$D52>0,1,0)","v":0},{"$f":"IF('8'!$D52>0,1,0)","v":0},{"$f":"IF('9'!$D52>0,1,0)","v":0},{"$f":"IF('10'!$D52>0,1,0)","v":0},{"$f":"IF('11'!$D52>0,1,0)","v":0},{"$f":"IF('12'!$D52>0,1,0)","v":0},0,0]
["Schütze 38",{"$f":"IF('Wettkampf 1'!D53>0,1,0)","v":0},{"$f":"IF(Börgermoor!$D53>0,1,0)","v":0},{"$f":"IF('3'!$D53>0,1,0)","v":0},{"$f":"IF('4'!$D53>0,1,0)","v":0},{"$f":"IF('5'!$D53>0,1,0)","v":0},{"$f":"IF('6'!$D53>0,1,0)","v":0},0,{"$f":"IF('7'!$D53>0,1,0)","v":0},{"$f":"IF('8'!$D53>0,1,0)","v":0},{"$f":"IF('9'!$D53>0,1,0)","v":0},{"$f":"IF('10'!$D53>0,1,0)","v":0},{"$f":"IF('11'!$D53>0,1,0)","v":0},{"$f":"IF('12'!$D53>0,1,0)","v":0},0,0]
["Schütze 39",{"$f":"IF('Wettkampf 1'!D54>0,1,0)","v":0},{"$f":"IF(Börgermoor!$D54>0,1,0)","v":0},{"$f":"IF('3'!$D54>0,1,0)","v":0},{"$f":"IF('4'!$D54>0,1,0)","v":0},{"$f":"IF('5'!$D54>0,1,0)","v":0},{"$f":"IF('6'!$D54>0,1,0)","v":0},0,{"$f":"IF('7'!$D54>0,1,0)","v":0},{"$f":"IF('8'!$D54>0,1,0)","v":0},{"$f":"IF('9'!$D54>0,1,0)","v":0},{"$f":"IF('10'!$D54>0,1,0)","v":0},{"$f":"IF('11'!$D54>0,1,0)","v":0},{"$f":"IF('12'!$D54>0,1,0)","v":0},0,0]
["Schütze 40",{"$f":"IF('Wettkampf 1'!D55>0,1,0)","v":0},{"$f":"IF(Börgermoor!$D55>0,1,0)","v":0},{"$f":"IF('3'!$D55>0,1,0)","v":0},{"$f":"IF('4'!$D55>0,1,0)","v":0},{"$f":"IF('5'!$D55>0,1,0)","v":0},{"$f":"IF('6'!$D55>0,1,0)","v":0},0,{"$f":"IF('7'!$D55>0,1,0)","v":0},{"$f":"IF('8'!$D55>0,1,0)","v":0},{"$f":"IF('9'!$D55>0,1,0)","v":0},{"$f":"IF('10'!$D55>0,1,0)","v":0},{"$f":"IF('11'!$D55>0,1,0)","v":0},{"$f":"IF('12'!$D55>0,1,0)","v":0},0,0]
["Schütze 41",{"$f":"IF('Wettkampf 1'!D56>0,1,0)","v":0},{"$f":"IF(Börgermoor!$D56>0,1,0)","v":0},{"$f":"IF('3'!$D56>0,1,0)","v":0},{"$f":"IF('4'!$D56>0,1,0)","v":0},{"$f":"IF('5'!$D56>0,1,0)","v":0},{"$f":"IF('6'!$D56>0,1,0)","v":0},0,{"$f":"IF('7'!$D56>0,1,0)","v":0},{"$f":"IF('8'!$D56>0,1,0)","v":0},{"$f":"IF('9'!$D56>0,1,0)","v":0},{"$f":"IF('10'!$D56>0,1,0)","v":0},{"$f":"IF('11'!$D56>0,1,0)","v":0},{"$f":"IF('12'!$D56>0,1,0)","v":0},0,0]
["Schütze 42",{"$f":"IF('Wettkampf 1'!D57>0,1,0)","v":0},{"$f":"IF(Börgermoor!$D57>0,1,0)","v":0},{"$f":"IF('3'!$D57>0,1,0)","v":0},{"$f":"IF('4'!$D57>0,1,0)","v":0},{"$f":"IF('5'!$D57>0,1,0)","v":0},{"$f":"IF('6'!$D57>0,1,0)","v":0},0,{"$f":"IF('7'!$D57>0,1,0)","v":0},{"$f":"IF('8'!$D57>0,1,0)","v":0},{"$f":"IF('9'!$D57>0,1,0)","v":0},{"$f":"IF('10'!$D57>0,1,0)","v":0},{"$f":"IF('11'!$D57>0,1,0)","v":0},{"$f":"IF('12'!$D57>0,1,0)","v":0},0,0]
["Schütze 43",{"$f":"IF('Wettkampf 1'!D58>0,1,0)","v":0},{"$f":"IF(Börgermoor!$D58>0,1,0)","v":0},{"$f":"IF('3'!$D58>0,1,0)","v":0},{"$f":"IF('4'!$D58>0,1,0)","v":0},{"$f":"IF('5'!$D58>0,1,0)","v":0},{"$f":"IF('6'!$D58>0,1,0)","v":0},0,{"$f":"IF('7'!$D58>0,1,0)","v":0},{"$f":"IF('8'!$D58>0,1,0)","v":0},{"$f":"IF('9'!$D58>0,1,0)","v":0},{"$f":"IF('10'!$D58>0,1,0)","v":0},{"$f":"IF('11'!$D58>0,1,0)","v":0},{"$f":"IF('12'!$D58>0,1,0)","v":0},0,0]
["Schütze 44",{"$f":"IF('Wettkampf 1'!D59>0,1,0)","v":0},{"$f":"IF(Börgermoor!$D59>0,1,0)","v":0},{"$f":"IF('3'!$D59>0,1,0)","v":0},{"$f":"IF('4'!$D59>0,1,0)","v":0},{"$f":"IF('5'!$D59>0,1,0)","v":0},{"$f":"IF('6'!$D59>0,1,0)","v":0},0,{"$f":"IF('7'!$D59>0,1,0)","v":0},{"$f":"IF('8'!$D59>0,1,0)","v":0},{"$f":"IF('9'!$D59>0,1,0)","v":0},{"$f":"IF('10'!$D59>0,1,0)","v":0},{"$f":"IF('11'!$D59>0,1,0)","v":0},{"$f":"IF('12'!$D59>0,1,0)","v":0},0,0]
["Schütze 45",{"$f":"IF('Wettkampf 1'!D60>0,1,0)","v":0},{"$f":"IF(Börgermoor!$D60>0,1,0)","v":0},{"$f":"IF('3'!$D60>0,1,0)","v":0},{"$f":"IF('4'!$D60>0,1,0)","v":0},{"$f":"IF('5'!$D60>0,1,0)","v":0},{"$f":"IF('6'!$D60>0,1,0)","v":0},0,{"$f":"IF('7'!$D60>0,1,0)","v":0},{"$f":"IF('8'!$D60>0,1,0)","v":0},{"$f":"IF('9'!$D60>0,1,0)","v":0},{"$f":"IF('10'!$D60>0,1,0)","v":0},{"$f":"IF('11'!$D60>0,1,0)","v":0},{"$f":"IF('12'!$D60>0,1,0)","v":0},0,0]
["Schütze 46",{"$f":"IF('Wettkampf 1'!D61>0,1,0)","v":0},{"$f":"IF(Börgermoor!$D61>0,1,0)","v":0},{"$f":"IF('3'!$D61>0,1,0)","v":0},{"$f":"IF('4'!$D61>0,1,0)","v":0},{"$f":"IF('5'!$D61>0,1,0)","v":0},{"$f":"IF('6'!$D61>0,1,0)","v":0},0,{"$f":"IF('7'!$D61>0,1,0)","v":0},{"$f":"IF('8'!$D61>0,1,0)","v":0},{"$f":"IF('9'!$D61>0,1,0)","v":0},{"$f":"IF('10'!$D61>0,1,0)","v":0},{"$f":"IF('11'!$D61>0,1,0)","v":0},{"$f":"IF('12'!$D61>0,1,0)","v":0},0,0]
["Schütze 47",{"$f":"IF('Wettkampf 1'!D62>0,1,0)","v":0},{"$f":"IF(Börgermoor!$D62>0,1,0)","v":0},{"$f":"IF('3'!$D62>0,1,0)","v":0},{"$f":"IF('4'!$D62>0,1,0)","v":0},{"$f":"IF('5'!$D62>0,1,0)","v":0},{"$f":"IF('6'!$D62>0,1,0)","v":0},0,{"$f":"IF('7'!$D62>0,1,0)","v":0},{"$f":"IF('8'!$D62>0,1,0)","v":0},{"$f":"IF('9'!$D62>0,1,0)","v":0},{"$f":"IF('10'!$D62>0,1,0)","v":0},{"$f":"IF('11'!$D62>0,1,0)","v":0},{"$f":"IF('12'!$D62>0,1,0)","v":0},0,0]
["Schütze 48",{"$f":"IF('Wettkampf 1'!D63>0,1,0)","v":0},{"$f":"IF(Börgermoor!$D63>0,1,0)","v":0},{"$f":"IF('3'!$D63>0,1,0)","v":0},{"$f":"IF('4'!$D63>0,1,0)","v":0},{"$f":"IF('5'!$D63>0,1,0)","v":0},{"$f":"IF('6'!$D63>0,1,0)","v":0},0,{"$f":"IF('7'!$D63>0,1,0)","v":0},{"$f":"IF('8'!$D63>0,1,0)","v":0},{"$f":"IF('9'!$D63>0,1,0)","v":0},{"$f":"IF('10'!$D63>0,1,0)","v":0},{"$f":"IF('11'!$D63>0,1,0)","v":0},{"$f":"IF('12'!$D63>0,1,0)","v":0},0,0]
["Schütze 49",{"$f":"IF('Wettkampf 1'!D64>0,1,0)","v":0},{"$f":"IF(Börgermoor!$D64>0,1,0)","v":0},{"$f":"IF('3'!$D64>0,1,0)","v":0},{"$f":"IF('4'!$D64>0,1,0)","v":0},{"$f":"IF('5'!$D64>0,1,0)","v":0},{"$f":"IF('6'!$D64>0,1,0)","v":0},0,{"$f":"IF('7'!$D64>0,1,0)","v":0},{"$f":"IF('8'!$D64>0,1,0)","v":0},{"$f":"IF('9'!$D64>0,1,0)","v":0},{"$f":"IF('10'!$D64>0,1,0)","v":0},{"$f":"IF('11'!$D64>0,1,0)","v":0},{"$f":"IF('12'!$D64>0,1,0)","v":0},0,0]
["Schütze 50",{"$f":"IF('Wettkampf 1'!D65>0,1,0)","v":0},{"$f":"IF(Börgermoor!$D65>0,1,0)","v":0},{"$f":"IF('3'!$D65>0,1,0)","v":0},{"$f":"IF('4'!$D65>0,1,0)","v":0},{"$f":"IF('5'!$D65>0,1,0)","v":0},{"$f":"IF('6'!$D65>0,1,0)","v":0},0,{"$f":"IF('7'!$D65>0,1,0)","v":0},{"$f":"IF('8'!$D65>0,1,0)","v":0},{"$f":"IF('9'!$D65>0,1,0)","v":0},{"$f":"IF('10'!$D65>0,1,0)","v":0},{"$f":"IF('11'!$D65>0,1,0)","v":0},{"$f":"IF('12'!$D65>0,1,0)","v":0},0,0]
["Schütze 51",{"$f":"IF('Wettkampf 1'!D66>0,1,0)","v":0},{"$f":"IF(Börgermoor!$D66>0,1,0)","v":0},{"$f":"IF('3'!$D66>0,1,0)","v":0},{"$f":"IF('4'!$D66>0,1,0)","v":0},{"$f":"IF('5'!$D66>0,1,0)","v":0},{"$f":"IF('6'!$D66>0,1,0)","v":0},0,{"$f":"IF('7'!$D66>0,1,0)","v":0},{"$f":"IF('8'!$D66>0,1,0)","v":0},{"$f":"IF('9'!$D66>0,1,0)","v":0},{"$f":"IF('10'!$D66>0,1,0)","v":0},{"$f":"IF('11'!$D66>0,1,0)","v":0},{"$f":"IF('12'!$D66>0,1,0)","v":0},0,0]
["Schütze 52",{"$f":"IF('Wettkampf 1'!D67>0,1,0)","v":0},{"$f":"IF(Börgermoor!$D67>0,1,0)","v":0},{"$f":"IF('3'!$D67>0,1,0)","v":0},{"$f":"IF('4'!$D67>0,1,0)","v":0},{"$f":"IF('5'!$D67>0,1,0)","v":0},{"$f":"IF('6'!$D67>0,1,0)","v":0},0,{"$f":"IF('7'!$D67>0,1,0)","v":0},{"$f":"IF('8'!$D67>0,1,0)","v":0},{"$f":"IF('9'!$D67>0,1,0)","v":0},{"$f":"IF('10'!$D67>0,1,0)","v":0},{"$f":"IF('11'!$D67>0,1,0)","v":0},{"$f":"IF('12'!$D67>0,1,0)","v":0},0,0]
["Schütze 53",{"$f":"IF('Wettkampf 1'!D68>0,1,0)","v":0},{"$f":"IF(Börgermoor!$D68>0,1,0)","v":0},{"$f":"IF('3'!$D68>0,1,0)","v":0},{"$f":"IF('4'!$D68>0,1,0)","v":0},{"$f":"IF('5'!$D68>0,1,0)","v":0},{"$f":"IF('6'!$D68>0,1,0)","v":0},{"$f":"SUM(B67:G67)","v":0},{"$f":"IF('7'!$D68>0,1,0)","v":0},{"$f":"IF('8'!$D68>0,1,0)","v":0},{"$f":"IF('9'!$D68>0,1,0)","v":0},{"$f":"IF('10'!$D68>0,1,0)","v":0},{"$f":"IF('11'!$D68>0,1,0)","v":0},{"$f":"IF('12'!$D68>0,1,0)","v":0},{"$f":"SUM(I67:N67)","v":0},0]
["Schütze 54",{"$f":"IF('Wettkampf 1'!D69>0,1,0)","v":0},{"$f":"IF(Börgermoor!$D69>0,1,0)","v":0},{"$f":"IF('3'!$D69>0,1,0)","v":0},{"$f":"IF('4'!$D69>0,1,0)","v":0},{"$f":"IF('5'!$D69>0,1,0)","v":0},{"$f":"IF('6'!$D69>0,1,0)","v":0},0,{"$f":"IF('7'!$D69>0,1,0)","v":0},{"$f":"IF('8'!$D69>0,1,0)","v":0},{"$f":"IF('9'!$D69>0,1,0)","v":0},{"$f":"IF('10'!$D69>0,1,0)","v":0},{"$f":"IF('11'!$D69>0,1,0)","v":0},{"$f":"IF('12'!$D69>0,1,0)","v":0},0,0]
["Schütze 55",{"$f":"IF('Wettkampf 1'!D70>0,1,0)","v":0},{"$f":"IF(Börgermoor!$D70>0,1,0)","v":0},{"$f":"IF('3'!$D70>0,1,0)","v":0},{"$f":"IF('4'!$D70>0,1,0)","v":0},{"$f":"IF('5'!$D70>0,1,0)","v":0},{"$f":"IF('6'!$D70>0,1,0)","v":0},0,{"$f":"IF('7'!$D70>0,1,0)","v":0},{"$f":"IF('8'!$D70>0,1,0)","v":0},{"$f":"IF('9'!$D70>0,1,0)","v":0},{"$f":"IF('10'!$D70>0,1,0)","v":0},{"$f":"IF('11'!$D70>0,1,0)","v":0},{"$f":"IF('12'!$D70>0,1,0)","v":0},0,0]
["Schütze 56",{"$f":"IF('Wettkampf 1'!D71>0,1,0)","v":0},{"$f":"IF(Börgermoor!$D71>0,1,0)","v":0},{"$f":"IF('3'!$D71>0,1,0)","v":0},{"$f":"IF('4'!$D71>0,1,0)","v":0},{"$f":"IF('5'!$D71>0,1,0)","v":0},{"$f":"IF('6'!$D71>0,1,0)","v":0},0,{"$f":"IF('7'!$D71>0,1,0)","v":0},{"$f":"IF('8'!$D71>0,1,0)","v":0},{"$f":"IF('9'!$D71>0,1,0)","v":0},{"$f":"IF('10'!$D71>0,1,0)","v":0},{"$f":"IF('11'!$D71>0,1,0)","v":0},{"$f":"IF('12'!$D71>0,1,0)","v":0},0,0]
["Schütze 57",{"$f":"IF('Wettkampf 1'!D72>0,1,0)","v":0},{"$f":"IF(Börgermoor!$D72>0,1,0)","v":0},{"$f":"IF('3'!$D72>0,1,0)","v":0},{"$f":"IF('4'!$D72>0,1,0)","v":0},{"$f":"IF('5'!$D72>0,1,0)","v":0},{"$f":"IF('6'!$D72>0,1,0)","v":0},0,{"$f":"IF('7'!$D72>0,1,0)","v":0},{"$f":"IF('8'!$D72>0,1,0)","v":0},{"$f":"IF('9'!$D72>0,1,0)","v":0},{"$f":"IF('10'!$D72>0,1,0)","v":0},{"$f":"IF('11'!$D72>0,1,0)","v":0},{"$f":"IF('12'!$D72>0,1,0)","v":0},0,0]
["Schütze 58",{"$f":"IF('Wettkampf 1'!D73>0,1,0)","v":0},{"$f":"IF(Börgermoor!$D73>0,1,0)","v":0},{"$f":"IF('3'!$D73>0,1,0)","v":0},{"$f":"IF('4'!$D73>0,1,0)","v":0},{"$f":"IF('5'!$D73>0,1,0)","v":0},{"$f":"IF('6'!$D73>0,1,0)","v":0},0,{"$f":"IF('7'!$D73>0,1,0)","v":0},{"$f":"IF('8'!$D73>0,1,0)","v":0},{"$f":"IF('9'!$D73>0,1,0)","v":0},{"$f":"IF('10'!$D73>0,1,0)","v":0},{"$f":"IF('11'!$D73>0,1,0)","v":0},{"$f":"IF('12'!$D73>0,1,0)","v":0},0,0]
["Schütze 59",{"$f":"IF('Wettkampf 1'!D74>0,1,0)","v":0},{"$f":"IF(Börgermoor!$D74>0,1,0)","v":0},{"$f":"IF('3'!$D74>0,1,0)","v":0},{"$f":"IF('4'!$D74>0,1,0)","v":0},{"$f":"IF('5'!$D74>0,1,0)","v":0},{"$f":"IF('6'!$D74>0,1,0)","v":0},0,{"$f":"IF('7'!$D74>0,1,0)","v":0},{"$f":"IF('8'!$D74>0,1,0)","v":0},{"$f":"IF('9'!$D74>0,1,0)","v":0},{"$f":"IF('10'!$D74>0,1,0)","v":0},{"$f":"IF('11'!$D74>0,1,0)","v":0},{"$f":"IF('12'!$D74>0,1,0)","v":0},0,0]
["Schütze 60",{"$f":"IF('Wettkampf 1'!D75>0,1,0)","v":0},{"$f":"IF(Börgermoor!$D75>0,1,0)","v":0},{"$f":"IF('3'!$D75>0,1,0)","v":0},{"$f":"IF('4'!$D75>0,1,0)","v":0},{"$f":"IF('5'!$D75>0,1,0)","v":0},{"$f":"IF('6'!$D75>0,1,0)","v":0},0,{"$f":"IF('7'!$D75>0,1,0)","v":0},{"$f":"IF('8'!$D75>0,1,0)","v":0},{"$f":"IF('9'!$D75>0,1,0)","v":0},{"$f":"IF('10'!$D75>0,1,0)","v":0},{"$f":"IF('11'!$D75>0,1,0)","v":0},{"$f":"IF('12'!$D75>0,1,0)","v":0},0,0]
[null,{"$f":"SUM(B15:B74)","v":{"v":18,"d":"18.00"}},{"$f":"SUM(C15:C74)","v":{"v":17,"d":"17.00"}},{"v":18,"d":"18.00"},{"v":17,"d":"17.00"},{"v":0,"d":"0.00"},{"v":0,"d":"0.00"},{"$f":"SUM(H15:H74)","v":{"v":70,"d":"70.00"}},{"$f":"SUM(I15:I74)","v":{"v":16,"d":"16.00"}},{"$f":"SUM(J15:J74)","v":{"v":20,"d":"20.00"}},{"$f":"SUM(K15:K74)","v":{"v":19,"d":"19.00"}},{"$f":"SUM(L15:L74)","v":{"v":19,"d":"19.00"}},{"$f":"SUM(M15:M74)","v":{"v":18,"d":"18.00"}},{"$f":"SUM(N15:N74)","v":{"v":0,"d":"0.00"}},{"$f":"SUM(O15:O74)","v":{"v":92,"d":"92.00"}},{"$f":"SUM(P15:P74)","v":{"v":162,"d":"162.00"}}]

{"sheet":"Übersicht Gruppen","index":17,"n_rows":13,"n_cols":20,"rows_kept":13,"hidden":true}
[]
[null,"Lähden",{"$f":"VLOOKUP($B$2:$B$13,'Wettkampf 1'!$B$2:$D$13,3,FALSE)","v":{"v":565,"d":"565.0"}},{"$f":"VLOOKUP($B$2:$B$13,Börgermoor!$B$2:$D$19,3,FALSE)","v":545.3},{"$f":"VLOOKUP($B$2:$B$13,'3'!$B$2:$D$19,3,FALSE)","v":564.7},{"$f":"VLOOKUP($B$2:$B$13,'4'!$B$2:$D$19,3,FALSE)","v":539.2},{"$f":"VLOOKUP($B$2:$B$13,'5'!$B$2:$D$19,3,FALSE)","v":{"v":0,"d":"0.0"}},{"$f":"VLOOKUP($B$2:$B$13,'6'!$B$2:$D$19,3,FALSE)","v":{"v":0,"d":"0.0"}},{"$f":"IF(VLOOKUP($B$2:$B$13,Formelhilfe!$A$2:$H$13,8,FALSE) > 0, J2/VLOOKUP($B$2:$B$13,Formelhilfe!$A$2:$H$13,8,FALSE), 0)","v":{"v":553.55,"d":"553.6"}},{"$f":"SUM(C2:H2)","v":{"v":2214.2,"d":"2,214.2"}},{"$f":"VLOOKUP($B$2:$B$13,'7'!$B$2:$D$19,3,FALSE)","v":563.6},{"$f":"VLOOKUP($B$2:$B$13,'8'!$B$2:$D$19,3,FALSE)","v":551.9},{"$f":"VLOOKUP($B$2:$B$13,'9'!$B$2:$D$19,3,FALSE)","v":560.7},{"$f":"VLOOKUP($B$2:$B$13,'10'!$B$2:$D$19,3,FALSE)","v":{"v":562,"d":"562.0"}},{"$f":"VLOOKUP($B$2:$B$13,'11'!$B$2:$D$19,3,FALSE)","v":{"v":559.5999999999999,"d":"559.6"}},{"$f":"VLOOKUP($B$2:$B$13,'12'!$B$2:$D$19,3,FALSE)","v":{"v":0,"d":"0.0"}},{"$f":"IF(VLOOKUP($B$2:$B$13,Formelhilfe!$A$2:$O$13,15,FALSE)>0,R2/VLOOKUP($B$2:$B$13,Formelhilfe!$A$2:$O$13,15,FALSE),0)","v":{"v":559.56,"d":"559.6"}},{"$f":"SUM(K2:P2)","v":{"v":2797.7999999999997,"d":"2,797.8"}},{"$f":"IF(VLOOKUP($B$2:$B$13,Formelhilfe!$A$2:$P$13,16,FALSE)>0,T2/VLOOKUP($B$2:$B$13,Formelhilfe!$A$2:$P$13,16,FALSE),0)","v":{"v":556.8888888888889,"d":"556.9"}},{"$f":"SUM(C2:H2,K2:P2)","v":{"v":5012,"d":"5,012.0"}}]
[null,"Esterwegen",{"$f":"VLOOKUP($B$2:$B$13,'Wettkampf 1'!$B$2:$D$13,3,FALSE)","v":519.5},{"$f":"VLOOKUP($B$2:$B$13,Börgermoor!$B$2:$D$19,3,FALSE)","v":478.6},{"$f":"VLOOKUP($B$2:$B$13,'3'!$B$2:$D$19,3,FALSE)","v":{"v":515,"d":"515.0"}},{"$f":"VLOOKUP($B$2:$B$13,'4'!$B$2:$D$19,3,FALSE)","v":492.8},{"$f":"VLOOKUP($B$2:$B$13,'5'!$B$2:$D$19,3,FALSE)","v":{"v":0,"d":"0.0"}},{"$f":"VLOOKUP($B$2:$B$13,'6'!$B$2:$D$19,3,FALSE)","v":{"v":0,"d":"0.0"}},{"$f":"IF(VLOOKUP($B$2:$B$13,Formelhilfe!$A$2:$H$13,8,FALSE) > 0, J3/VLOOKUP($B$2:$B$13,Formelhilfe!$A$2:$H$13,8,FALSE), 0)","v":{"v":501.47499999999997,"d":"501.5"}},{"$f":"SUM(C3:H3)","v":{"v":2005.8999999999999,"d":"2,005.9"}},{"$f":"VLOOKUP($B$2:$B$13,'7'!$B$2:$D$19,3,FALSE)","v":522.2},{"$f":"VLOOKUP($B$2:$B$13,'8'!$B$2:$D$19,3,FALSE)","v":522.9},{"$f":"VLOOKUP($B$2:$B$13,'9'!$B$2:$D$19,3,FALSE)","v":490.7},{"$f":"VLOOKUP($B$2:$B$13,'10'!$B$2:$D$19,3,FALSE)","v":508.3},{"$f":"VLOOKUP($B$2:$B$13,'11'!$B$2:$D$19,3,FALSE)","v":{"v":508,"d":"508.0"}},{"$f":"VLOOKUP($B$2:$B$13,'12'!$B$2:$D$19,3,FALSE)","v":{"v":0,"d":"0.0"}},{"$f":"IF(VLOOKUP($B$2:$B$13,Formelhilfe!$A$2:$O$13,15,FALSE)>0,R3/VLOOKUP($B$2:$B$13,Formelhilfe!$A$2:$O$13,15,FALSE),0)","v":{"v":510.41999999999996,"d":"510.4"}},{"$f":"SUM(K3:P3)","v":{"v":2552.1,"d":"2,552.1"}},{"$f":"IF(VLOOKUP($B$2:$B$13,Formelhilfe!$A$2:$P$13,16,FALSE)>0,T3/VLOOKUP($B$2:$B$13,Formelhilfe!$A$2:$P$13,16,FALSE),0)","v":{"v":506.44444444444446,"d":"506.4"}},{"$f":"SUM(C3:H3,K3:P3)","v":{"v":4558,"d":"4,558.0"}}]
[null,"Lorup",{"$f":"VLOOKUP($B$2:$B$13,'Wettkampf 1'!$B$2:$D$13,3,FALSE)","v":{"v":394.90000000000003,"d":"394.9"}},{"$f":"VLOOKUP($B$2:$B$13,Börgermoor!$B$2:$D$19,3,FALSE)","v":404.5},{"$f":"VLOOKUP($B$2:$B$13,'3'!$B$2:$D$19,3,FALSE)","v":436.5},{"$f":"VLOOKUP($B$2:$B$13,'4'!$B$2:$D$19,3,FALSE)","v":443.2},{"$f":"VLOOKUP($B$2:$B$13,'5'!$B$2:$D$19,3,FALSE)","v":{"v":0,"d":"0.0"}},{"$f":"VLOOKUP($B$2:$B$13,'6'!$B$2:$D$19,3,FALSE)","v":{"v":0,"d":"0.0"}},{"$f":"IF(VLOOKUP($B$2:$B$13,Formelhilfe!$A$2:$H$13,8,FALSE) > 0, J4/VLOOKUP($B$2:$B$13,Formelhilfe!$A$2:$H$13,8,FALSE), 0)","v":{"v":419.77500000000003,"d":"419.8"}},{"$f":"SUM(C4:H4)","v":{"v":1679.1000000000001,"d":"1,679.1"}},{"$f":"VLOOKUP($B$2:$B$13,'7'!$B$2:$D$19,3,FALSE)","v":{"v":425.40000000000003,"d":"425.4"}},{"$f":"VLOOKUP($B$2:$B$13,'8'!$B$2:$D$19,3,FALSE)","v":{"v":444.20000000000005,"d":"444.2"}},{"$f":"VLOOKUP($B$2:$B$13,'9'!$B$2:$D$19,3,FALSE)","v":507.7},{"$f":"VLOOKUP($B$2:$B$13,'10'!$B$2:$D$19,3,FALSE)","v":{"v":458,"d":"458.0"}},{"$f":"VLOOKUP($B$2:$B$13,'11'!$B$2:$D$19,3,FALSE)","v":500.4},{"$f":"VLOOKUP($B$2:$B$13,'12'!$B$2:$D$19,3,FALSE)","v":{"v":0,"d":"0.0"}},{"$f":"IF(VLOOKUP($B$2:$B$13,Formelhilfe!$A$2:$O$13,15,FALSE)>0,R4/VLOOKUP($B$2:$B$13,Formelhilfe!$A$2:$O$13,15,FALSE),0)","v":{"v":467.14000000000004,"d":"467.1"}},{"$f":"SUM(K4:P4)","v":{"v":2335.7000000000003,"d":"2,335.7"}},{"$f":"IF(VLOOKUP($B$2:$B$13,Formelhilfe!$A$2:$P$13,16,FALSE)>0,T4/VLOOKUP($B$2:$B$13,Formelhilfe!$A$2:$P$13,16,FALSE),0)","v":{"v":446.08888888888885,"d":"446.1"}},{"$f":"SUM(C4:H4,K4:P4)","v":{"v":4014.7999999999997,"d":"4,014.8"}}]
[null,"Spahnharenstätte",{"$f":"VLOOKUP($B$2:$B$13,'Wettkampf 1'!$B$2:$D$13,3,FALSE)","v":318.6},{"$f":"VLOOKUP($B$2:$B$13,Börgermoor!$B$2:$D$19,3,FALSE)","v":{"v":349.09999999999997,"d":"349.1"}},{"$f":"VLOOKUP($B$2:$B$13,'3'!$B$2:$D$19,3,FALSE)","v":263.5},{"$f":"VLOOKUP($B$2:$B$13,'4'!$B$2:$D$19,3,FALSE)","v":344.4},{"$f":"VLOOKUP($B$2:$B$13,'5'!$B$2:$D$19,3,FALSE)","v":{"v":0,"d":"0.0"}},{"$f":"VLOOKUP($B$2:$B$13,'6'!$B$2:$D$19,3,FALSE)","v":{"v":0,"d":"0.0"}},{"$f":"IF(VLOOKUP($B$2:$B$13,Formelhilfe!$A$2:$H$13,8,FALSE) > 0, J5/VLOOKUP($B$2:$B$13,Formelhilfe!$A$2:$H$13,8,FALSE), 0)","v":318.9},{"$f":"SUM(C5:H5)","v":{"v":1275.6,"d":"1,275.6"}},{"$f":"VLOOKUP($B$2:$B$13,'7'!$B$2:$D$19,3,FALSE)","v":225.8},{"$f":"VLOOKUP($B$2:$B$13,'8'!$B$2:$D$19,3,FALSE)","v":361.5},{"$f":"VLOOKUP($B$2:$B$13,'9'!$B$2:$D$19,3,FALSE)","v":372.1},{"$f":"VLOOKUP($B$2:$B$13,'10'!$B$2:$D$19,3,FALSE)","v":248.5},{"$f":"VLOOKUP($B$2:$B$13,'11'!$B$2:$D$19,3,FALSE)","v":294.7},{"$f":"VLOOKUP($B$2:$B$13,'12'!$B$2:$D$19,3,FALSE)","v":{"v":0,"d":"0.0"}},{"$f":"IF(VLOOKUP($B$2:$B$13,Formelhilfe!$A$2:$O$13,15,FALSE)>0,R5/VLOOKUP($B$2:$B$13,Formelhilfe!$A$2:$O$13,15,FALSE),0)","v":{"v":300.52000000000004,"d":"300.5"}},{"$f":"SUM(K5:P5)","v":{"v":1502.6000000000001,"d":"1,502.6"}},{"$f":"IF(VLOOKUP($B$2:$B$13,Formelhilfe!$A$2:$P$13,16,FALSE)>0,T5/VLOOKUP($B$2:$B$13,Formelhilfe!$A$2:$P$13,16,FALSE),0)","v":{"v":308.68888888888887,"d":"308.7"}},{"$f":"SUM(C5:H5,K5:P5)","v":{"v":2778.2,"d":"2,778.2"}}]
[null,"Börgermoor",{"$f":"VLOOKUP($B$2:$B$13,'Wettkampf 1'!$B$2:$D$13,3,FALSE)","v":183.4},{"$f":"VLOOKUP($B$2:$B$13,Börgermoor!$B$2:$D$19,3,FALSE)","v":{"v":201.10000000000002,"d":"201.1"}},{"$f":"VLOOKUP($B$2:$B$13,'3'!$B$2:$D$19,3,FALSE)","v":227.3},{"$f":"VLOOKUP($B$2:$B$13,'4'!$B$2:$D$19,3,FALSE)","v":134.2},{"$f":"VLOOKUP($B$2:$B$13,'5'!$B$2:$D$19,3,FALSE)","v":{"v":0,"d":"0.0"}},{"$f":"VLOOKUP($B$2:$B$13,'6'!$B$2:$D$19,3,FALSE)","v":{"v":0,"d":"0.0"}},{"$f":"IF(VLOOKUP($B$2:$B$13,Formelhilfe!$A$2:$H$13,8,FALSE) > 0, J6/VLOOKUP($B$2:$B$13,Formelhilfe!$A$2:$H$13,8,FALSE), 0)","v":186.5},{"$f":"SUM(C6:H6)","v":{"v":746,"d":"746.0"}},{"$f":"VLOOKUP($B$2:$B$13,'7'!$B$2:$D$19,3,FALSE)","v":{"v":0,"d":"0.0"}},{"$f":"VLOOKUP($B$2:$B$13,'8'!$B$2:$D$19,3,FALSE)","v":145.7},{"$f":"VLOOKUP($B$2:$B$13,'9'!$B$2:$D$19,3,FALSE)","v":175.5},{"$f":"VLOOKUP($B$2:$B$13,'10'!$B$2:$D$19,3,FALSE)","v":137.2},{"$f":"VLOOKUP($B$2:$B$13,'11'!$B$2:$D$19,3,FALSE)","v":160.3},{"$f":"VLOOKUP($B$2:$B$13,'12'!$B$2:$D$19,3,FALSE)","v":{"v":0,"d":"0.0"}},{"$f":"IF(VLOOKUP($B$2:$B$13,Formelhilfe!$A$2:$O$13,15,FALSE)>0,R6/VLOOKUP($B$2:$B$13,Formelhilfe!$A$2:$O$13,15,FALSE),0)","v":{"v":154.675,"d":"154.7"}},{"$f":"SUM(K6:P6)","v":618.7},{"$f":"IF(VLOOKUP($B$2:$B$13,Formelhilfe!$A$2:$P$13,16,FALSE)>0,T6/VLOOKUP($B$2:$B$13,Formelhilfe!$A$2:$P$13,16,FALSE),0)","v":{"v":170.5875,"d":"170.6"}},{"$f":"SUM(C6:H6,K6:P6)","v":{"v":1364.7,"d":"1,364.7"}}]
[null,"Sögel",{"$f":"VLOOKUP($B$2:$B$13,'Wettkampf 1'!$B$2:$D$13,3,FALSE)","v":{"v":0,"d":"0.0"}},{"$f":"VLOOKUP($B$2:$B$13,Börgermoor!$B$2:$D$19,3,FALSE)","v":{"v":0,"d":"0.0"}},{"$f":"VLOOKUP($B$2:$B$13,'3'!$B$2:$D$19,3,FALSE)","v":{"v":0,"d":"0.0"}},{"$f":"VLOOKUP($B$2:$B$13,'4'!$B$2:$D$19,3,FALSE)","v":{"v":0,"d":"0.0"}},{"$f":"VLOOKUP($B$2:$B$13,'5'!$B$2:$D$19,3,FALSE)","v":{"v":0,"d":"0.0"}},{"$f":"VLOOKUP($B$2:$B$13,'6'!$B$2:$D$19,3,FALSE)","v":{"v":0,"d":"0.0"}},{"$f":"IF(VLOOKUP($B$2:$B$13,Formelhilfe!$A$2:$H$13,8,FALSE) > 0, J7/VLOOKUP($B$2:$B$13,Formelhilfe!$A$2:$H$13,8,FALSE), 0)","v":{"v":0,"d":"0.0"}},{"$f":"SUM(C7:H7)","v":{"v":0,"d":"0.0"}},{"$f":"VLOOKUP($B$2:$B$13,'7'!$B$2:$D$19,3,FALSE)","v":{"v":0,"d":"0.0"}},{"$f":"VLOOKUP($B$2:$B$13,'8'!$B$2:$D$19,3,FALSE)","v":{"v":0,"d":"0.0"}},{"$f":"VLOOKUP($B$2:$B$13,'9'!$B$2:$D$19,3,FALSE)","v":{"v":0,"d":"0.0"}},{"$f":"VLOOKUP($B$2:$B$13,'10'!$B$2:$D$19,3,FALSE)","v":{"v":0,"d":"0.0"}},{"$f":"VLOOKUP($B$2:$B$13,'11'!$B$2:$D$19,3,FALSE)","v":{"v":0,"d":"0.0"}},{"$f":"VLOOKUP($B$2:$B$13,'12'!$B$2:$D$19,3,FALSE)","v":{"v":0,"d":"0.0"}},{"$f":"IF(VLOOKUP($B$2:$B$13,Formelhilfe!$A$2:$O$13,15,FALSE)>0,R7/VLOOKUP($B$2:$B$13,Formelhilfe!$A$2:$O$13,15,FALSE),0)","v":{"v":0,"d":"0.0"}},{"$f":"SUM(K7:P7)","v":{"v":0,"d":"0.0"}},{"$f":"IF(VLOOKUP($B$2:$B$13,Formelhilfe!$A$2:$P$13,16,FALSE)>0,T7/VLOOKUP($B$2:$B$13,Formelhilfe!$A$2:$P$13,16,FALSE),0)","v":{"v":0,"d":"0.0"}},{"$f":"SUM(C7:H7,K7:P7)","v":{"v":0,"d":"0.0"}}]
[null,"Verein VII",{"$f":"VLOOKUP($B$2:$B$13,'Wettkampf 1'!$B$2:$D$13,3,FALSE)","v":{"v":0,"d":"0.0"}},{"$f":"VLOOKUP($B$2:$B$13,Börgermoor!$B$2:$D$19,3,FALSE)","v":{"v":0,"d":"0.0"}},{"$f":"VLOOKUP($B$2:$B$13,'3'!$B$2:$D$19,3,FALSE)","v":{"v":0,"d":"0.0"}},{"$f":"VLOOKUP($B$2:$B$13,'4'!$B$2:$D$19,3,FALSE)","v":{"v":0,"d":"0.0"}},{"$f":"VLOOKUP($B$2:$B$13,'5'!$B$2:$D$19,3,FALSE)","v":{"v":0,"d":"0.0"}},{"$f":"VLOOKUP($B$2:$B$13,'6'!$B$2:$D$19,3,FALSE)","v":{"v":0,"d":"0.0"}},{"$f":"IF(VLOOKUP($B$2:$B$13,Formelhilfe!$A$2:$H$13,8,FALSE) > 0, J8/VLOOKUP($B$2:$B$13,Formelhilfe!$A$2:$H$13,8,FALSE), 0)","v":{"v":0,"d":"0.0"}},{"$f":"SUM(C8:H8)","v":{"v":0,"d":"0.0"}},{"$f":"VLOOKUP($B$2:$B$13,'7'!$B$2:$D$19,3,FALSE)","v":{"v":0,"d":"0.0"}},{"$f":"VLOOKUP($B$2:$B$13,'8'!$B$2:$D$19,3,FALSE)","v":{"v":0,"d":"0.0"}},{"$f":"VLOOKUP($B$2:$B$13,'9'!$B$2:$D$19,3,FALSE)","v":{"v":0,"d":"0.0"}},{"$f":"VLOOKUP($B$2:$B$13,'10'!$B$2:$D$19,3,FALSE)","v":{"v":0,"d":"0.0"}},{"$f":"VLOOKUP($B$2:$B$13,'11'!$B$2:$D$19,3,FALSE)","v":{"v":0,"d":"0.0"}},{"$f":"VLOOKUP($B$2:$B$13,'12'!$B$2:$D$19,3,FALSE)","v":{"v":0,"d":"0.0"}},{"$f":"IF(VLOOKUP($B$2:$B$13,Formelhilfe!$A$2:$O$13,15,FALSE)>0,R8/VLOOKUP($B$2:$B$13,Formelhilfe!$A$2:$O$13,15,FALSE),0)","v":{"v":0,"d":"0.0"}},{"$f":"SUM(K8:P8)","v":{"v":0,"d":"0.0"}},{"$f":"IF(VLOOKUP($B$2:$B$13,Formelhilfe!$A$2:$P$13,16,FALSE)>0,T8/VLOOKUP($B$2:$B$13,Formelhilfe!$A$2:$P$13,16,FALSE),0)","v":{"v":0,"d":"0.0"}},{"$f":"SUM(C8:H8,K8:P8)","v":{"v":0,"d":"0.0"}}]
[null,"Verein VIII",{"$f":"VLOOKUP($B$2:$B$13,'Wettkampf 1'!$B$2:$D$13,3,FALSE)","v":{"v":0,"d":"0.0"}},{"$f":"VLOOKUP($B$2:$B$13,Börgermoor!$B$2:$D$19,3,FALSE)","v":{"v":0,"d":"0.0"}},{"$f":"VLOOKUP($B$2:$B$13,'3'!$B$2:$D$19,3,FALSE)","v":{"v":0,"d":"0.0"}},{"$f":"VLOOKUP($B$2:$B$13,'4'!$B$2:$D$19,3,FALSE)","v":{"v":0,"d":"0.0"}},{"$f":"VLOOKUP($B$2:$B$13,'5'!$B$2:$D$19,3,FALSE)","v":{"v":0,"d":"0.0"}},{"$f":"VLOOKUP($B$2:$B$13,'6'!$B$2:$D$19,3,FALSE)","v":{"v":0,"d":"0.0"}},{"$f":"IF(VLOOKUP($B$2:$B$13,Formelhilfe!$A$2:$H$13,8,FALSE) > 0, J9/VLOOKUP($B$2:$B$13,Formelhilfe!$A$2:$H$13,8,FALSE), 0)","v":{"v":0,"d":"0.0"}},{"$f":"SUM(C9:H9)","v":{"v":0,"d":"0.0"}},{"$f":"VLOOKUP($B$2:$B$13,'7'!$B$2:$D$19,3,FALSE)","v":{"v":0,"d":"0.0"}},{"$f":"VLOOKUP($B$2:$B$13,'8'!$B$2:$D$19,3,FALSE)","v":{"v":0,"d":"0.0"}},{"$f":"VLOOKUP($B$2:$B$13,'9'!$B$2:$D$19,3,FALSE)","v":{"v":0,"d":"0.0"}},{"$f":"VLOOKUP($B$2:$B$13,'10'!$B$2:$D$19,3,FALSE)","v":{"v":0,"d":"0.0"}},{"$f":"VLOOKUP($B$2:$B$13,'11'!$B$2:$D$19,3,FALSE)","v":{"v":0,"d":"0.0"}},{"$f":"VLOOKUP($B$2:$B$13,'12'!$B$2:$D$19,3,FALSE)","v":{"v":0,"d":"0.0"}},{"$f":"IF(VLOOKUP($B$2:$B$13,Formelhilfe!$A$2:$O$13,15,FALSE)>0,R9/VLOOKUP($B$2:$B$13,Formelhilfe!$A$2:$O$13,15,FALSE),0)","v":{"v":0,"d":"0.0"}},{"$f":"SUM(K9:P9)","v":{"v":0,"d":"0.0"}},{"$f":"IF(VLOOKUP($B$2:$B$13,Formelhilfe!$A$2:$P$13,16,FALSE)>0,T9/VLOOKUP($B$2:$B$13,Formelhilfe!$A$2:$P$13,16,FALSE),0)","v":{"v":0,"d":"0.0"}},{"$f":"SUM(C9:H9,K9:P9)","v":{"v":0,"d":"0.0"}}]
[null,"Verein IX",{"$f":"VLOOKUP($B$2:$B$13,'Wettkampf 1'!$B$2:$D$13,3,FALSE)","v":{"v":0,"d":"0.0"}},{"$f":"VLOOKUP($B$2:$B$13,Börgermoor!$B$2:$D$19,3,FALSE)","v":{"v":0,"d":"0.0"}},{"$f":"VLOOKUP($B$2:$B$13,'3'!$B$2:$D$19,3,FALSE)","v":{"v":0,"d":"0.0"}},{"$f":"VLOOKUP($B$2:$B$13,'4'!$B$2:$D$19,3,FALSE)","v":{"v":0,"d":"0.0"}},{"$f":"VLOOKUP($B$2:$B$13,'5'!$B$2:$D$19,3,FALSE)","v":{"v":0,"d":"0.0"}},{"$f":"VLOOKUP($B$2:$B$13,'6'!$B$2:$D$19,3,FALSE)","v":{"v":0,"d":"0.0"}},{"$f":"IF(VLOOKUP($B$2:$B$13,Formelhilfe!$A$2:$H$13,8,FALSE) > 0, J10/VLOOKUP($B$2:$B$13,Formelhilfe!$A$2:$H$13,8,FALSE), 0)","v":{"v":0,"d":"0.0"}},{"$f":"SUM(C10:H10)","v":{"v":0,"d":"0.0"}},{"$f":"VLOOKUP($B$2:$B$13,'7'!$B$2:$D$19,3,FALSE)","v":{"v":0,"d":"0.0"}},{"$f":"VLOOKUP($B$2:$B$13,'8'!$B$2:$D$19,3,FALSE)","v":{"v":0,"d":"0.0"}},{"$f":"VLOOKUP($B$2:$B$13,'9'!$B$2:$D$19,3,FALSE)","v":{"v":0,"d":"0.0"}},{"$f":"VLOOKUP($B$2:$B$13,'10'!$B$2:$D$19,3,FALSE)","v":{"v":0,"d":"0.0"}},{"$f":"VLOOKUP($B$2:$B$13,'11'!$B$2:$D$19,3,FALSE)","v":{"v":0,"d":"0.0"}},{"$f":"VLOOKUP($B$2:$B$13,'12'!$B$2:$D$19,3,FALSE)","v":{"v":0,"d":"0.0"}},{"$f":"IF(VLOOKUP($B$2:$B$13,Formelhilfe!$A$2:$O$13,15,FALSE)>0,R10/VLOOKUP($B$2:$B$13,Formelhilfe!$A$2:$O$13,15,FALSE),0)","v":{"v":0,"d":"0.0"}},{"$f":"SUM(K10:P10)","v":{"v":0,"d":"0.0"}},{"$f":"IF(VLOOKUP($B$2:$B$13,Formelhilfe!$A$2:$P$13,16,FALSE)>0,T10/VLOOKUP($B$2:$B$13,Formelhilfe!$A$2:$P$13,16,FALSE),0)","v":{"v":0,"d":"0.0"}},{"$f":"SUM(C10:H10,K10:P10)","v":{"v":0,"d":"0.0"}}]
[null,"Verein X",{"$f":"VLOOKUP($B$2:$B$13,'Wettkampf 1'!$B$2:$D$13,3,FALSE)","v":{"v":0,"d":"0.0"}},{"$f":"VLOOKUP($B$2:$B$13,Börgermoor!$B$2:$D$19,3,FALSE)","v":{"v":0,"d":"0.0"}},{"$f":"VLOOKUP($B$2:$B$13,'3'!$B$2:$D$19,3,FALSE)","v":{"v":0,"d":"0.0"}},{"$f":"VLOOKUP($B$2:$B$13,'4'!$B$2:$D$19,3,FALSE)","v":{"v":0,"d":"0.0"}},{"$f":"VLOOKUP($B$2:$B$13,'5'!$B$2:$D$19,3,FALSE)","v":{"v":0,"d":"0.0"}},{"$f":"VLOOKUP($B$2:$B$13,'6'!$B$2:$D$19,3,FALSE)","v":{"v":0,"d":"0.0"}},{"$f":"IF(VLOOKUP($B$2:$B$13,Formelhilfe!$A$2:$H$13,8,FALSE) > 0, J11/VLOOKUP($B$2:$B$13,Formelhilfe!$A$2:$H$13,8,FALSE), 0)","v":{"v":0,"d":"0.0"}},{"$f":"SUM(C11:H11)","v":{"v":0,"d":"0.0"}},{"$f":"VLOOKUP($B$2:$B$13,'7'!$B$2:$D$19,3,FALSE)","v":{"v":0,"d":"0.0"}},{"$f":"VLOOKUP($B$2:$B$13,'8'!$B$2:$D$19,3,FALSE)","v":{"v":0,"d":"0.0"}},{"$f":"VLOOKUP($B$2:$B$13,'9'!$B$2:$D$19,3,FALSE)","v":{"v":0,"d":"0.0"}},{"$f":"VLOOKUP($B$2:$B$13,'10'!$B$2:$D$19,3,FALSE)","v":{"v":0,"d":"0.0"}},{"$f":"VLOOKUP($B$2:$B$13,'11'!$B$2:$D$19,3,FALSE)","v":{"v":0,"d":"0.0"}},{"$f":"VLOOKUP($B$2:$B$13,'12'!$B$2:$D$19,3,FALSE)","v":{"v":0,"d":"0.0"}},{"$f":"IF(VLOOKUP($B$2:$B$13,Formelhilfe!$A$2:$O$13,15,FALSE)>0,R11/VLOOKUP($B$2:$B$13,Formelhilfe!$A$2:$O$13,15,FALSE),0)","v":{"v":0,"d":"0.0"}},{"$f":"SUM(K11:P11)","v":{"v":0,"d":"0.0"}},{"$f":"IF(VLOOKUP($B$2:$B$13,Formelhilfe!$A$2:$P$13,16,FALSE)>0,T11/VLOOKUP($B$2:$B$13,Formelhilfe!$A$2:$P$13,16,FALSE),0)","v":{"v":0,"d":"0.0"}},{"$f":"SUM(C11:H11,K11:P11)","v":{"v":0,"d":"0.0"}}]
[null,"Verein XI",{"$f":"VLOOKUP($B$2:$B$13,'Wettkampf 1'!$B$2:$D$13,3,FALSE)","v":{"v":0,"d":"0.0"}},{"$f":"VLOOKUP($B$2:$B$13,Börgermoor!$B$2:$D$19,3,FALSE)","v":{"v":0,"d":"0.0"}},{"$f":"VLOOKUP($B$2:$B$13,'3'!$B$2:$D$19,3,FALSE)","v":{"v":0,"d":"0.0"}},{"$f":"VLOOKUP($B$2:$B$13,'4'!$B$2:$D$19,3,FALSE)","v":{"v":0,"d":"0.0"}},{"$f":"VLOOKUP($B$2:$B$13,'5'!$B$2:$D$19,3,FALSE)","v":{"v":0,"d":"0.0"}},{"$f":"VLOOKUP($B$2:$B$13,'6'!$B$2:$D$19,3,FALSE)","v":{"v":0,"d":"0.0"}},{"$f":"IF(VLOOKUP($B$2:$B$13,Formelhilfe!$A$2:$H$13,8,FALSE) > 0, J12/VLOOKUP($B$2:$B$13,Formelhilfe!$A$2:$H$13,8,FALSE), 0)","v":{"v":0,"d":"0.0"}},{"$f":"SUM(C12:H12)","v":{"v":0,"d":"0.0"}},{"$f":"VLOOKUP($B$2:$B$13,'7'!$B$2:$D$19,3,FALSE)","v":{"v":0,"d":"0.0"}},{"$f":"VLOOKUP($B$2:$B$13,'8'!$B$2:$D$19,3,FALSE)","v":{"v":0,"d":"0.0"}},{"$f":"VLOOKUP($B$2:$B$13,'9'!$B$2:$D$19,3,FALSE)","v":{"v":0,"d":"0.0"}},{"$f":"VLOOKUP($B$2:$B$13,'10'!$B$2:$D$19,3,FALSE)","v":{"v":0,"d":"0.0"}},{"$f":"VLOOKUP($B$2:$B$13,'11'!$B$2:$D$19,3,FALSE)","v":{"v":0,"d":"0.0"}},{"$f":"VLOOKUP($B$2:$B$13,'12'!$B$2:$D$19,3,FALSE)","v":{"v":0,"d":"0.0"}},{"$f":"IF(VLOOKUP($B$2:$B$13,Formelhilfe!$A$2:$O$13,15,FALSE)>0,R12/VLOOKUP($B$2:$B$13,Formelhilfe!$A$2:$O$13,15,FALSE),0)","v":{"v":0,"d":"0.0"}},{"$f":"SUM(K12:P12)","v":{"v":0,"d":"0.0"}},{"$f":"IF(VLOOKUP($B$2:$B$13,Formelhilfe!$A$2:$P$13,16,FALSE)>0,T12/VLOOKUP($B$2:$B$13,Formelhilfe!$A$2:$P$13,16,FALSE),0)","v":{"v":0,"d":"0.0"}},{"$f":"SUM(C12:H12,K12:P12)","v":{"v":0,"d":"0.0"}}]
[null,"Verein XII",{"$f":"VLOOKUP($B$2:$B$13,'Wettkampf 1'!$B$2:$D$13,3,FALSE)","v":{"v":0,"d":"0.0"}},{"$f":"VLOOKUP($B$2:$B$13,Börgermoor!$B$2:$D$19,3,FALSE)","v":{"v":0,"d":"0.0"}},{"$f":"VLOOKUP($B$2:$B$13,'3'!$B$2:$D$19,3,FALSE)","v":{"v":0,"d":"0.0"}},{"$f":"VLOOKUP($B$2:$B$13,'4'!$B$2:$D$19,3,FALSE)","v":{"v":0,"d":"0.0"}},{"$f":"VLOOKUP($B$2:$B$13,'5'!$B$2:$D$19,3,FALSE)","v":{"v":0,"d":"0.0"}},{"$f":"VLOOKUP($B$2:$B$13,'6'!$B$2:$D$19,3,FALSE)","v":{"v":0,"d":"0.0"}},{"$f":"IF(VLOOKUP($B$2:$B$13,Formelhilfe!$A$2:$H$13,8,FALSE) > 0, J13/VLOOKUP($B$2:$B$13,Formelhilfe!$A$2:$H$13,8,FALSE), 0)","v":{"v":0,"d":"0.0"}},{"$f":"SUM(C13:H13)","v":{"v":0,"d":"0.0"}},{"$f":"VLOOKUP($B$2:$B$13,'7'!$B$2:$D$19,3,FALSE)","v":{"v":0,"d":"0.0"}},{"$f":"VLOOKUP($B$2:$B$13,'8'!$B$2:$D$19,3,FALSE)","v":{"v":0,"d":"0.0"}},{"$f":"VLOOKUP($B$2:$B$13,'9'!$B$2:$D$19,3,FALSE)","v":{"v":0,"d":"0.0"}},{"$f":"VLOOKUP($B$2:$B$13,'10'!$B$2:$D$19,3,FALSE)","v":{"v":0,"d":"0.0"}},{"$f":"VLOOKUP($B$2:$B$13,'11'!$B$2:$D$19,3,FALSE)","v":{"v":0,"d":"0.0"}},{"$f":"VLOOKUP($B$2:$B$13,'12'!$B$2:$D$19,3,FALSE)","v":{"v":0,"d":"0.0"}},{"$f":"IF(VLOOKUP($B$2:$B$13,Formelhilfe!$A$2:$O$13,15,FALSE)>0,R13/VLOOKUP($B$2:$B$13,Formelhilfe!$A$2:$O$13,15,FALSE),0)","v":{"v":0,"d":"0.0"}},{"$f":"SUM(K13:P13)","v":{"v":0,"d":"0.0"}},{"$f":"IF(VLOOKUP($B$2:$B$13,Formelhilfe!$A$2:$P$13,16,FALSE)>0,T13/VLOOKUP($B$2:$B$13,Formelhilfe!$A$2:$P$13,16,FALSE),0)","v":{"v":0,"d":"0.0"}},{"$f":"SUM(C13:H13,K13:P13)","v":{"v":0,"d":"0.0"}}]