{"text_format":"3","workbook":"xlsx","n_sheets":18,"sheets":["Übersicht","Wettkampf 1","2","3","4","5","6","7","8","9","10","11","12","Ausdruck","Ausdruck blank","Übersicht Schützen","Formelhilfe","Übersicht Gruppen"],"not_rendered":{"images":2,"macros":1,"defined_names":12},"read":"whole","date_system":"1900"}

{"sheet":"Übersicht","index":0,"n_rows":84,"n_cols":22,"rows_kept":84,"merged":[[0,10,0,11],[0,12,0,14],[0,15,0,16],[2,9,2,10],[2,17,2,18],[2,19,2,20],[3,1,3,2],[3,21,5,21],[5,1,5,2],[6,1,6,2],[7,1,7,2],[8,1,8,2],[9,1,9,2],[10,1,10,2],[11,1,11,2],[12,1,12,2],[13,1,13,2],[14,1,14,2],[15,1,15,2],[16,1,16,2],[20,9,20,10],[20,17,20,18],[20,19,20,20],[20,21,22,21]]}
[{"$nulls":3},"Kreisrundenwettkampf",{"$nulls":5},"Saison","2024/2025",{"$nulls":4},"Jugend"]
[]
[null,null,"Wettkampftag:","07.09.","28.09.","19.10.","16.11.","30.11.",null,"Hinrunde",null,"11.01.","01.02.","22.02.","15.03.",null,null,"Rückrunde",null,"Serie komplett"]
["Pos.","Verein / Gruppe",null,"Lorup","Spahnharrenstätte","Breddenberg","Börgerwald","Neubörger",null,"Schnitt","Gesamt ","Börgermoor","Lähden","Esterwegen","Lahn",null,null,"Schnitt","Gesamt ","Schnitt","Gesamt","Differenz"]
[]
[1,{"$f":"'Übersicht Gruppen'!B2","v":"Lähden Jugend I"},null,{"$f":"'Übersicht Gruppen'!C2","v":{"v":1059.8000000000002,"d":"1059.8"}},{"$f":"'Übersicht Gruppen'!D2","v":741.5},{"$f":"'Übersicht Gruppen'!E2","v":{"v":1080.1999999999998,"d":"1080.2"}},{"$f":"'Übersicht Gruppen'!F2","v":1132.2},{"$f":"'Übersicht Gruppen'!G2","v":1120.3},{"$f":"'Übersicht Gruppen'!H2","v":{"v":0,"d":"0.0"}},{"$f":"'Übersicht Gruppen'!I2","v":{"v":1026.8,"d":"1026.80"}},{"$f":"SUM(D6:I6)","v":{"v":5134,"d":"5,134.0"}},{"$f":"'Übersicht Gruppen'!K2","v":1158.4},{"$f":"'Übersicht Gruppen'!L2","v":{"v":1134.1999999999998,"d":"1134.2"}},{"$f":"'Übersicht Gruppen'!M2","v":{"v":0,"d":"0.0"}},{"$f":"'Übersicht Gruppen'!N2","v":{"v":0,"d":"0.0"}},{"$f":"'Übersicht Gruppen'!O2","v":{"v":0,"d":"0.0"}},{"$f":"'Übersicht Gruppen'!P2","v":{"v":0,"d":"0.0"}},{"$f":"'Übersicht Gruppen'!Q2","v":{"v":1146.3,"d":"1146.30"}},{"$f":"SUM(L6:Q6)","v":{"v":2292.6,"d":"2,292.6"}},{"$f":"'Übersicht Gruppen'!S2","v":{"v":1060.942857142857,"d":"1060.94"}},{"$f":"SUM(S6+K6)","v":{"v":7426.6,"d":"7,426.6"}}]
[2,{"$f":"'Übersicht Gruppen'!B3","v":"Börgermoor"},null,{"$f":"'Übersicht Gruppen'!C3","v":955.5},{"$f":"'Übersicht Gruppen'!D3","v":1003.7},{"$f":"'Übersicht Gruppen'!E3","v":{"v":930.8000000000001,"d":"930.8"}},{"$f":"'Übersicht Gruppen'!F3","v":{"v":1014.1000000000001,"d":"1014.1"}},{"$f":"'Übersicht Gruppen'!G3","v":1015.3},{"$f":"'Übersicht Gruppen'!H3","v":{"v":0,"d":"0.0"}},{"$f":"'Übersicht Gruppen'!I3","v":{"v":983.8800000000001,"d":"983.88"}},{"v":4919.400000000001,"d":"4,919.4"},{"$f":"'Übersicht Gruppen'!K3","v":{"v":1018.5999999999999,"d":"1018.6"}},{"$f":"'Übersicht Gruppen'!L3","v":{"v":1010,"d":"1010.0"}},{"$f":"'Übersicht Gruppen'!M3","v":{"v":0,"d":"0.0"}},{"$f":"'Übersicht Gruppen'!N3","v":{"v":0,"d":"0.0"}},{"$f":"'Übersicht Gruppen'!O3","v":{"v":0,"d":"0.0"}},{"$f":"'Übersicht Gruppen'!P3","v":{"v":0,"d":"0.0"}},{"$f":"'Übersicht Gruppen'!Q3","v":{"v":1014.3,"d":"1014.30"}},{"v":2028.6,"d":"2,028.6"},{"$f":"'Übersicht Gruppen'!S3","v":{"v":992.5714285714286,"d":"992.57"}},{"$f":"SUM(S7+K7)","v":{"v":6948,"d":"6,948.0"}},{"$f":"(U6-U7)*-1","v":{"v":-478.60000000000036,"d":"-478.6"}}]
[3,{"$f":"'Übersicht Gruppen'!B4","v":"Spahnharrenstätte"},null,{"$f":"'Übersicht Gruppen'!C4","v":613.5},{"$f":"'Übersicht Gruppen'!D4","v":274.1},{"$f":"'Übersicht Gruppen'!E4","v":307.4},{"$f":"'Übersicht Gruppen'!F4","v":674.1},{"$f":"'Übersicht Gruppen'!G4","v":795.4},{"$f":"'Übersicht Gruppen'!H4","v":{"v":0,"d":"0.0"}},{"$f":"'Übersicht Gruppen'!I4","v":{"v":666.125,"d":"666.13"}},{"v":2664.5,"d":"2,664.5"},{"$f":"'Übersicht Gruppen'!K4","v":319.5},{"$f":"'Übersicht Gruppen'!L4","v":336.5},{"$f":"'Übersicht Gruppen'!M4","v":{"v":0,"d":"0.0"}},{"$f":"'Übersicht Gruppen'!N4","v":{"v":0,"d":"0.0"}},{"$f":"'Übersicht Gruppen'!O4","v":{"v":0,"d":"0.0"}},{"$f":"'Übersicht Gruppen'!P4","v":{"v":0,"d":"0.0"}},{"$f":"'Übersicht Gruppen'!Q4","v":{"v":0,"d":"0.00"}},{"v":656,"d":"656.0"},{"$f":"'Übersicht Gruppen'!S4","v":{"v":830.125,"d":"830.13"}},{"v":3320.5,"d":"3,320.5"},{"$f":"(U7-U8)*-1","v":{"v":-3627.5,"d":"-3,627.5"}}]
[4,{"$f":"'Übersicht Gruppen'!B5","v":"Lahn"},null,{"$f":"'Übersicht Gruppen'!C5","v":{"v":305,"d":"305.0"}},{"$f":"'Übersicht Gruppen'!D5","v":590.1},{"$f":"'Übersicht Gruppen'!E5","v":553.5},{"$f":"'Übersicht Gruppen'!F5","v":{"v":563,"d":"563.0"}},{"$f":"'Übersicht Gruppen'!G5","v":284.7},{"$f":"'Übersicht Gruppen'!H5","v":{"v":0,"d":"0.0"}},{"$f":"'Übersicht Gruppen'!I5","v":{"v":1148.1499999999999,"d":"1148.15"}},{"v":2296.2999999999997,"d":"2,296.3"},{"$f":"'Übersicht Gruppen'!K5","v":464.9},{"$f":"'Übersicht Gruppen'!L5","v":{"v":491,"d":"491.0"}},{"$f":"'Übersicht Gruppen'!M5","v":{"v":0,"d":"0.0"}},{"$f":"'Übersicht Gruppen'!N5","v":{"v":0,"d":"0.0"}},{"$f":"'Übersicht Gruppen'!O5","v":{"v":0,"d":"0.0"}},{"$f":"'Übersicht Gruppen'!P5","v":{"v":0,"d":"0.0"}},{"$f":"'Übersicht Gruppen'!Q5","v":{"v":0,"d":"0.00"}},955.9,{"$f":"'Übersicht Gruppen'!S5","v":{"v":1626.1,"d":"1626.10"}},{"v":3252.2,"d":"3,252.2"},{"v":-68.30000000000018,"d":"-68.3"}]
[5,{"$f":"'Übersicht Gruppen'!B6","v":"Börgerwald"},null,{"$f":"'Übersicht Gruppen'!C6","v":{"v":674,"d":"674.0"}},{"$f":"'Übersicht Gruppen'!D6","v":319.9},{"$f":"'Übersicht Gruppen'!E6","v":650.2},{"$f":"'Übersicht Gruppen'!F6","v":1042.5},{"$f":"'Übersicht Gruppen'!G6","v":{"v":0,"d":"0.0"}},{"$f":"'Übersicht Gruppen'!H6","v":{"v":0,"d":"0.0"}},{"$f":"'Übersicht Gruppen'!I6","v":671.65},{"v":2686.6,"d":"2,686.6"},{"$f":"'Übersicht Gruppen'!K6","v":{"v":0,"d":"0.0"}},{"$f":"'Übersicht Gruppen'!L6","v":{"v":0,"d":"0.0"}},{"$f":"'Übersicht Gruppen'!M6","v":{"v":0,"d":"0.0"}},{"$f":"'Übersicht Gruppen'!N6","v":{"v":0,"d":"0.0"}},{"$f":"'Übersicht Gruppen'!O6","v":{"v":0,"d":"0.0"}},{"$f":"'Übersicht Gruppen'!P6","v":{"v":0,"d":"0.0"}},{"$f":"'Übersicht Gruppen'!Q6","v":{"v":0,"d":"0.00"}},{"v":0,"d":"0.0"},{"$f":"'Übersicht Gruppen'!S6","v":{"v":537.3199999999999,"d":"537.32"}},{"v":2686.6,"d":"2,686.6"},{"v":-565.5999999999999,"d":"-565.6"}]
[6,{"$f":"'Übersicht Gruppen'!B7","v":"Esterwegen"},null,{"$f":"'Übersicht Gruppen'!C7","v":200.6},{"$f":"'Übersicht Gruppen'!D7","v":224.4},{"$f":"'Übersicht Gruppen'!E7","v":{"v":0,"d":"0.0"}},{"$f":"'Übersicht Gruppen'!F7","v":294.1},{"$f":"'Übersicht Gruppen'!G7","v":289.8},{"$f":"'Übersicht Gruppen'!H7","v":{"v":0,"d":"0.0"}},{"$f":"'Übersicht Gruppen'!I8","v":{"v":0,"d":"0.00"}},{"v":1008.9000000000001,"d":"1,008.9"},{"$f":"'Übersicht Gruppen'!K7","v":279.9},{"$f":"'Übersicht Gruppen'!L7","v":{"v":0,"d":"0.0"}},{"$f":"'Übersicht Gruppen'!M7","v":{"v":0,"d":"0.0"}},{"$f":"'Übersicht Gruppen'!N7","v":{"v":0,"d":"0.0"}},{"$f":"'Übersicht Gruppen'!O7","v":{"v":0,"d":"0.0"}},{"$f":"'Übersicht Gruppen'!P7","v":{"v":0,"d":"0.0"}},{"$f":"'Übersicht Gruppen'!Q7","v":139.95},279.9,{"$f":"'Übersicht Gruppen'!S7","v":{"v":184.11428571428573,"d":"184.11"}},{"v":1288.8000000000002,"d":"1,288.8"},{"v":-1397.7999999999997,"d":"-1,397.8"}]
[7,{"$f":"'Übersicht Gruppen'!B8","v":"Lorup"},null,{"$f":"'Übersicht Gruppen'!C8","v":274.7},{"$f":"'Übersicht Gruppen'!D8","v":{"v":0,"d":"0.0"}},{"$f":"'Übersicht Gruppen'!E8","v":{"v":0,"d":"0.0"}},{"$f":"'Übersicht Gruppen'!F8","v":287.1},{"$f":"'Übersicht Gruppen'!G8","v":{"v":0,"d":"0.0"}},{"$f":"'Übersicht Gruppen'!H8","v":{"v":0,"d":"0.0"}},{"$f":"'Übersicht Gruppen'!I9","v":71.62},561.8,{"$f":"'Übersicht Gruppen'!K8","v":{"v":0,"d":"0.0"}},{"$f":"'Übersicht Gruppen'!L8","v":{"v":0,"d":"0.0"}},{"$f":"'Übersicht Gruppen'!M8","v":{"v":0,"d":"0.0"}},{"$f":"'Übersicht Gruppen'!N8","v":{"v":0,"d":"0.0"}},{"$f":"'Übersicht Gruppen'!O8","v":{"v":0,"d":"0.0"}},{"$f":"'Übersicht Gruppen'!P8","v":{"v":0,"d":"0.0"}},{"$f":"'Übersicht Gruppen'!Q8","v":{"v":0,"d":"0.00"}},{"v":0,"d":"0.0"},{"$f":"'Übersicht Gruppen'!S8","v":{"v":0,"d":"0.00"}},561.8,{"v":-727.0000000000002,"d":"-727.0"}]
[8,{"$f":"'Übersicht Gruppen'!B9","v":"Sögel"},null,{"$f":"'Übersicht Gruppen'!C9","v":{"v":0,"d":"0.0"}},{"$f":"'Übersicht Gruppen'!D9","v":{"v":0,"d":"0.0"}},{"$f":"'Übersicht Gruppen'!E9","v":{"v":0,"d":"0.0"}},{"$f":"'Übersicht Gruppen'!F9","v":358.1},{"$f":"'Übersicht Gruppen'!G9","v":{"v":0,"d":"0.0"}},{"$f":"'Übersicht Gruppen'!H9","v":{"v":0,"d":"0.0"}},{"$f":"'Übersicht Gruppen'!I10","v":{"v":0,"d":"0.00"}},358.1,{"$f":"'Übersicht Gruppen'!K9","v":{"v":0,"d":"0.0"}},{"$f":"'Übersicht Gruppen'!L9","v":{"v":0,"d":"0.0"}},{"$f":"'Übersicht Gruppen'!M9","v":{"v":0,"d":"0.0"}},{"$f":"'Übersicht Gruppen'!N9","v":{"v":0,"d":"0.0"}},{"$f":"'Übersicht Gruppen'!O9","v":{"v":0,"d":"0.0"}},{"$f":"'Übersicht Gruppen'!P9","v":{"v":0,"d":"0.0"}},{"$f":"'Übersicht Gruppen'!Q9","v":{"v":0,"d":"0.00"}},{"v":0,"d":"0.0"},{"$f":"'Übersicht Gruppen'!S9","v":{"v":51.15714285714286,"d":"51.16"}},358.1,{"v":-203.69999999999993,"d":"-203.7"}]
[9,{"$f":"'Übersicht Gruppen'!B10","v":"Verein IX"},null,{"$f":"'Übersicht Gruppen'!C10","v":{"v":0,"d":"0.0"}},{"$f":"'Übersicht Gruppen'!D10","v":{"v":0,"d":"0.0"}},{"$f":"'Übersicht Gruppen'!E10","v":{"v":0,"d":"0.0"}},{"$f":"'Übersicht Gruppen'!F10","v":{"v":0,"d":"0.0"}},{"$f":"'Übersicht Gruppen'!G10","v":{"v":0,"d":"0.0"}},{"$f":"'Übersicht Gruppen'!H10","v":{"v":0,"d":"0.0"}},{"$f":"'Übersicht Gruppen'!I11","v":{"v":0,"d":"0.00"}},{"v":0,"d":"0.0"},{"$f":"'Übersicht Gruppen'!K10","v":{"v":0,"d":"0.0"}},{"$f":"'Übersicht Gruppen'!L10","v":{"v":0,"d":"0.0"}},{"$f":"'Übersicht Gruppen'!M10","v":{"v":0,"d":"0.0"}},{"$f":"'Übersicht Gruppen'!N10","v":{"v":0,"d":"0.0"}},{"$f":"'Übersicht Gruppen'!O10","v":{"v":0,"d":"0.0"}},{"$f":"'Übersicht Gruppen'!P10","v":{"v":0,"d":"0.0"}},{"$f":"'Übersicht Gruppen'!Q10","v":{"v":0,"d":"0.00"}},{"v":0,"d":"0.0"},{"$f":"'Übersicht Gruppen'!S10","v":{"v":0,"d":"0.00"}},{"v":0,"d":"0.0"},-358.1]
[10,{"$f":"'Übersicht Gruppen'!B11","v":"Verein X"},null,{"$f":"'Übersicht Gruppen'!C11","v":{"v":0,"d":"0.0"}},{"$f":"'Übersicht Gruppen'!D11","v":{"v":0,"d":"0.0"}},{"$f":"'Übersicht Gruppen'!E11","v":{"v":0,"d":"0.0"}},{"$f":"'Übersicht Gruppen'!F11","v":{"v":0,"d":"0.0"}},{"$f":"'Übersicht Gruppen'!G11","v":{"v":0,"d":"0.0"}},{"$f":"'Übersicht Gruppen'!H11","v":{"v":0,"d":"0.0"}},{"$f":"'Übersicht Gruppen'!I12","v":{"v":0,"d":"0.00"}},{"v":0,"d":"0.0"},{"$f":"'Übersicht Gruppen'!K11","v":{"v":0,"d":"0.0"}},{"$f":"'Übersicht Gruppen'!L11","v":{"v":0,"d":"0.0"}},{"$f":"'Übersicht Gruppen'!M11","v":{"v":0,"d":"0.0"}},{"$f":"'Übersicht Gruppen'!N11","v":{"v":0,"d":"0.0"}},{"$f":"'Übersicht Gruppen'!O11","v":{"v":0,"d":"0.0"}},{"$f":"'Übersicht Gruppen'!P11","v":{"v":0,"d":"0.0"}},{"$f":"'Übersicht Gruppen'!Q11","v":{"v":0,"d":"0.00"}},{"v":0,"d":"0.0"},{"$f":"'Übersicht Gruppen'!S11","v":{"v":0,"d":"0.00"}},{"v":0,"d":"0.0"},{"v":0,"d":"0.0"}]
[11,{"$f":"'Übersicht Gruppen'!B12","v":"Verein XI"},null,{"$f":"'Übersicht Gruppen'!C12","v":{"v":0,"d":"0.0"}},{"$f":"'Übersicht Gruppen'!D12","v":{"v":0,"d":"0.0"}},{"$f":"'Übersicht Gruppen'!E12","v":{"v":0,"d":"0.0"}},{"$f":"'Übersicht Gruppen'!F12","v":{"v":0,"d":"0.0"}},{"$f":"'Übersicht Gruppen'!G12","v":{"v":0,"d":"0.0"}},{"$f":"'Übersicht Gruppen'!H12","v":{"v":0,"d":"0.0"}},{"$f":"'Übersicht Gruppen'!I13","v":{"v":0,"d":"0.00"}},{"v":0,"d":"0.0"},{"$f":"'Übersicht Gruppen'!K12","v":{"v":0,"d":"0.0"}},{"$f":"'Übersicht Gruppen'!L12","v":{"v":0,"d":"0.0"}},{"$f":"'Übersicht Gruppen'!M12","v":{"v":0,"d":"0.0"}},{"$f":"'Übersicht Gruppen'!N12","v":{"v":0,"d":"0.0"}},{"$f":"'Übersicht Gruppen'!O12","v":{"v":0,"d":"0.0"}},{"$f":"'Übersicht Gruppen'!P12","v":{"v":0,"d":"0.0"}},{"$f":"'Übersicht Gruppen'!Q12","v":{"v":0,"d":"0.00"}},{"v":0,"d":"0.0"},{"$f":"'Übersicht Gruppen'!S12","v":{"v":0,"d":"0.00"}},{"v":0,"d":"0.0"},{"v":0,"d":"0.0"}]
[12,{"$f":"'Übersicht Gruppen'!B13","v":"Verein XII"},null,{"$f":"'Übersicht Gruppen'!C13","v":{"v":0,"d":"0.0"}},{"$f":"'Übersicht Gruppen'!D13","v":{"v":0,"d":"0.0"}},{"$f":"'Übersicht Gruppen'!E13","v":{"v":0,"d":"0.0"}},{"$f":"'Übersicht Gruppen'!F13","v":{"v":0,"d":"0.0"}},{"$f":"'Übersicht Gruppen'!G13","v":{"v":0,"d":"0.0"}},{"$f":"'Übersicht Gruppen'!H13","v":{"v":0,"d":"0.0"}},{"$f":"'Übersicht Gruppen'!I14","v":{"v":0,"d":"0.00"}},{"v":0,"d":"0.0"},{"$f":"'Übersicht Gruppen'!K13","v":{"v":0,"d":"0.0"}},{"$f":"'Übersicht Gruppen'!L13","v":{"v":0,"d":"0.0"}},{"$f":"'Übersicht Gruppen'!M13","v":{"v":0,"d":"0.0"}},{"$f":"'Übersicht Gruppen'!N13","v":{"v":0,"d":"0.0"}},{"$f":"'Übersicht Gruppen'!O13","v":{"v":0,"d":"0.0"}},{"$f":"'Übersicht Gruppen'!P13","v":{"v":0,"d":"0.0"}},{"$f":"'Übersicht Gruppen'!Q13","v":{"v":0,"d":"0.00"}},{"v":0,"d":"0.0"},{"$f":"'Übersicht Gruppen'!S13","v":{"v":0,"d":"0.00"}},{"v":0,"d":"0.0"},{"v":0,"d":"0.0"}]
[]
[null,null,"Schnitt:",{"$f":"AVERAGE(D6:D11)","v":{"v":634.7333333333333,"d":"634.7"}},{"$f":"AVERAGE(E6:E11)","v":{"v":525.6166666666667,"d":"525.6"}},{"v":587.0166666666668,"d":"587.0"},{"v":786.6666666666666,"d":"786.7"},{"v":584.25,"d":"584.3"},{"v":0,"d":"0.0"},{"v":749.4341666666666,"d":"749.43"},{"$f":"SUM(K6:K11)/6","v":{"v":3118.2833333333333,"d":"3,118.3"}},{"v":540.2166666666667,"d":"540.2"},{"v":495.2833333333333,"d":"495.3"},{"v":0,"d":"0.0"},{"v":0,"d":"0.0"},{"v":0,"d":"0.0"},{"v":0,"d":"0.0"},{"v":383.42499999999995,"d":"383.43"},{"v":1035.4999999999998,"d":"1035.5"},{"v":871.8622619047619,"d":"871.86"},{"v":4153.783333333333,"d":"4,153.8"}]
[]
[{"$nulls":9},"Hinrunde",{"$nulls":7},"Rückrunde",null,"Serie komplett",null,"Differenz"]
["Pos.","Vorname Name","Verein / Gruppe",{"$nulls":6},"Schnitt","Gesamt",{"$nulls":6},"Schnitt","Gesamt","Schnitt","Gesamt"]
[1,{"$f":"'Übersicht Schützen'!A2","v":"Strüwing Inja"},{"$f":"'Übersicht Schützen'!B2","v":"Lähden Jugend I"},{"$f":"'Übersicht Schützen'!C2","v":375.8},{"$f":"'Übersicht Schützen'!D2","v":374.1},{"$f":"'Übersicht Schützen'!E2","v":375.9},{"$f":"'Übersicht Schützen'!F2","v":384.1},{"$f":"'Übersicht Schützen'!G2","v":{"v":373,"d":"373.0"}},{"$f":"'Übersicht Schützen'!H2","v":{"v":0,"d":"0.0"}},{"$f":"'Übersicht Schützen'!I2","v":{"v":376.58000000000004,"d":"376.58"}},{"$f":"SUM(D23:I23)","v":{"v":1882.9,"d":"1,882.9"}},{"$f":"'Übersicht Schützen'!L2","v":389.3},{"$f":"'Übersicht Schützen'!M2","v":385.2},{"$f":"'Übersicht Schützen'!N2","v":{"v":0,"d":"0.0"}},{"$f":"'Übersicht Schützen'!O2","v":{"v":0,"d":"0.0"}},{"$f":"'Übersicht Schützen'!P2","v":{"v":0,"d":"0.0"}},{"$f":"'Übersicht Schützen'!Q2","v":{"v":0,"d":"0.0"}},{"$f":"'Übersicht Schützen'!R2","v":387.25},{"$f":"SUM(L23:Q23)","v":774.5},{"$f":"'Übersicht Schützen'!U2","v":{"v":379.62857142857143,"d":"379.63"}},{"$f":"SUM(K23+S23)","v":{"v":2657.4,"d":"2,657.4"}}]
[2,{"$f":"'Übersicht Schützen'!A3","v":"Bruns Hendrik"},{"$f":"'Übersicht Schützen'!B3","v":"Lähden Jugend I"},{"$f":"'Übersicht Schützen'!C3","v":356.9},{"$f":"'Übersicht Schützen'!D3","v":367.4},{"$f":"'Übersicht Schützen'!E3","v":366.2},{"$f":"'Übersicht Schützen'!F3","v":368.6},{"$f":"'Übersicht Schützen'!G3","v":{"v":359,"d":"359.0"}},{"$f":"'Übersicht Schützen'!H3","v":{"v":0,"d":"0.0"}},{"$f":"'Übersicht Schützen'!I3","v":363.62},{"$f":"SUM(D24:I24)","v":{"v":1818.1,"d":"1,818.1"}},{"$f":"'Übersicht Schützen'!L3","v":382.2},{"$f":"'Übersicht Schützen'!M3","v":369.6},{"$f":"'Übersicht Schützen'!N3","v":{"v":0,"d":"0.0"}},{"$f":"'Übersicht Schützen'!O3","v":{"v":0,"d":"0.0"}},{"$f":"'Übersicht Schützen'!P3","v":{"v":0,"d":"0.0"}},{"$f":"'Übersicht Schützen'!Q3","v":{"v":0,"d":"0.0"}},{"$f":"'Übersicht Schützen'!R3","v":{"v":375.9,"d":"375.90"}},{"$f":"SUM(L24:Q24)","v":751.8},{"$f":"'Übersicht Schützen'!U3","v":{"v":367.1285714285714,"d":"367.13"}},{"$f":"SUM(K24+S24)","v":{"v":2569.8999999999996,"d":"2,569.9"}},{"$f":"(U23-U24)*-1","v":{"v":-87.50000000000045,"d":"-87.5"}}]
[3,{"$f":"'Übersicht Schützen'!A4","v":"Brandt Mira"},{"$f":"'Übersicht Schützen'!B4","v":"Börgermoor"},{"$f":"'Übersicht Schützen'!C4","v":352.7},{"$f":"'Übersicht Schützen'!D4","v":354.6},{"$f":"'Übersicht Schützen'!E4","v":331.7},{"$f":"'Übersicht Schützen'!F4","v":355.1},{"$f":"'Übersicht Schützen'!G4","v":364.8},{"$f":"'Übersicht Schützen'!H4","v":{"v":0,"d":"0.0"}},{"$f":"'Übersicht Schützen'!I4","v":351.78},{"$f":"SUM(D25:I25)","v":{"v":1758.8999999999999,"d":"1,758.9"}},{"$f":"'Übersicht Schützen'!L4","v":356.5},{"$f":"'Übersicht Schützen'!M4","v":349.7},{"$f":"'Übersicht Schützen'!N4","v":{"v":0,"d":"0.0"}},{"$f":"'Übersicht Schützen'!O4","v":{"v":0,"d":"0.0"}},{"$f":"'Übersicht Schützen'!P4","v":{"v":0,"d":"0.0"}},{"$f":"'Übersicht Schützen'!Q4","v":{"v":0,"d":"0.0"}},{"$f":"'Übersicht Schützen'!R4","v":{"v":353.1,"d":"353.10"}},706.2,{"$f":"'Übersicht Schützen'!U4","v":{"v":352.1571428571428,"d":"352.16"}},{"v":2465.1,"d":"2,465.1"},{"$f":"(U24-U25)*-1","v":{"v":-104.79999999999973,"d":"-104.8"}}]
[4,{"$f":"'Übersicht Schützen'!A5","v":"Eichhorn Luca"},{"$f":"'Übersicht Schützen'!B5","v":"Börgermoor"},{"$f":"'Übersicht Schützen'!C5","v":298.1},{"$f":"'Übersicht Schützen'!D5","v":315.1},{"$f":"'Übersicht Schützen'!E5","v":285.6},{"$f":"'Übersicht Schützen'!F5","v":340.8},{"$f":"'Übersicht Schützen'!G5","v":333.8},{"$f":"'Übersicht Schützen'!H5","v":{"v":0,"d":"0.0"}},{"$f":"'Übersicht Schützen'!I5","v":314.68},{"v":1573.4,"d":"1,573.4"},{"$f":"'Übersicht Schützen'!L5","v":335.3},{"$f":"'Übersicht Schützen'!M5","v":333.1},{"$f":"'Übersicht Schützen'!N5","v":{"v":0,"d":"0.0"}},{"$f":"'Übersicht Schützen'!O5","v":{"v":0,"d":"0.0"}},{"$f":"'Übersicht Schützen'!P5","v":{"v":0,"d":"0.0"}},{"$f":"'Übersicht Schützen'!Q5","v":{"v":0,"d":"0.0"}},{"$f":"'Übersicht Schützen'!R5","v":{"v":334.20000000000005,"d":"334.20"}},{"v":668.4000000000001,"d":"668.4"},{"$f":"'Übersicht Schützen'!U5","v":{"v":320.25714285714287,"d":"320.26"}},{"v":2241.8,"d":"2,241.8"},{"v":-223.29999999999973,"d":"-223.3"}]
[5,{"$f":"'Übersicht Schützen'!A6","v":"Kohnen Saskia"},{"$f":"'Übersicht Schützen'!B6","v":"Börgermoor"},{"$f":"'Übersicht Schützen'!C6","v":304.7},{"$f":"'Übersicht Schützen'!D6","v":{"v":334,"d":"334.0"}},{"$f":"'Übersicht Schützen'!E6","v":313.5},{"$f":"'Übersicht Schützen'!F6","v":318.2},{"$f":"'Übersicht Schützen'!G6","v":316.7},{"$f":"'Übersicht Schützen'!H6","v":{"v":0,"d":"0.0"}},{"$f":"'Übersicht Schützen'!I6","v":317.42},{"v":1587.1000000000001,"d":"1,587.1"},{"$f":"'Übersicht Schützen'!L6","v":326.8},{"$f":"'Übersicht Schützen'!M6","v":327.2},{"$f":"'Übersicht Schützen'!N6","v":{"v":0,"d":"0.0"}},{"$f":"'Übersicht Schützen'!O6","v":{"v":0,"d":"0.0"}},{"$f":"'Übersicht Schützen'!P6","v":{"v":0,"d":"0.0"}},{"$f":"'Übersicht Schützen'!Q6","v":{"v":0,"d":"0.0"}},{"$f":"'Übersicht Schützen'!R6","v":{"v":327,"d":"327.00"}},{"v":654,"d":"654.0"},{"$f":"'Übersicht Schützen'!U6","v":{"v":320.15714285714284,"d":"320.16"}},{"v":2241.1000000000004,"d":"2,241.1"},{"v":-0.6999999999998181,"d":"-0.7"}]
[6,{"$f":"'Übersicht Schützen'!A7","v":"Wilken Noah"},{"$f":"'Übersicht Schützen'!B7","v":"Lahn"},{"$f":"'Übersicht Schützen'!C7","v":{"v":305,"d":"305.0"}},{"$f":"'Übersicht Schützen'!D7","v":{"v":299,"d":"299.0"}},{"$f":"'Übersicht Schützen'!E7","v":313.6},{"$f":"'Übersicht Schützen'!F7","v":310.5},{"$f":"'Übersicht Schützen'!G7","v":284.7},{"$f":"'Übersicht Schützen'!H7","v":{"v":0,"d":"0.0"}},{"$f":"'Übersicht Schützen'!I7","v":302.56},{"v":1512.8,"d":"1,512.8"},{"$f":"'Übersicht Schützen'!L7","v":290.3},{"$f":"'Übersicht Schützen'!M7","v":287.6},{"$f":"'Übersicht Schützen'!N7","v":{"v":0,"d":"0.0"}},{"$f":"'Übersicht Schützen'!O7","v":{"v":0,"d":"0.0"}},{"$f":"'Übersicht Schützen'!P7","v":{"v":0,"d":"0.0"}},{"$f":"'Übersicht Schützen'!Q7","v":{"v":0,"d":"0.0"}},{"$f":"'Übersicht Schützen'!R7","v":{"v":288.95000000000005,"d":"288.95"}},{"v":577.9000000000001,"d":"577.9"},{"$f":"'Übersicht Schützen'!U7","v":{"v":298.6714285714285,"d":"298.67"}},{"v":2090.7,"d":"2,090.7"},{"v":-150.40000000000055,"d":"-150.4"}]
[7,{"$f":"'Übersicht Schützen'!A8","v":"Runde Marcel"},{"$f":"'Übersicht Schützen'!B8","v":"Spahnharrenstätte"},{"$f":"'Übersicht Schützen'!C8","v":295.5},{"$f":"'Übersicht Schützen'!D8","v":{"v":0,"d":"0.0"}},{"$f":"'Übersicht Schützen'!E8","v":307.4},{"$f":"'Übersicht Schützen'!F8","v":{"v":317,"d":"317.0"}},{"$f":"'Übersicht Schützen'!G8","v":315.8},{"$f":"'Übersicht Schützen'!H8","v":{"v":0,"d":"0.0"}},{"$f":"'Übersicht Schützen'!I8","v":{"v":308.925,"d":"308.93"}},{"v":1235.7,"d":"1,235.7"},{"$f":"'Übersicht Schützen'!L8","v":319.5},{"$f":"'Übersicht Schützen'!M8","v":336.5},{"$f":"'Übersicht Schützen'!N8","v":{"v":0,"d":"0.0"}},{"$f":"'Übersicht Schützen'!O8","v":{"v":0,"d":"0.0"}},{"$f":"'Übersicht Schützen'!P8","v":{"v":0,"d":"0.0"}},{"$f":"'Übersicht Schützen'!Q8","v":{"v":0,"d":"0.0"}},{"$f":"'Übersicht Schützen'!R8","v":{"v":328,"d":"328.00"}},{"v":656,"d":"656.0"},{"$f":"'Übersicht Schützen'!U8","v":{"v":315.28333333333336,"d":"315.28"}},{"v":1891.7,"d":"1,891.7"},{"v":-198.99999999999977,"d":"-199.0"}]
[8,{"$f":"'Übersicht Schützen'!A9","v":"Feldhaus Celien "},{"$f":"'Übersicht Schützen'!B9","v":"Lähden Jugend I"},{"$f":"'Übersicht Schützen'!C9","v":327.1},{"$f":"'Übersicht Schützen'!D9","v":{"v":0,"d":"0.0"}},{"$f":"'Übersicht Schützen'!E9","v":338.1},{"$f":"'Übersicht Schützen'!F9","v":337.8},{"$f":"'Übersicht Schützen'!G9","v":{"v":0,"d":"0.0"}},{"$f":"'Übersicht Schützen'!H9","v":{"v":0,"d":"0.0"}},{"$f":"'Übersicht Schützen'!I9","v":{"v":334.3333333333333,"d":"334.33"}},{"v":1003,"d":"1,003.0"},{"$f":"'Übersicht Schützen'!L9","v":349.9},{"$f":"'Übersicht Schützen'!M9","v":361.2},{"$f":"'Übersicht Schützen'!N9","v":{"v":0,"d":"0.0"}},{"$f":"'Übersicht Schützen'!O9","v":{"v":0,"d":"0.0"}},{"$f":"'Übersicht Schützen'!P9","v":{"v":0,"d":"0.0"}},{"$f":"'Übersicht Schützen'!Q9","v":{"v":0,"d":"0.0"}},{"$f":"'Übersicht Schützen'!R9","v":{"v":355.54999999999995,"d":"355.55"}},{"v":711.0999999999999,"d":"711.1"},{"$f":"'Übersicht Schützen'!U9","v":{"v":342.82000000000005,"d":"342.82"}},{"v":1714.1,"d":"1,714.1"},{"v":-177.60000000000014,"d":"-177.6"}]
[9,{"$f":"'Übersicht Schützen'!A10","v":"Feldhaus Vanessa"},{"$f":"'Übersicht Schützen'!B10","v":"Lähden Jugend I"},{"$f":"'Übersicht Schützen'!C10","v":301.6},{"$f":"'Übersicht Schützen'!D10","v":{"v":0,"d":"0.0"}},{"$f":"'Übersicht Schützen'!E10","v":320.3},{"$f":"'Übersicht Schützen'!F10","v":{"v":324,"d":"324.0"}},{"$f":"'Übersicht Schützen'!G10","v":{"v":0,"d":"0.0"}},{"$f":"'Übersicht Schützen'!H10","v":{"v":0,"d":"0.0"}},{"$f":"'Übersicht Schützen'!I10","v":{"v":315.3,"d":"315.30"}},{"v":945.9000000000001,"d":"945.9"},{"$f":"'Übersicht Schützen'!L10","v":345.2},{"$f":"'Übersicht Schützen'!M10","v":318.7},{"$f":"'Übersicht Schützen'!N10","v":{"v":0,"d":"0.0"}},{"$f":"'Übersicht Schützen'!O10","v":{"v":0,"d":"0.0"}},{"$f":"'Übersicht Schützen'!P10","v":{"v":0,"d":"0.0"}},{"$f":"'Übersicht Schützen'!Q10","v":{"v":0,"d":"0.0"}},{"$f":"'Übersicht Schützen'!R10","v":331.95},663.9,{"$f":"'Übersicht Schützen'!U10","v":{"v":321.96000000000004,"d":"321.96"}},{"v":1609.8000000000002,"d":"1,609.8"},{"v":-104.29999999999973,"d":"-104.3"}]
[10,{"$f":"'Übersicht Schützen'!A11","v":"Stümpler Jan-Luca"},{"$f":"'Übersicht Schützen'!B11","v":"Lähden Jugend I"},{"$f":"'Übersicht Schützen'!C11","v":{"v":0,"d":"0.0"}},{"$f":"'Übersicht Schützen'!D11","v":{"v":0,"d":"0.0"}},{"$f":"'Übersicht Schützen'!E11","v":{"v":0,"d":"0.0"}},{"$f":"'Übersicht Schützen'!F11","v":379.5},{"$f":"'Übersicht Schützen'!G11","v":388.3},{"$f":"'Übersicht Schützen'!H11","v":{"v":0,"d":"0.0"}},{"$f":"'Übersicht Schützen'!I11","v":{"v":383.9,"d":"383.90"}},767.8,{"$f":"'Übersicht Schützen'!L11","v":386.9},{"$f":"'Übersicht Schützen'!M11","v":379.4},{"$f":"'Übersicht Schützen'!N11","v":{"v":0,"d":"0.0"}},{"$f":"'Übersicht Schützen'!O11","v":{"v":0,"d":"0.0"}},{"$f":"'Übersicht Schützen'!P11","v":{"v":0,"d":"0.0"}},{"$f":"'Übersicht Schützen'!Q11","v":{"v":0,"d":"0.0"}},{"$f":"'Übersicht Schützen'!R11","v":383.15},766.3,{"$f":"'Übersicht Schützen'!U11","v":{"v":383.525,"d":"383.53"}},{"v":1534.1,"d":"1,534.1"},{"v":-75.70000000000027,"d":"-75.7"}]
[11,{"$f":"'Übersicht Schützen'!A12","v":"Gedecksnis Stefan"},{"$f":"'Übersicht Schützen'!B12","v":"Esterwegen"},{"$f":"'Übersicht Schützen'!C12","v":200.6},{"$f":"'Übersicht Schützen'!D12","v":224.4},{"$f":"'Übersicht Schützen'!E12","v":{"v":0,"d":"0.0"}},{"$f":"'Übersicht Schützen'!F12","v":294.1},{"$f":"'Übersicht Schützen'!G12","v":289.8},{"$f":"'Übersicht Schützen'!H12","v":{"v":0,"d":"0.0"}},{"$f":"'Übersicht Schützen'!I12","v":{"v":252.22500000000002,"d":"252.23"}},{"v":1008.9000000000001,"d":"1,008.9"},{"$f":"'Übersicht Schützen'!L12","v":279.9},{"$f":"'Übersicht Schützen'!M12","v":{"v":0,"d":"0.0"}},{"$f":"'Übersicht Schützen'!N12","v":{"v":0,"d":"0.0"}},{"$f":"'Übersicht Schützen'!O12","v":{"v":0,"d":"0.0"}},{"$f":"'Übersicht Schützen'!P12","v":{"v":0,"d":"0.0"}},{"$f":"'Übersicht Schützen'!Q12","v":{"v":0,"d":"0.0"}},{"$f":"'Übersicht Schützen'!R12","v":{"v":279.9,"d":"279.90"}},279.9,{"$f":"'Übersicht Schützen'!U12","v":{"v":257.76000000000005,"d":"257.76"}},{"v":1288.8000000000002,"d":"1,288.8"},{"v":-245.29999999999973,"d":"-245.3"}]
[12,{"$f":"'Übersicht Schützen'!A13","v":"Hanneken Maren"},{"$f":"'Übersicht Schützen'!B13","v":"Börgerwald"},{"$f":"'Übersicht Schützen'!C13","v":{"v":321,"d":"321.0"}},{"$f":"'Übersicht Schützen'!D13","v":319.9},{"$f":"'Übersicht Schützen'!E13","v":296.3},{"$f":"'Übersicht Schützen'!F13","v":{"v":331,"d":"331.0"}},{"$f":"'Übersicht Schützen'!G13","v":{"v":0,"d":"0.0"}},{"$f":"'Übersicht Schützen'!H13","v":{"v":0,"d":"0.0"}},{"$f":"'Übersicht Schützen'!I13","v":317.05},{"v":1268.2,"d":"1,268.2"},{"$f":"'Übersicht Schützen'!L13","v":{"v":0,"d":"0.0"}},{"$f":"'Übersicht Schützen'!M13","v":{"v":0,"d":"0.0"}},{"$f":"'Übersicht Schützen'!N13","v":{"v":0,"d":"0.0"}},{"$f":"'Übersicht Schützen'!O13","v":{"v":0,"d":"0.0"}},{"$f":"'Übersicht Schützen'!P13","v":{"v":0,"d":"0.0"}},{"$f":"'Übersicht Schützen'!Q13","v":{"v":0,"d":"0.0"}},{"$f":"'Übersicht Schützen'!R13","v":{"v":0,"d":"0.00"}},{"v":0,"d":"0.0"},{"$f":"'Übersicht Schützen'!U13","v":317.05},{"v":1268.2,"d":"1,268.2"},{"v":-20.600000000000136,"d":"-20.6"}]
[13,{"$f":"'Übersicht Schützen'!A14","v":"Schulz Mika"},{"$f":"'Übersicht Schützen'!B14","v":"Lahn"},{"$f":"'Übersicht Schützen'!C14","v":{"v":0,"d":"0.0"}},{"$f":"'Übersicht Schützen'!D14","v":291.1},{"$f":"'Übersicht Schützen'!E14","v":239.9},{"$f":"'Übersicht Schützen'!F14","v":252.5},{"$f":"'Übersicht Schützen'!G14","v":{"v":0,"d":"0.0"}},{"$f":"'Übersicht Schützen'!H14","v":{"v":0,"d":"0.0"}},{"$f":"'Übersicht Schützen'!I14","v":{"v":261.1666666666667,"d":"261.17"}},783.5,{"$f":"'Übersicht Schützen'!L14","v":174.6},{"$f":"'Übersicht Schützen'!M14","v":203.4},{"$f":"'Übersicht Schützen'!N14","v":{"v":0,"d":"0.0"}},{"$f":"'Übersicht Schützen'!O14","v":{"v":0,"d":"0.0"}},{"$f":"'Übersicht Schützen'!P14","v":{"v":0,"d":"0.0"}},{"$f":"'Übersicht Schützen'!Q14","v":{"v":0,"d":"0.0"}},{"$f":"'Übersicht Schützen'!R14","v":{"v":189,"d":"189.00"}},{"v":378,"d":"378.0"},{"$f":"'Übersicht Schützen'!U14","v":{"v":232.3,"d":"232.30"}},{"v":1161.5,"d":"1,161.5"},{"v":-106.70000000000005,"d":"-106.7"}]
[14,{"$f":"'Übersicht Schützen'!A15","v":"Jansen Lars"},{"$f":"'Übersicht Schützen'!B15","v":"Spahnharrenstätte"},{"$f":"'Übersicht Schützen'!C15","v":234.2},{"$f":"'Übersicht Schützen'!D15","v":274.1},{"$f":"'Übersicht Schützen'!E15","v":{"v":0,"d":"0.0"}},{"$f":"'Übersicht Schützen'!F15","v":224.5},{"$f":"'Übersicht Schützen'!G15","v":255.6},{"$f":"'Übersicht Schützen'!H15","v":{"v":0,"d":"0.0"}},{"$f":"'Übersicht Schützen'!I15","v":{"v":247.1,"d":"247.10"}},988.4,{"$f":"'Übersicht Schützen'!L15","v":{"v":0,"d":"0.0"}},{"$f":"'Übersicht Schützen'!M15","v":{"v":0,"d":"0.0"}},{"$f":"'Übersicht Schützen'!N15","v":{"v":0,"d":"0.0"}},{"$f":"'Übersicht Schützen'!O15","v":{"v":0,"d":"0.0"}},{"$f":"'Übersicht Schützen'!P15","v":{"v":0,"d":"0.0"}},{"$f":"'Übersicht Schützen'!Q15","v":{"v":0,"d":"0.0"}},{"$f":"'Übersicht Schützen'!R15","v":{"v":0,"d":"0.00"}},{"v":0,"d":"0.0"},{"$f":"'Übersicht Schützen'!U15","v":{"v":247.1,"d":"247.10"}},988.4,{"v":-173.10000000000002,"d":"-173.1"}]
[15,{"$f":"'Übersicht Schützen'!A16","v":"Lohmann Amy"},{"$f":"'Übersicht Schützen'!B16","v":"Börgerwald"},{"$f":"'Übersicht Schützen'!C16","v":{"v":0,"d":"0.0"}},{"$f":"'Übersicht Schützen'!D16","v":{"v":0,"d":"0.0"}},{"$f":"'Übersicht Schützen'!E16","v":353.9},{"$f":"'Übersicht Schützen'!F16","v":{"v":366,"d":"366.0"}},{"$f":"'Übersicht Schützen'!G16","v":{"v":0,"d":"0.0"}},{"$f":"'Übersicht Schützen'!H16","v":{"v":0,"d":"0.0"}},{"$f":"'Übersicht Schützen'!I16","v":359.95},719.9,{"$f":"'Übersicht Schützen'!L16","v":{"v":0,"d":"0.0"}},{"$f":"'Übersicht Schützen'!M16","v":{"v":0,"d":"0.0"}},{"$f":"'Übersicht Schützen'!N16","v":{"v":0,"d":"0.0"}},{"$f":"'Übersicht Schützen'!O16","v":{"v":0,"d":"0.0"}},{"$f":"'Übersicht Schützen'!P16","v":{"v":0,"d":"0.0"}},{"$f":"'Übersicht Schützen'!Q16","v":{"v":0,"d":"0.0"}},{"$f":"'Übersicht Schützen'!R16","v":{"v":0,"d":"0.00"}},{"v":0,"d":"0.0"},{"$f":"'Übersicht Schützen'!U16","v":359.95},719.9,-268.5]
[16,{"$f":"'Übersicht Schützen'!A17","v":"Köstering Nele"},{"$f":"'Übersicht Schützen'!B17","v":"Börgerwald"},{"$f":"'Übersicht Schützen'!C17","v":{"v":353,"d":"353.0"}},{"$f":"'Übersicht Schützen'!D17","v":{"v":0,"d":"0.0"}},{"$f":"'Übersicht Schützen'!E17","v":{"v":0,"d":"0.0"}},{"$f":"'Übersicht Schützen'!F17","v":345.5},{"$f":"'Übersicht Schützen'!G17","v":{"v":0,"d":"0.0"}},{"$f":"'Übersicht Schützen'!H17","v":{"v":0,"d":"0.0"}},{"$f":"'Übersicht Schützen'!I17","v":349.25},698.5,{"$f":"'Übersicht Schützen'!L17","v":{"v":0,"d":"0.0"}},{"$f":"'Übersicht Schützen'!M17","v":{"v":0,"d":"0.0"}},{"$f":"'Übersicht Schützen'!N17","v":{"v":0,"d":"0.0"}},{"$f":"'Übersicht Schützen'!O17","v":{"v":0,"d":"0.0"}},{"$f":"'Übersicht Schützen'!P17","v":{"v":0,"d":"0.0"}},{"$f":"'Übersicht Schützen'!Q17","v":{"v":0,"d":"0.0"}},{"$f":"'Übersicht Schützen'!R17","v":{"v":0,"d":"0.00"}},{"v":0,"d":"0.0"},{"$f":"'Übersicht Schützen'!U17","v":349.25},698.5,{"v":-21.399999999999977,"d":"-21.4"}]
[17,{"$f":"'Übersicht Schützen'!A18","v":"Dolling Leon"},{"$f":"'Übersicht Schützen'!B18","v":"Lorup"},{"$f":"'Übersicht Schützen'!C18","v":274.7},{"$f":"'Übersicht Schützen'!D18","v":{"v":0,"d":"0.0"}},{"$f":"'Übersicht Schützen'!E18","v":{"v":0,"d":"0.0"}},{"$f":"'Übersicht Schützen'!F18","v":287.1},{"$f":"'Übersicht Schützen'!G18","v":{"v":0,"d":"0.0"}},{"$f":"'Übersicht Schützen'!H18","v":{"v":0,"d":"0.0"}},{"$f":"'Übersicht Schützen'!I18","v":{"v":280.9,"d":"280.90"}},561.8,{"$f":"'Übersicht Schützen'!L18","v":{"v":0,"d":"0.0"}},{"$f":"'Übersicht Schützen'!M18","v":{"v":0,"d":"0.0"}},{"$f":"'Übersicht Schützen'!N18","v":{"v":0,"d":"0.0"}},{"$f":"'Übersicht Schützen'!O18","v":{"v":0,"d":"0.0"}},{"$f":"'Übersicht Schützen'!P18","v":{"v":0,"d":"0.0"}},{"$f":"'Übersicht Schützen'!Q18","v":{"v":0,"d":"0.0"}},{"$f":"'Übersicht Schützen'!R18","v":{"v":0,"d":"0.00"}},{"v":0,"d":"0.0"},{"$f":"'Übersicht Schützen'!U18","v":{"v":280.9,"d":"280.90"}},561.8,{"v":-136.70000000000005,"d":"-136.7"}]
[18,{"$f":"'Übersicht Schützen'!A19","v":"Tharner Kim"},{"$f":"'Übersicht Schützen'!B19","v":"Sögel"},{"$f":"'Übersicht Schützen'!C19","v":{"v":0,"d":"0.0"}},{"$f":"'Übersicht Schützen'!D19","v":{"v":0,"d":"0.0"}},{"$f":"'Übersicht Schützen'!E19","v":{"v":0,"d":"0.0"}},{"$f":"'Übersicht Schützen'!F19","v":358.1},{"$f":"'Übersicht Schützen'!G19","v":{"v":0,"d":"0.0"}},{"$f":"'Übersicht Schützen'!H19","v":{"v":0,"d":"0.0"}},{"$f":"'Übersicht Schützen'!I19","v":{"v":358.1,"d":"358.10"}},358.1,{"$f":"'Übersicht Schützen'!L19","v":{"v":0,"d":"0.0"}},{"$f":"'Übersicht Schützen'!M19","v":{"v":0,"d":"0.0"}},{"$f":"'Übersicht Schützen'!N19","v":{"v":0,"d":"0.0"}},{"$f":"'Übersicht Schützen'!O19","v":{"v":0,"d":"0.0"}},{"$f":"'Übersicht Schützen'!P19","v":{"v":0,"d":"0.0"}},{"$f":"'Übersicht Schützen'!Q19","v":{"v":0,"d":"0.0"}},{"$f":"'Übersicht Schützen'!R19","v":{"v":0,"d":"0.00"}},{"v":0,"d":"0.0"},{"$f":"'Übersicht Schützen'!U19","v":{"v":358.1,"d":"358.10"}},358.1,{"v":-203.69999999999993,"d":"-203.7"}]
[19,{"$f":"'Übersicht Schützen'!A20","v":"Köster Thilo"},{"$f":"'Übersicht Schützen'!B20","v":"Spahnharrenstätte"},{"$f":"'Übersicht Schützen'!C20","v":{"v":0,"d":"0.0"}},{"$f":"'Übersicht Schützen'!D20","v":{"v":0,"d":"0.0"}},{"$f":"'Übersicht Schützen'!E20","v":{"v":0,"d":"0.0"}},{"$f":"'Übersicht Schützen'!F20","v":132.6},{"$f":"'Übersicht Schützen'!G20","v":{"v":224,"d":"224.0"}},{"$f":"'Übersicht Schützen'!H20","v":{"v":0,"d":"0.0"}},{"$f":"'Übersicht Schützen'!I20","v":{"v":178.3,"d":"178.30"}},356.6,{"$f":"'Übersicht Schützen'!L20","v":{"v":0,"d":"0.0"}},{"$f":"'Übersicht Schützen'!M20","v":{"v":0,"d":"0.0"}},{"$f":"'Übersicht Schützen'!N20","v":{"v":0,"d":"0.0"}},{"$f":"'Übersicht Schützen'!O20","v":{"v":0,"d":"0.0"}},{"$f":"'Übersicht Schützen'!P20","v":{"v":0,"d":"0.0"}},{"$f":"'Übersicht Schützen'!Q20","v":{"v":0,"d":"0.0"}},{"$f":"'Übersicht Schützen'!R20","v":{"v":0,"d":"0.00"}},{"v":0,"d":"0.0"},{"$f":"'Übersicht Schützen'!U20","v":{"v":178.3,"d":"178.30"}},356.6,-1.5]
[20,{"$f":"'Übersicht Schützen'!A21","v":"Leis Fynn Lucas "},{"$f":"'Übersicht Schützen'!B21","v":"Spahnharrenstätte"},{"$f":"'Übersicht Schützen'!C21","v":83.8},{"$f":"'Übersicht Schützen'!D21","v":{"v":0,"d":"0.0"}},{"$f":"'Übersicht Schützen'!E21","v":{"v":0,"d":"0.0"}},{"$f":"'Übersicht Schützen'!F21","v":{"v":0,"d":"0.0"}},{"$f":"'Übersicht Schützen'!G21","v":{"v":0,"d":"0.0"}},{"$f":"'Übersicht Schützen'!H21","v":{"v":0,"d":"0.0"}},{"$f":"'Übersicht Schützen'!I21","v":{"v":83.8,"d":"83.80"}},83.8,{"$f":"'Übersicht Schützen'!L21","v":{"v":0,"d":"0.0"}},{"$f":"'Übersicht Schützen'!M21","v":{"v":0,"d":"0.0"}},{"$f":"'Übersicht Schützen'!N21","v":{"v":0,"d":"0.0"}},{"$f":"'Übersicht Schützen'!O21","v":{"v":0,"d":"0.0"}},{"$f":"'Übersicht Schützen'!P21","v":{"v":0,"d":"0.0"}},{"$f":"'Übersicht Schützen'!Q21","v":{"v":0,"d":"0.0"}},{"$f":"'Übersicht Schützen'!R21","v":{"v":0,"d":"0.00"}},{"v":0,"d":"0.0"},{"$f":"'Übersicht Schützen'!U21","v":{"v":83.8,"d":"83.80"}},83.8,-272.8]
[21,{"$f":"'Übersicht Schützen'!A22","v":"Wübben Jasper"},{"$f":"'Übersicht Schützen'!B22","v":"Esterwegen"},{"$f":"'Übersicht Schützen'!C22","v":{"v":0,"d":"0.0"}},{"$f":"'Übersicht Schützen'!D22","v":{"v":0,"d":"0.0"}},{"$f":"'Übersicht Schützen'!E22","v":{"v":0,"d":"0.0"}},{"$f":"'Übersicht Schützen'!F22","v":{"v":0,"d":"0.0"}},{"$f":"'Übersicht Schützen'!G22","v":{"v":0,"d":"0.0"}},{"$f":"'Übersicht Schützen'!H22","v":{"v":0,"d":"0.0"}},{"$f":"'Übersicht Schützen'!I22","v":{"v":0,"d":"0.00"}},{"v":0,"d":"0.0"},{"$f":"'Übersicht Schützen'!L22","v":{"v":0,"d":"0.0"}},{"$f":"'Übersicht Schützen'!M22","v":{"v":0,"d":"0.0"}},{"$f":"'Übersicht Schützen'!N22","v":{"v":0,"d":"0.0"}},{"$f":"'Übersicht Schützen'!O22","v":{"v":0,"d":"0.0"}},{"$f":"'Übersicht Schützen'!P22","v":{"v":0,"d":"0.0"}},{"$f":"'Übersicht Schützen'!Q22","v":{"v":0,"d":"0.0"}},{"$f":"'Übersicht Schützen'!R22","v":{"v":0,"d":"0.00"}},{"v":0,"d":"0.0"},{"$f":"'Übersicht Schützen'!U22","v":{"v":0,"d":"0.00"}},{"v":0,"d":"0.0"},-83.8]
[22,{"$f":"'Übersicht Schützen'!A23","v":"Engbers Julian"},{"$f":"'Übersicht Schützen'!B23","v":"Esterwegen"},{"$f":"'Übersicht Schützen'!C23","v":{"v":0,"d":"0.0"}},{"$f":"'Übersicht Schützen'!D23","v":{"v":0,"d":"0.0"}},{"$f":"'Übersicht Schützen'!E23","v":{"v":0,"d":"0.0"}},{"$f":"'Übersicht Schützen'!F23","v":{"v":0,"d":"0.0"}},{"$f":"'Übersicht Schützen'!G23","v":{"v":0,"d":"0.0"}},{"$f":"'Übersicht Schützen'!H23","v":{"v":0,"d":"0.0"}},{"$f":"'Übersicht Schützen'!I23","v":{"v":0,"d":"0.00"}},{"v":0,"d":"0.0"},{"$f":"'Übersicht Schützen'!L23","v":{"v":0,"d":"0.0"}},{"$f":"'Übersicht Schützen'!M23","v":{"v":0,"d":"0.0"}},{"$f":"'Übersicht Schützen'!N23","v":{"v":0,"d":"0.0"}},{"$f":"'Übersicht Schützen'!O23","v":{"v":0,"d":"0.0"}},{"$f":"'Übersicht Schützen'!P23","v":{"v":0,"d":"0.0"}},{"$f":"'Übersicht Schützen'!Q23","v":{"v":0,"d":"0.0"}},{"$f":"'Übersicht Schützen'!R23","v":{"v":0,"d":"0.00"}},{"v":0,"d":"0.0"},{"$f":"'Übersicht Schützen'!U23","v":{"v":0,"d":"0.00"}},{"v":0,"d":"0.0"},{"v":0,"d":"0.0"}]
[23,{"$f":"'Übersicht Schützen'!A24","v":"Meyer Johan"},{"$f":"'Übersicht Schützen'!B24","v":"Esterwegen"},{"$f":"'Übersicht Schützen'!C24","v":{"v":0,"d":"0.0"}},{"$f":"'Übersicht Schützen'!D24","v":{"v":0,"d":"0.0"}},{"$f":"'Übersicht Schützen'!E24","v":{"v":0,"d":"0.0"}},{"$f":"'Übersicht Schützen'!F24","v":{"v":0,"d":"0.0"}},{"$f":"'Übersicht Schützen'!G24","v":{"v":0,"d":"0.0"}},{"$f":"'Übersicht Schützen'!H24","v":{"v":0,"d":"0.0"}},{"$f":"'Übersicht Schützen'!I24","v":{"v":0,"d":"0.00"}},{"v":0,"d":"0.0"},{"$f":"'Übersicht Schützen'!L24","v":{"v":0,"d":"0.0"}},{"$f":"'Übersicht Schützen'!M24","v":{"v":0,"d":"0.0"}},{"$f":"'Übersicht Schützen'!N24","v":{"v":0,"d":"0.0"}},{"$f":"'Übersicht Schützen'!O24","v":{"v":0,"d":"0.0"}},{"$f":"'Übersicht Schützen'!P24","v":{"v":0,"d":"0.0"}},{"$f":"'Übersicht Schützen'!Q24","v":{"v":0,"d":"0.0"}},{"$f":"'Übersicht Schützen'!R24","v":{"v":0,"d":"0.00"}},{"v":0,"d":"0.0"},{"$f":"'Übersicht Schützen'!U24","v":{"v":0,"d":"0.00"}},{"v":0,"d":"0.0"},{"v":0,"d":"0.0"}]
[24,{"$f":"'Übersicht Schützen'!A25","v":"Schütze 5"},{"$f":"'Übersicht Schützen'!B25","v":"Esterwegen"},{"$f":"'Übersicht Schützen'!C25","v":{"v":0,"d":"0.0"}},{"$f":"'Übersicht Schützen'!D25","v":{"v":0,"d":"0.0"}},{"$f":"'Übersicht Schützen'!E25","v":{"v":0,"d":"0.0"}},{"$f":"'Übersicht Schützen'!F25","v":{"v":0,"d":"0.0"}},{"$f":"'Übersicht Schützen'!G25","v":{"v":0,"d":"0.0"}},{"$f":"'Übersicht Schützen'!H25","v":{"v":0,"d":"0.0"}},{"$f":"'Übersicht Schützen'!I25","v":{"v":0,"d":"0.00"}},{"v":0,"d":"0.0"},{"$f":"'Übersicht Schützen'!L25","v":{"v":0,"d":"0.0"}},{"$f":"'Übersicht Schützen'!M25","v":{"v":0,"d":"0.0"}},{"$f":"'Übersicht Schützen'!N25","v":{"v":0,"d":"0.0"}},{"$f":"'Übersicht Schützen'!O25","v":{"v":0,"d":"0.0"}},{"$f":"'Übersicht Schützen'!P25","v":{"v":0,"d":"0.0"}},{"$f":"'Übersicht Schützen'!Q25","v":{"v":0,"d":"0.0"}},{"$f":"'Übersicht Schützen'!R25","v":{"v":0,"d":"0.00"}},{"v":0,"d":"0.0"},{"$f":"'Übersicht Schützen'!U25","v":{"v":0,"d":"0.00"}},{"v":0,"d":"0.0"},{"v":0,"d":"0.0"}]
[25,{"$f":"'Übersicht Schützen'!A26","v":"Schütze 14"},{"$f":"'Übersicht Schützen'!B26","v":"Börgerwald"},{"$f":"'Übersicht Schützen'!C26","v":{"v":0,"d":"0.0"}},{"$f":"'Übersicht Schützen'!D26","v":{"v":0,"d":"0.0"}},{"$f":"'Übersicht Schützen'!E26","v":{"v":0,"d":"0.0"}},{"$f":"'Übersicht Schützen'!F26","v":{"v":0,"d":"0.0"}},{"$f":"'Übersicht Schützen'!G26","v":{"v":0,"d":"0.0"}},{"$f":"'Übersicht Schützen'!H26","v":{"v":0,"d":"0.0"}},{"$f":"'Übersicht Schützen'!I26","v":{"v":0,"d":"0.00"}},{"v":0,"d":"0.0"},{"$f":"'Übersicht Schützen'!L26","v":{"v":0,"d":"0.0"}},{"$f":"'Übersicht Schützen'!M26","v":{"v":0,"d":"0.0"}},{"$f":"'Übersicht Schützen'!N26","v":{"v":0,"d":"0.0"}},{"$f":"'Übersicht Schützen'!O26","v":{"v":0,"d":"0.0"}},{"$f":"'Übersicht Schützen'!P26","v":{"v":0,"d":"0.0"}},{"$f":"'Übersicht Schützen'!Q26","v":{"v":0,"d":"0.0"}},{"$f":"'Übersicht Schützen'!R26","v":{"v":0,"d":"0.00"}},{"v":0,"d":"0.0"},{"$f":"'Übersicht Schützen'!U26","v":{"v":0,"d":"0.00"}},{"v":0,"d":"0.0"},{"v":0,"d":"0.0"}]
[26,{"$f":"'Übersicht Schützen'!A27","v":"Schütze 15"},{"$f":"'Übersicht Schützen'!B27","v":"Börgerwald"},{"$f":"'Übersicht Schützen'!C27","v":{"v":0,"d":"0.0"}},{"$f":"'Übersicht Schützen'!D27","v":{"v":0,"d":"0.0"}},{"$f":"'Übersicht Schützen'!E27","v":{"v":0,"d":"0.0"}},{"$f":"'Übersicht Schützen'!F27","v":{"v":0,"d":"0.0"}},{"$f":"'Übersicht Schützen'!G27","v":{"v":0,"d":"0.0"}},{"$f":"'Übersicht Schützen'!H27","v":{"v":0,"d":"0.0"}},{"$f":"'Übersicht Schützen'!I27","v":{"v":0,"d":"0.00"}},{"v":0,"d":"0.0"},{"$f":"'Übersicht Schützen'!L27","v":{"v":0,"d":"0.0"}},{"$f":"'Übersicht Schützen'!M27","v":{"v":0,"d":"0.0"}},{"$f":"'Übersicht Schützen'!N27","v":{"v":0,"d":"0.0"}},{"$f":"'Übersicht Schützen'!O27","v":{"v":0,"d":"0.0"}},{"$f":"'Übersicht Schützen'!P27","v":{"v":0,"d":"0.0"}},{"$f":"'Übersicht Schützen'!Q27","v":{"v":0,"d":"0.0"}},{"$f":"'Übersicht Schützen'!R27","v":{"v":0,"d":"0.00"}},{"v":0,"d":"0.0"},{"$f":"'Übersicht Schützen'!U27","v":{"v":0,"d":"0.00"}},{"v":0,"d":"0.0"},{"v":0,"d":"0.0"}]
[27,{"$f":"'Übersicht Schützen'!A28","v":"Schütze 19"},{"$f":"'Übersicht Schützen'!B28","v":"Börgermoor"},{"$f":"'Übersicht Schützen'!C28","v":{"v":0,"d":"0.0"}},{"$f":"'Übersicht Schützen'!D28","v":{"v":0,"d":"0.0"}},{"$f":"'Übersicht Schützen'!E28","v":{"v":0,"d":"0.0"}},{"$f":"'Übersicht Schützen'!F28","v":{"v":0,"d":"0.0"}},{"$f":"'Übersicht Schützen'!G28","v":{"v":0,"d":"0.0"}},{"$f":"'Übersicht Schützen'!H28","v":{"v":0,"d":"0.0"}},{"$f":"'Übersicht Schützen'!I28","v":{"v":0,"d":"0.00"}},{"v":0,"d":"0.0"},{"$f":"'Übersicht Schützen'!L28","v":{"v":0,"d":"0.0"}},{"$f":"'Übersicht Schützen'!M28","v":{"v":0,"d":"0.0"}},{"$f":"'Übersicht Schützen'!N28","v":{"v":0,"d":"0.0"}},{"$f":"'Übersicht Schützen'!O28","v":{"v":0,"d":"0.0"}},{"$f":"'Übersicht Schützen'!P28","v":{"v":0,"d":"0.0"}},{"$f":"'Übersicht Schützen'!Q28","v":{"v":0,"d":"0.0"}},{"$f":"'Übersicht Schützen'!R28","v":{"v":0,"d":"0.00"}},{"v":0,"d":"0.0"},{"$f":"'Übersicht Schützen'!U28","v":{"v":0,"d":"0.00"}},{"v":0,"d":"0.0"},{"v":0,"d":"0.0"}]
[28,{"$f":"'Übersicht Schützen'!A29","v":"Schütze 20"},{"$f":"'Übersicht Schützen'!B29","v":"Börgermoor"},{"$f":"'Übersicht Schützen'!C29","v":{"v":0,"d":"0.0"}},{"$f":"'Übersicht Schützen'!D29","v":{"v":0,"d":"0.0"}},{"$f":"'Übersicht Schützen'!E29","v":{"v":0,"d":"0.0"}},{"$f":"'Übersicht Schützen'!F29","v":{"v":0,"d":"0.0"}},{"$f":"'Übersicht Schützen'!G29","v":{"v":0,"d":"0.0"}},{"$f":"'Übersicht Schützen'!H29","v":{"v":0,"d":"0.0"}},{"$f":"'Übersicht Schützen'!I29","v":{"v":0,"d":"0.00"}},{"v":0,"d":"0.0"},{"$f":"'Übersicht Schützen'!L29","v":{"v":0,"d":"0.0"}},{"$f":"'Übersicht Schützen'!M29","v":{"v":0,"d":"0.0"}},{"$f":"'Übersicht Schützen'!N29","v":{"v":0,"d":"0.0"}},{"$f":"'Übersicht Schützen'!O29","v":{"v":0,"d":"0.0"}},{"$f":"'Übersicht Schützen'!P29","v":{"v":0,"d":"0.0"}},{"$f":"'Übersicht Schützen'!Q29","v":{"v":0,"d":"0.0"}},{"$f":"'Übersicht Schützen'!R29","v":{"v":0,"d":"0.00"}},{"v":0,"d":"0.0"},{"$f":"'Übersicht Schützen'!U29","v":{"v":0,"d":"0.00"}},{"v":0,"d":"0.0"},{"v":0,"d":"0.0"}]
[29,{"$f":"'Übersicht Schützen'!A30","v":"Schütze 25"},{"$f":"'Übersicht Schützen'!B30","v":"Spahnharrenstätte"},{"$f":"'Übersicht Schützen'!C30","v":{"v":0,"d":"0.0"}},{"$f":"'Übersicht Schützen'!D30","v":{"v":0,"d":"0.0"}},{"$f":"'Übersicht Schützen'!E30","v":{"v":0,"d":"0.0"}},{"$f":"'Übersicht Schützen'!F30","v":{"v":0,"d":"0.0"}},{"$f":"'Übersicht Schützen'!G30","v":{"v":0,"d":"0.0"}},{"$f":"'Übersicht Schützen'!H30","v":{"v":0,"d":"0.0"}},{"$f":"'Übersicht Schützen'!I30","v":{"v":0,"d":"0.00"}},{"v":0,"d":"0.0"},{"$f":"'Übersicht Schützen'!L30","v":{"v":0,"d":"0.0"}},{"$f":"'Übersicht Schützen'!M30","v":{"v":0,"d":"0.0"}},{"$f":"'Übersicht Schützen'!N30","v":{"v":0,"d":"0.0"}},{"$f":"'Übersicht Schützen'!O30","v":{"v":0,"d":"0.0"}},{"$f":"'Übersicht Schützen'!P30","v":{"v":0,"d":"0.0"}},{"$f":"'Übersicht Schützen'!Q30","v":{"v":0,"d":"0.0"}},{"$f":"'Übersicht Schützen'!R30","v":{"v":0,"d":"0.00"}},{"v":0,"d":"0.0"},{"$f":"'Übersicht Schützen'!U30","v":{"v":0,"d":"0.00"}},{"v":0,"d":"0.0"},{"v":0,"d":"0.0"}]
[30,{"$f":"'Übersicht Schützen'!A31","v":"Schütze 27"},{"$f":"'Übersicht Schützen'!B31","v":"Lorup"},{"$f":"'Übersicht Schützen'!C31","v":{"v":0,"d":"0.0"}},{"$f":"'Übersicht Schützen'!D31","v":{"v":0,"d":"0.0"}},{"$f":"'Übersicht Schützen'!E31","v":{"v":0,"d":"0.0"}},{"$f":"'Übersicht Schützen'!F31","v":{"v":0,"d":"0.0"}},{"$f":"'Übersicht Schützen'!G31","v":{"v":0,"d":"0.0"}},{"$f":"'Übersicht Schützen'!H31","v":{"v":0,"d":"0.0"}},{"$f":"'Übersicht Schützen'!I31","v":{"v":0,"d":"0.00"}},{"v":0,"d":"0.0"},{"$f":"'Übersicht Schützen'!L31","v":{"v":0,"d":"0.0"}},{"$f":"'Übersicht Schützen'!M31","v":{"v":0,"d":"0.0"}},{"$f":"'Übersicht Schützen'!N31","v":{"v":0,"d":"0.0"}},{"$f":"'Übersicht Schützen'!O31","v":{"v":0,"d":"0.0"}},{"$f":"'Übersicht Schützen'!P31","v":{"v":0,"d":"0.0"}},{"$f":"'Übersicht Schützen'!Q31","v":{"v":0,"d":"0.0"}},{"$f":"'Übersicht Schützen'!R31","v":{"v":0,"d":"0.00"}},{"v":0,"d":"0.0"},{"$f":"'Übersicht Schützen'!U31","v":{"v":0,"d":"0.00"}},{"v":0,"d":"0.0"},{"v":0,"d":"0.0"}]
[31,{"$f":"'Übersicht Schützen'!A32","v":"Schütze 28"},{"$f":"'Übersicht Schützen'!B32","v":"Lorup"},{"$f":"'Übersicht Schützen'!C32","v":{"v":0,"d":"0.0"}},{"$f":"'Übersicht Schützen'!D32","v":{"v":0,"d":"0.0"}},{"$f":"'Übersicht Schützen'!E32","v":{"v":0,"d":"0.0"}},{"$f":"'Übersicht Schützen'!F32","v":{"v":0,"d":"0.0"}},{"$f":"'Übersicht Schützen'!G32","v":{"v":0,"d":"0.0"}},{"$f":"'Übersicht Schützen'!H32","v":{"v":0,"d":"0.0"}},{"$f":"'Übersicht Schützen'!I32","v":{"v":0,"d":"0.00"}},{"v":0,"d":"0.0"},{"$f":"'Übersicht Schützen'!L32","v":{"v":0,"d":"0.0"}},{"$f":"'Übersicht Schützen'!M32","v":{"v":0,"d":"0.0"}},{"$f":"'Übersicht Schützen'!N32","v":{"v":0,"d":"0.0"}},{"$f":"'Übersicht Schützen'!O32","v":{"v":0,"d":"0.0"}},{"$f":"'Übersicht Schützen'!P32","v":{"v":0,"d":"0.0"}},{"$f":"'Übersicht Schützen'!Q32","v":{"v":0,"d":"0.0"}},{"$f":"'Übersicht Schützen'!R32","v":{"v":0,"d":"0.00"}},{"v":0,"d":"0.0"},{"$f":"'Übersicht Schützen'!U32","v":{"v":0,"d":"0.00"}},{"v":0,"d":"0.0"},{"$f":"(U52-U53)*-1","v":{"v":0,"d":"0.0"}}]
[32,{"$f":"'Übersicht Schützen'!A33","v":"Schütze 29"},{"$f":"'Übersicht Schützen'!B33","v":"Lorup"},{"$f":"'Übersicht Schützen'!C33","v":{"v":0,"d":"0.0"}},{"$f":"'Übersicht Schützen'!D33","v":{"v":0,"d":"0.0"}},{"$f":"'Übersicht Schützen'!E33","v":{"v":0,"d":"0.0"}},{"$f":"'Übersicht Schützen'!F33","v":{"v":0,"d":"0.0"}},{"$f":"'Übersicht Schützen'!G33","v":{"v":0,"d":"0.0"}},{"$f":"'Übersicht Schützen'!H33","v":{"v":0,"d":"0.0"}},{"$f":"'Übersicht Schützen'!I33","v":{"v":0,"d":"0.00"}},{"v":0,"d":"0.0"},{"$f":"'Übersicht Schützen'!L33","v":{"v":0,"d":"0.0"}},{"$f":"'Übersicht Schützen'!M33","v":{"v":0,"d":"0.0"}},{"$f":"'Übersicht Schützen'!N33","v":{"v":0,"d":"0.0"}},{"$f":"'Übersicht Schützen'!O33","v":{"v":0,"d":"0.0"}},{"$f":"'Übersicht Schützen'!P33","v":{"v":0,"d":"0.0"}},{"$f":"'Übersicht Schützen'!Q33","v":{"v":0,"d":"0.0"}},{"$f":"'Übersicht Schützen'!R33","v":{"v":0,"d":"0.00"}},{"v":0,"d":"0.0"},{"$f":"'Übersicht Schützen'!U33","v":{"v":0,"d":"0.00"}},{"v":0,"d":"0.0"},{"v":0,"d":"0.0"}]
[33,{"$f":"'Übersicht Schützen'!A34","v":"Schütze 30"},{"$f":"'Übersicht Schützen'!B34","v":"Lorup"},{"$f":"'Übersicht Schützen'!C34","v":{"v":0,"d":"0.0"}},{"$f":"'Übersicht Schützen'!D34","v":{"v":0,"d":"0.0"}},{"$f":"'Übersicht Schützen'!E34","v":{"v":0,"d":"0.0"}},{"$f":"'Übersicht Schützen'!F34","v":{"v":0,"d":"0.0"}},{"$f":"'Übersicht Schützen'!G34","v":{"v":0,"d":"0.0"}},{"$f":"'Übersicht Schützen'!H34","v":{"v":0,"d":"0.0"}},{"$f":"'Übersicht Schützen'!I34","v":{"v":0,"d":"0.00"}},{"v":0,"d":"0.0"},{"$f":"'Übersicht Schützen'!L34","v":{"v":0,"d":"0.0"}},{"$f":"'Übersicht Schützen'!M34","v":{"v":0,"d":"0.0"}},{"$f":"'Übersicht Schützen'!N34","v":{"v":0,"d":"0.0"}},{"$f":"'Übersicht Schützen'!O34","v":{"v":0,"d":"0.0"}},{"$f":"'Übersicht Schützen'!P34","v":{"v":0,"d":"0.0"}},{"$f":"'Übersicht Schützen'!Q34","v":{"v":0,"d":"0.0"}},{"$f":"'Übersicht Schützen'!R34","v":{"v":0,"d":"0.00"}},{"v":0,"d":"0.0"},{"$f":"'Übersicht Schützen'!U34","v":{"v":0,"d":"0.00"}},{"v":0,"d":"0.0"},{"v":0,"d":"0.0"}]
[34,{"$f":"'Übersicht Schützen'!A35","v":"Schütze 33"},{"$f":"'Übersicht Schützen'!B35","v":"Lahn"},{"$f":"'Übersicht Schützen'!C35","v":{"v":0,"d":"0.0"}},{"$f":"'Übersicht Schützen'!D35","v":{"v":0,"d":"0.0"}},{"$f":"'Übersicht Schützen'!E35","v":{"v":0,"d":"0.0"}},{"$f":"'Übersicht Schützen'!F35","v":{"v":0,"d":"0.0"}},{"$f":"'Übersicht Schützen'!G35","v":{"v":0,"d":"0.0"}},{"$f":"'Übersicht Schützen'!H35","v":{"v":0,"d":"0.0"}},{"$f":"'Übersicht Schützen'!I35","v":{"v":0,"d":"0.00"}},{"v":0,"d":"0.0"},{"$f":"'Übersicht Schützen'!L35","v":{"v":0,"d":"0.0"}},{"$f":"'Übersicht Schützen'!M35","v":{"v":0,"d":"0.0"}},{"$f":"'Übersicht Schützen'!N35","v":{"v":0,"d":"0.0"}},{"$f":"'Übersicht Schützen'!O35","v":{"v":0,"d":"0.0"}},{"$f":"'Übersicht Schützen'!P35","v":{"v":0,"d":"0.0"}},{"$f":"'Übersicht Schützen'!Q35","v":{"v":0,"d":"0.0"}},{"$f":"'Übersicht Schützen'!R35","v":{"v":0,"d":"0.00"}},{"v":0,"d":"0.0"},{"$f":"'Übersicht Schützen'!U35","v":{"v":0,"d":"0.00"}},{"v":0,"d":"0.0"},{"v":0,"d":"0.0"}]
[35,{"$f":"'Übersicht Schützen'!A36","v":"Schütze 34"},{"$f":"'Übersicht Schützen'!B36","v":"Lahn"},{"$f":"'Übersicht Schützen'!C36","v":{"v":0,"d":"0.0"}},{"$f":"'Übersicht Schützen'!D36","v":{"v":0,"d":"0.0"}},{"$f":"'Übersicht Schützen'!E36","v":{"v":0,"d":"0.0"}},{"$f":"'Übersicht Schützen'!F36","v":{"v":0,"d":"0.0"}},{"$f":"'Übersicht Schützen'!G36","v":{"v":0,"d":"0.0"}},{"$f":"'Übersicht Schützen'!H36","v":{"v":0,"d":"0.0"}},{"$f":"'Übersicht Schützen'!I36","v":{"v":0,"d":"0.00"}},{"v":0,"d":"0.0"},{"$f":"'Übersicht Schützen'!L36","v":{"v":0,"d":"0.0"}},{"$f":"'Übersicht Schützen'!M36","v":{"v":0,"d":"0.0"}},{"$f":"'Übersicht Schützen'!N36","v":{"v":0,"d":"0.0"}},{"$f":"'Übersicht Schützen'!O36","v":{"v":0,"d":"0.0"}},{"$f":"'Übersicht Schützen'!P36","v":{"v":0,"d":"0.0"}},{"$f":"'Übersicht Schützen'!Q36","v":{"v":0,"d":"0.0"}},{"$f":"'Übersicht Schützen'!R36","v":{"v":0,"d":"0.00"}},{"v":0,"d":"0.0"},{"$f":"'Übersicht Schützen'!U36","v":{"v":0,"d":"0.00"}},{"v":0,"d":"0.0"},{"$f":"(U56-U57)*-1","v":{"v":0,"d":"0.0"}}]
[36,{"$f":"'Übersicht Schützen'!A37","v":"Schütze 35"},{"$f":"'Übersicht Schützen'!B37","v":"Lahn"},{"$f":"'Übersicht Schützen'!C37","v":{"v":0,"d":"0.0"}},{"$f":"'Übersicht Schützen'!D37","v":{"v":0,"d":"0.0"}},{"$f":"'Übersicht Schützen'!E37","v":{"v":0,"d":"0.0"}},{"$f":"'Übersicht Schützen'!F37","v":{"v":0,"d":"0.0"}},{"$f":"'Übersicht Schützen'!G37","v":{"v":0,"d":"0.0"}},{"$f":"'Übersicht Schützen'!H37","v":{"v":0,"d":"0.0"}},{"$f":"'Übersicht Schützen'!I37","v":{"v":0,"d":"0.00"}},{"v":0,"d":"0.0"},{"$f":"'Übersicht Schützen'!L37","v":{"v":0,"d":"0.0"}},{"$f":"'Übersicht Schützen'!M37","v":{"v":0,"d":"0.0"}},{"$f":"'Übersicht Schützen'!N37","v":{"v":0,"d":"0.0"}},{"$f":"'Übersicht Schützen'!O37","v":{"v":0,"d":"0.0"}},{"$f":"'Übersicht Schützen'!P37","v":{"v":0,"d":"0.0"}},{"$f":"'Übersicht Schützen'!Q37","v":{"v":0,"d":"0.0"}},{"$f":"'Übersicht Schützen'!R37","v":{"v":0,"d":"0.00"}},{"v":0,"d":"0.0"},{"$f":"'Übersicht Schützen'!U37","v":{"v":0,"d":"0.00"}},{"v":0,"d":"0.0"},{"v":0,"d":"0.0"}]
[37,{"$f":"'Übersicht Schützen'!A38","v":"Schütze 37"},{"$f":"'Übersicht Schützen'!B38","v":"Sögel"},{"$f":"'Übersicht Schützen'!C38","v":{"v":0,"d":"0.0"}},{"$f":"'Übersicht Schützen'!D38","v":{"v":0,"d":"0.0"}},{"$f":"'Übersicht Schützen'!E38","v":{"v":0,"d":"0.0"}},{"$f":"'Übersicht Schützen'!F38","v":{"v":0,"d":"0.0"}},{"$f":"'Übersicht Schützen'!G38","v":{"v":0,"d":"0.0"}},{"$f":"'Übersicht Schützen'!H38","v":{"v":0,"d":"0.0"}},{"$f":"'Übersicht Schützen'!I38","v":{"v":0,"d":"0.00"}},{"$f":"SUM(D59:I59)","v":{"v":0,"d":"0.0"}},{"$f":"'Übersicht Schützen'!L38","v":{"v":0,"d":"0.0"}},{"$f":"'Übersicht Schützen'!M38","v":{"v":0,"d":"0.0"}},{"$f":"'Übersicht Schützen'!N38","v":{"v":0,"d":"0.0"}},{"$f":"'Übersicht Schützen'!O38","v":{"v":0,"d":"0.0"}},{"$f":"'Übersicht Schützen'!P38","v":{"v":0,"d":"0.0"}},{"$f":"'Übersicht Schützen'!Q38","v":{"v":0,"d":"0.0"}},{"$f":"'Übersicht Schützen'!R38","v":{"v":0,"d":"0.00"}},{"$f":"SUM(L59:Q59)","v":{"v":0,"d":"0.0"}},{"$f":"'Übersicht Schützen'!U38","v":{"v":0,"d":"0.00"}},{"$f":"SUM(K59+S59)","v":{"v":0,"d":"0.0"}},{"$f":"(U58-U59)*-1","v":{"v":0,"d":"0.0"}}]
[38,{"$f":"'Übersicht Schützen'!A39","v":"Schütze 38"},{"$f":"'Übersicht Schützen'!B39","v":"Sögel"},{"$f":"'Übersicht Schützen'!C39","v":{"v":0,"d":"0.0"}},{"$f":"'Übersicht Schützen'!D39","v":{"v":0,"d":"0.0"}},{"$f":"'Übersicht Schützen'!E39","v":{"v":0,"d":"0.0"}},{"$f":"'Übersicht Schützen'!F39","v":{"v":0,"d":"0.0"}},{"$f":"'Übersicht Schützen'!G39","v":{"v":0,"d":"0.0"}},{"$f":"'Übersicht Schützen'!H39","v":{"v":0,"d":"0.0"}},{"$f":"'Übersicht Schützen'!I39","v":{"v":0,"d":"0.00"}},{"v":0,"d":"0.0"},{"$f":"'Übersicht Schützen'!L39","v":{"v":0,"d":"0.0"}},{"$f":"'Übersicht Schützen'!M39","v":{"v":0,"d":"0.0"}},{"$f":"'Übersicht Schützen'!N39","v":{"v":0,"d":"0.0"}},{"$f":"'Übersicht Schützen'!O39","v":{"v":0,"d":"0.0"}},{"$f":"'Übersicht Schützen'!P39","v":{"v":0,"d":"0.0"}},{"$f":"'Übersicht Schützen'!Q39","v":{"v":0,"d":"0.0"}},{"$f":"'Übersicht Schützen'!R39","v":{"v":0,"d":"0.00"}},{"v":0,"d":"0.0"},{"$f":"'Übersicht Schützen'!U39","v":{"v":0,"d":"0.00"}},{"v":0,"d":"0.0"},{"v":0,"d":"0.0"}]
[39,{"$f":"'Übersicht Schützen'!A40","v":"Schütze 39"},{"$f":"'Übersicht Schützen'!B40","v":"Sögel"},{"$f":"'Übersicht Schützen'!C40","v":{"v":0,"d":"0.0"}},{"$f":"'Übersicht Schützen'!D40","v":{"v":0,"d":"0.0"}},{"$f":"'Übersicht Schützen'!E40","v":{"v":0,"d":"0.0"}},{"$f":"'Übersicht Schützen'!F40","v":{"v":0,"d":"0.0"}},{"$f":"'Übersicht Schützen'!G40","v":{"v":0,"d":"0.0"}},{"$f":"'Übersicht Schützen'!H40","v":{"v":0,"d":"0.0"}},{"$f":"'Übersicht Schützen'!I40","v":{"v":0,"d":"0.00"}},{"v":0,"d":"0.0"},{"$f":"'Übersicht Schützen'!L40","v":{"v":0,"d":"0.0"}},{"$f":"'Übersicht Schützen'!M40","v":{"v":0,"d":"0.0"}},{"$f":"'Übersicht Schützen'!N40","v":{"v":0,"d":"0.0"}},{"$f":"'Übersicht Schützen'!O40","v":{"v":0,"d":"0.0"}},{"$f":"'Übersicht Schützen'!P40","v":{"v":0,"d":"0.0"}},{"$f":"'Übersicht Schützen'!Q40","v":{"v":0,"d":"0.0"}},{"$f":"'Übersicht Schützen'!R40","v":{"v":0,"d":"0.00"}},{"v":0,"d":"0.0"},{"$f":"'Übersicht Schützen'!U40","v":{"v":0,"d":"0.00"}},{"v":0,"d":"0.0"},{"v":0,"d":"0.0"}]
[40,{"$f":"'Übersicht Schützen'!A41","v":"Schütze 40"},{"$f":"'Übersicht Schützen'!B41","v":"Sögel"},{"$f":"'Übersicht Schützen'!C41","v":{"v":0,"d":"0.0"}},{"$f":"'Übersicht Schützen'!D41","v":{"v":0,"d":"0.0"}},{"$f":"'Übersicht Schützen'!E41","v":{"v":0,"d":"0.0"}},{"$f":"'Übersicht Schützen'!F41","v":{"v":0,"d":"0.0"}},{"$f":"'Übersicht Schützen'!G41","v":{"v":0,"d":"0.0"}},{"$f":"'Übersicht Schützen'!H41","v":{"v":0,"d":"0.0"}},{"$f":"'Übersicht Schützen'!I41","v":{"v":0,"d":"0.00"}},{"v":0,"d":"0.0"},{"$f":"'Übersicht Schützen'!L41","v":{"v":0,"d":"0.0"}},{"$f":"'Übersicht Schützen'!M41","v":{"v":0,"d":"0.0"}},{"$f":"'Übersicht Schützen'!N41","v":{"v":0,"d":"0.0"}},{"$f":"'Übersicht Schützen'!O41","v":{"v":0,"d":"0.0"}},{"$f":"'Übersicht Schützen'!P41","v":{"v":0,"d":"0.0"}},{"$f":"'Übersicht Schützen'!Q41","v":{"v":0,"d":"0.0"}},{"$f":"'Übersicht Schützen'!R41","v":{"v":0,"d":"0.00"}},{"v":0,"d":"0.0"},{"$f":"'Übersicht Schützen'!U41","v":{"v":0,"d":"0.00"}},{"v":0,"d":"0.0"},{"v":0,"d":"0.0"}]
[41,{"$f":"'Übersicht Schützen'!A42","v":"Schütze 41"},{"$f":"'Übersicht Schützen'!B42","v":"Verein IX"},{"$f":"'Übersicht Schützen'!C42","v":{"v":0,"d":"0.0"}},{"$f":"'Übersicht Schützen'!D42","v":{"v":0,"d":"0.0"}},{"$f":"'Übersicht Schützen'!E42","v":{"v":0,"d":"0.0"}},{"$f":"'Übersicht Schützen'!F42","v":{"v":0,"d":"0.0"}},{"$f":"'Übersicht Schützen'!G42","v":{"v":0,"d":"0.0"}},{"$f":"'Übersicht Schützen'!H42","v":{"v":0,"d":"0.0"}},{"$f":"'Übersicht Schützen'!I42","v":{"v":0,"d":"0.00"}},{"v":0,"d":"0.0"},{"$f":"'Übersicht Schützen'!L42","v":{"v":0,"d":"0.0"}},{"$f":"'Übersicht Schützen'!M42","v":{"v":0,"d":"0.0"}},{"$f":"'Übersicht Schützen'!N42","v":{"v":0,"d":"0.0"}},{"$f":"'Übersicht Schützen'!O42","v":{"v":0,"d":"0.0"}},{"$f":"'Übersicht Schützen'!P42","v":{"v":0,"d":"0.0"}},{"$f":"'Übersicht Schützen'!Q42","v":{"v":0,"d":"0.0"}},{"$f":"'Übersicht Schützen'!R42","v":{"v":0,"d":"0.00"}},{"v":0,"d":"0.0"},{"$f":"'Übersicht Schützen'!U42","v":{"v":0,"d":"0.00"}},{"v":0,"d":"0.0"},{"v":0,"d":"0.0"}]
[42,{"$f":"'Übersicht Schützen'!A43","v":"Schütze 42"},{"$f":"'Übersicht Schützen'!B43","v":"Verein IX"},{"$f":"'Übersicht Schützen'!C43","v":{"v":0,"d":"0.0"}},{"$f":"'Übersicht Schützen'!D43","v":{"v":0,"d":"0.0"}},{"$f":"'Übersicht Schützen'!E43","v":{"v":0,"d":"0.0"}},{"$f":"'Übersicht Schützen'!F43","v":{"v":0,"d":"0.0"}},{"$f":"'Übersicht Schützen'!G43","v":{"v":0,"d":"0.0"}},{"$f":"'Übersicht Schützen'!H43","v":{"v":0,"d":"0.0"}},{"$f":"'Übersicht Schützen'!I43","v":{"v":0,"d":"0.00"}},{"v":0,"d":"0.0"},{"$f":"'Übersicht Schützen'!L43","v":{"v":0,"d":"0.0"}},{"$f":"'Übersicht Schützen'!M43","v":{"v":0,"d":"0.0"}},{"$f":"'Übersicht Schützen'!N43","v":{"v":0,"d":"0.0"}},{"$f":"'Übersicht Schützen'!O43","v":{"v":0,"d":"0.0"}},{"$f":"'Übersicht Schützen'!P43","v":{"v":0,"d":"0.0"}},{"$f":"'Übersicht Schützen'!Q43","v":{"v":0,"d":"0.0"}},{"$f":"'Übersicht Schützen'!R43","v":{"v":0,"d":"0.00"}},{"v":0,"d":"0.0"},{"$f":"'Übersicht Schützen'!U43","v":{"v":0,"d":"0.00"}},{"v":0,"d":"0.0"},{"v":0,"d":"0.0"}]
[43,{"$f":"'Übersicht Schützen'!A44","v":"Schütze 43"},{"$f":"'Übersicht Schützen'!B44","v":"Verein IX"},{"$f":"'Übersicht Schützen'!C44","v":{"v":0,"d":"0.0"}},{"$f":"'Übersicht Schützen'!D44","v":{"v":0,"d":"0.0"}},{"$f":"'Übersicht Schützen'!E44","v":{"v":0,"d":"0.0"}},{"$f":"'Übersicht Schützen'!F44","v":{"v":0,"d":"0.0"}},{"$f":"'Übersicht Schützen'!G44","v":{"v":0,"d":"0.0"}},{"$f":"'Übersicht Schützen'!H44","v":{"v":0,"d":"0.0"}},{"$f":"'Übersicht Schützen'!I44","v":{"v":0,"d":"0.00"}},{"v":0,"d":"0.0"},{"$f":"'Übersicht Schützen'!L44","v":{"v":0,"d":"0.0"}},{"$f":"'Übersicht Schützen'!M44","v":{"v":0,"d":"0.0"}},{"$f":"'Übersicht Schützen'!N44","v":{"v":0,"d":"0.0"}},{"$f":"'Übersicht Schützen'!O44","v":{"v":0,"d":"0.0"}},{"$f":"'Übersicht Schützen'!P44","v":{"v":0,"d":"0.0"}},{"$f":"'Übersicht Schützen'!Q44","v":{"v":0,"d":"0.0"}},{"$f":"'Übersicht Schützen'!R44","v":{"v":0,"d":"0.00"}},{"v":0,"d":"0.0"},{"$f":"'Übersicht Schützen'!U44","v":{"v":0,"d":"0.00"}},{"v":0,"d":"0.0"},{"v":0,"d":"0.0"}]
[44,{"$f":"'Übersicht Schützen'!A45","v":"Schütze 44"},{"$f":"'Übersicht Schützen'!B45","v":"Verein IX"},{"$f":"'Übersicht Schützen'!C45","v":{"v":0,"d":"0.0"}},{"$f":"'Übersicht Schützen'!D45","v":{"v":0,"d":"0.0"}},{"$f":"'Übersicht Schützen'!E45","v":{"v":0,"d":"0.0"}},{"$f":"'Übersicht Schützen'!F45","v":{"v":0,"d":"0.0"}},{"$f":"'Übersicht Schützen'!G45","v":{"v":0,"d":"0.0"}},{"$f":"'Übersicht Schützen'!H45","v":{"v":0,"d":"0.0"}},{"$f":"'Übersicht Schützen'!I45","v":{"v":0,"d":"0.00"}},{"v":0,"d":"0.0"},{"$f":"'Übersicht Schützen'!L45","v":{"v":0,"d":"0.0"}},{"$f":"'Übersicht Schützen'!M45","v":{"v":0,"d":"0.0"}},{"$f":"'Übersicht Schützen'!N45","v":{"v":0,"d":"0.0"}},{"$f":"'Übersicht Schützen'!O45","v":{"v":0,"d":"0.0"}},{"$f":"'Übersicht Schützen'!P45","v":{"v":0,"d":"0.0"}},{"$f":"'Übersicht Schützen'!Q45","v":{"v":0,"d":"0.0"}},{"$f":"'Übersicht Schützen'!R45","v":{"v":0,"d":"0.00"}},{"v":0,"d":"0.0"},{"$f":"'Übersicht Schützen'!U45","v":{"v":0,"d":"0.00"}},{"v":0,"d":"0.0"},{"v":0,"d":"0.0"}]
[45,{"$f":"'Übersicht Schützen'!A46","v":"Schütze 45"},{"$f":"'Übersicht Schützen'!B46","v":"Verein IX"},{"$f":"'Übersicht Schützen'!C46","v":{"v":0,"d":"0.0"}},{"$f":"'Übersicht Schützen'!D46","v":{"v":0,"d":"0.0"}},{"$f":"'Übersicht Schützen'!E46","v":{"v":0,"d":"0.0"}},{"$f":"'Übersicht Schützen'!F46","v":{"v":0,"d":"0.0"}},{"$f":"'Übersicht Schützen'!G46","v":{"v":0,"d":"0.0"}},{"$f":"'Übersicht Schützen'!H46","v":{"v":0,"d":"0.0"}},{"$f":"'Übersicht Schützen'!I46","v":{"v":0,"d":"0.00"}},{"v":0,"d":"0.0"},{"$f":"'Übersicht Schützen'!L46","v":{"v":0,"d":"0.0"}},{"$f":"'Übersicht Schützen'!M46","v":{"v":0,"d":"0.0"}},{"$f":"'Übersicht Schützen'!N46","v":{"v":0,"d":"0.0"}},{"$f":"'Übersicht Schützen'!O46","v":{"v":0,"d":"0.0"}},{"$f":"'Übersicht Schützen'!P46","v":{"v":0,"d":"0.0"}},{"$f":"'Übersicht Schützen'!Q46","v":{"v":0,"d":"0.0"}},{"$f":"'Übersicht Schützen'!R46","v":{"v":0,"d":"0.00"}},{"v":0,"d":"0.0"},{"$f":"'Übersicht Schützen'!U46","v":{"v":0,"d":"0.00"}},{"v":0,"d":"0.0"},{"v":0,"d":"0.0"}]
[46,{"$f":"'Übersicht Schützen'!A47","v":"Schütze 46"},{"$f":"'Übersicht Schützen'!B47","v":"Verein X"},{"$f":"'Übersicht Schützen'!C47","v":{"v":0,"d":"0.0"}},{"$f":"'Übersicht Schützen'!D47","v":{"v":0,"d":"0.0"}},{"$f":"'Übersicht Schützen'!E47","v":{"v":0,"d":"0.0"}},{"$f":"'Übersicht Schützen'!F47","v":{"v":0,"d":"0.0"}},{"$f":"'Übersicht Schützen'!G47","v":{"v":0,"d":"0.0"}},{"$f":"'Übersicht Schützen'!H47","v":{"v":0,"d":"0.0"}},{"$f":"'Übersicht Schützen'!I47","v":{"v":0,"d":"0.00"}},{"v":0,"d":"0.0"},{"$f":"'Übersicht Schützen'!L47","v":{"v":0,"d":"0.0"}},{"$f":"'Übersicht Schützen'!M47","v":{"v":0,"d":"0.0"}},{"$f":"'Übersicht Schützen'!N47","v":{"v":0,"d":"0.0"}},{"$f":"'Übersicht Schützen'!O47","v":{"v":0,"d":"0.0"}},{"$f":"'Übersicht Schützen'!P47","v":{"v":0,"d":"0.0"}},{"$f":"'Übersicht Schützen'!Q47","v":{"v":0,"d":"0.0"}},{"$f":"'Übersicht Schützen'!R47","v":{"v":0,"d":"0.00"}},{"v":0,"d":"0.0"},{"$f":"'Übersicht Schützen'!U47","v":{"v":0,"d":"0.00"}},{"v":0,"d":"0.0"},{"v":0,"d":"0.0"}]
[47,{"$f":"'Übersicht Schützen'!A48","v":"Schütze 47"},{"$f":"'Übersicht Schützen'!B48","v":"Verein X"},{"$f":"'Übersicht Schützen'!C48","v":{"v":0,"d":"0.0"}},{"$f":"'Übersicht Schützen'!D48","v":{"v":0,"d":"0.0"}},{"$f":"'Übersicht Schützen'!E48","v":{"v":0,"d":"0.0"}},{"$f":"'Übersicht Schützen'!F48","v":{"v":0,"d":"0.0"}},{"$f":"'Übersicht Schützen'!G48","v":{"v":0,"d":"0.0"}},{"$f":"'Übersicht Schützen'!H48","v":{"v":0,"d":"0.0"}},{"$f":"'Übersicht Schützen'!I48","v":{"v":0,"d":"0.00"}},{"v":0,"d":"0.0"},{"$f":"'Übersicht Schützen'!L48","v":{"v":0,"d":"0.0"}},{"$f":"'Übersicht Schützen'!M48","v":{"v":0,"d":"0.0"}},{"$f":"'Übersicht Schützen'!N48","v":{"v":0,"d":"0.0"}},{"$f":"'Übersicht Schützen'!O48","v":{"v":0,"d":"0.0"}},{"$f":"'Übersicht Schützen'!P48","v":{"v":0,"d":"0.0"}},{"$f":"'Übersicht Schützen'!Q48","v":{"v":0,"d":"0.0"}},{"$f":"'Übersicht Schützen'!R48","v":{"v":0,"d":"0.00"}},{"v":0,"d":"0.0"},{"$f":"'Übersicht Schützen'!U48","v":{"v":0,"d":"0.00"}},{"v":0,"d":"0.0"},{"v":0,"d":"0.0"}]
[48,{"$f":"'Übersicht Schützen'!A49","v":"Schütze 48"},{"$f":"'Übersicht Schützen'!B49","v":"Verein X"},{"$f":"'Übersicht Schützen'!C49","v":{"v":0,"d":"0.0"}},{"$f":"'Übersicht Schützen'!D49","v":{"v":0,"d":"0.0"}},{"$f":"'Übersicht Schützen'!E49","v":{"v":0,"d":"0.0"}},{"$f":"'Übersicht Schützen'!F49","v":{"v":0,"d":"0.0"}},{"$f":"'Übersicht Schützen'!G49","v":{"v":0,"d":"0.0"}},{"$f":"'Übersicht Schützen'!H49","v":{"v":0,"d":"0.0"}},{"$f":"'Übersicht Schützen'!I49","v":{"v":0,"d":"0.00"}},{"v":0,"d":"0.0"},{"$f":"'Übersicht Schützen'!L49","v":{"v":0,"d":"0.0"}},{"$f":"'Übersicht Schützen'!M49","v":{"v":0,"d":"0.0"}},{"$f":"'Übersicht Schützen'!N49","v":{"v":0,"d":"0.0"}},{"$f":"'Übersicht Schützen'!O49","v":{"v":0,"d":"0.0"}},{"$f":"'Übersicht Schützen'!P49","v":{"v":0,"d":"0.0"}},{"$f":"'Übersicht Schützen'!Q49","v":{"v":0,"d":"0.0"}},{"$f":"'Übersicht Schützen'!R49","v":{"v":0,"d":"0.00"}},{"v":0,"d":"0.0"},{"$f":"'Übersicht Schützen'!U49","v":{"v":0,"d":"0.00"}},{"v":0,"d":"0.0"},{"v":0,"d":"0.0"}]
[49,{"$f":"'Übersicht Schützen'!A50","v":"Schütze 49"},{"$f":"'Übersicht Schützen'!B50","v":"Verein X"},{"$f":"'Übersicht Schützen'!C50","v":{"v":0,"d":"0.0"}},{"$f":"'Übersicht Schützen'!D50","v":{"v":0,"d":"0.0"}},{"$f":"'Übersicht Schützen'!E50","v":{"v":0,"d":"0.0"}},{"$f":"'Übersicht Schützen'!F50","v":{"v":0,"d":"0.0"}},{"$f":"'Übersicht Schützen'!G50","v":{"v":0,"d":"0.0"}},{"$f":"'Übersicht Schützen'!H50","v":{"v":0,"d":"0.0"}},{"$f":"'Übersicht Schützen'!I50","v":{"v":0,"d":"0.00"}},{"v":0,"d":"0.0"},{"$f":"'Übersicht Schützen'!L50","v":{"v":0,"d":"0.0"}},{"$f":"'Übersicht Schützen'!M50","v":{"v":0,"d":"0.0"}},{"$f":"'Übersicht Schützen'!N50","v":{"v":0,"d":"0.0"}},{"$f":"'Übersicht Schützen'!O50","v":{"v":0,"d":"0.0"}},{"$f":"'Übersicht Schützen'!P50","v":{"v":0,"d":"0.0"}},{"$f":"'Übersicht Schützen'!Q50","v":{"v":0,"d":"0.0"}},{"$f":"'Übersicht Schützen'!R50","v":{"v":0,"d":"0.00"}},{"v":0,"d":"0.0"},{"$f":"'Übersicht Schützen'!U50","v":{"v":0,"d":"0.00"}},{"v":0,"d":"0.0"},{"v":0,"d":"0.0"}]
[50,{"$f":"'Übersicht Schützen'!A51","v":"Schütze 50"},{"$f":"'Übersicht Schützen'!B51","v":"Verein X"},{"$f":"'Übersicht Schützen'!C51","v":{"v":0,"d":"0.0"}},{"$f":"'Übersicht Schützen'!D51","v":{"v":0,"d":"0.0"}},{"$f":"'Übersicht Schützen'!E51","v":{"v":0,"d":"0.0"}},{"$f":"'Übersicht Schützen'!F51","v":{"v":0,"d":"0.0"}},{"$f":"'Übersicht Schützen'!G51","v":{"v":0,"d":"0.0"}},{"$f":"'Übersicht Schützen'!H51","v":{"v":0,"d":"0.0"}},{"$f":"'Übersicht Schützen'!I51","v":{"v":0,"d":"0.00"}},{"v":0,"d":"0.0"},{"$f":"'Übersicht Schützen'!L51","v":{"v":0,"d":"0.0"}},{"$f":"'Übersicht Schützen'!M51","v":{"v":0,"d":"0.0"}},{"$f":"'Übersicht Schützen'!N51","v":{"v":0,"d":"0.0"}},{"$f":"'Übersicht Schützen'!O51","v":{"v":0,"d":"0.0"}},{"$f":"'Übersicht Schützen'!P51","v":{"v":0,"d":"0.0"}},{"$f":"'Übersicht Schützen'!Q51","v":{"v":0,"d":"0.0"}},{"$f":"'Übersicht Schützen'!R51","v":{"v":0,"d":"0.00"}},{"v":0,"d":"0.0"},{"$f":"'Übersicht Schützen'!U51","v":{"v":0,"d":"0.00"}},{"v":0,"d":"0.0"},{"v":0,"d":"0.0"}]
[51,{"$f":"'Übersicht Schützen'!A52","v":"Schütze 51"},{"$f":"'Übersicht Schützen'!B52","v":"Verein XI"},{"$f":"'Übersicht Schützen'!C52","v":{"v":0,"d":"0.0"}},{"$f":"'Übersicht Schützen'!D52","v":{"v":0,"d":"0.0"}},{"$f":"'Übersicht Schützen'!E52","v":{"v":0,"d":"0.0"}},{"$f":"'Übersicht Schützen'!F52","v":{"v":0,"d":"0.0"}},{"$f":"'Übersicht Schützen'!G52","v":{"v":0,"d":"0.0"}},{"$f":"'Übersicht Schützen'!H52","v":{"v":0,"d":"0.0"}},{"$f":"'Übersicht Schützen'!I52","v":{"v":0,"d":"0.00"}},{"v":0,"d":"0.0"},{"$f":"'Übersicht Schützen'!L52","v":{"v":0,"d":"0.0"}},{"$f":"'Übersicht Schützen'!M52","v":{"v":0,"d":"0.0"}},{"$f":"'Übersicht Schützen'!N52","v":{"v":0,"d":"0.0"}},{"$f":"'Übersicht Schützen'!O52","v":{"v":0,"d":"0.0"}},{"$f":"'Übersicht Schützen'!P52","v":{"v":0,"d":"0.0"}},{"$f":"'Übersicht Schützen'!Q52","v":{"v":0,"d":"0.0"}},{"$f":"'Übersicht Schützen'!R52","v":{"v":0,"d":"0.00"}},{"v":0,"d":"0.0"},{"$f":"'Übersicht Schützen'!U52","v":{"v":0,"d":"0.00"}},{"v":0,"d":"0.0"},{"v":0,"d":"0.0"}]
[52,{"$f":"'Übersicht Schützen'!A53","v":"Schütze 52"},{"$f":"'Übersicht Schützen'!B53","v":"Verein XI"},{"$f":"'Übersicht Schützen'!C53","v":{"v":0,"d":"0.0"}},{"$f":"'Übersicht Schützen'!D53","v":{"v":0,"d":"0.0"}},{"$f":"'Übersicht Schützen'!E53","v":{"v":0,"d":"0.0"}},{"$f":"'Übersicht Schützen'!F53","v":{"v":0,"d":"0.0"}},{"$f":"'Übersicht Schützen'!G53","v":{"v":0,"d":"0.0"}},{"$f":"'Übersicht Schützen'!H53","v":{"v":0,"d":"0.0"}},{"$f":"'Übersicht Schützen'!I53","v":{"v":0,"d":"0.00"}},{"v":0,"d":"0.0"},{"$f":"'Übersicht Schützen'!L53","v":{"v":0,"d":"0.0"}},{"$f":"'Übersicht Schützen'!M53","v":{"v":0,"d":"0.0"}},{"$f":"'Übersicht Schützen'!N53","v":{"v":0,"d":"0.0"}},{"$f":"'Übersicht Schützen'!O53","v":{"v":0,"d":"0.0"}},{"$f":"'Übersicht Schützen'!P53","v":{"v":0,"d":"0.0"}},{"$f":"'Übersicht Schützen'!Q53","v":{"v":0,"d":"0.0"}},{"$f":"'Übersicht Schützen'!R53","v":{"v":0,"d":"0.00"}},{"v":0,"d":"0.0"},{"$f":"'Übersicht Schützen'!U53","v":{"v":0,"d":"0.00"}},{"v":0,"d":"0.0"},{"v":0,"d":"0.0"}]
[53,{"$f":"'Übersicht Schützen'!A54","v":"Schütze 53"},{"$f":"'Übersicht Schützen'!B54","v":"Verein XI"},{"$f":"'Übersicht Schützen'!C54","v":{"v":0,"d":"0.0"}},{"$f":"'Übersicht Schützen'!D54","v":{"v":0,"d":"0.0"}},{"$f":"'Übersicht Schützen'!E54","v":{"v":0,"d":"0.0"}},{"$f":"'Übersicht Schützen'!F54","v":{"v":0,"d":"0.0"}},{"$f":"'Übersicht Schützen'!G54","v":{"v":0,"d":"0.0"}},{"$f":"'Übersicht Schützen'!H54","v":{"v":0,"d":"0.0"}},{"$f":"'Übersicht Schützen'!I54","v":{"v":0,"d":"0.00"}},{"v":0,"d":"0.0"},{"$f":"'Übersicht Schützen'!L54","v":{"v":0,"d":"0.0"}},{"$f":"'Übersicht Schützen'!M54","v":{"v":0,"d":"0.0"}},{"$f":"'Übersicht Schützen'!N54","v":{"v":0,"d":"0.0"}},{"$f":"'Übersicht Schützen'!O54","v":{"v":0,"d":"0.0"}},{"$f":"'Übersicht Schützen'!P54","v":{"v":0,"d":"0.0"}},{"$f":"'Übersicht Schützen'!Q54","v":{"v":0,"d":"0.0"}},{"$f":"'Übersicht Schützen'!R54","v":{"v":0,"d":"0.00"}},{"v":0,"d":"0.0"},{"$f":"'Übersicht Schützen'!U54","v":{"v":0,"d":"0.00"}},{"v":0,"d":"0.0"},{"v":0,"d":"0.0"}]
[54,{"$f":"'Übersicht Schützen'!A55","v":"Schütze 54"},{"$f":"'Übersicht Schützen'!B55","v":"Verein XI"},{"$f":"'Übersicht Schützen'!C55","v":{"v":0,"d":"0.0"}},{"$f":"'Übersicht Schützen'!D55","v":{"v":0,"d":"0.0"}},{"$f":"'Übersicht Schützen'!E55","v":{"v":0,"d":"0.0"}},{"$f":"'Übersicht Schützen'!F55","v":{"v":0,"d":"0.0"}},{"$f":"'Übersicht Schützen'!G55","v":{"v":0,"d":"0.0"}},{"$f":"'Übersicht Schützen'!H55","v":{"v":0,"d":"0.0"}},{"$f":"'Übersicht Schützen'!I55","v":{"v":0,"d":"0.00"}},{"v":0,"d":"0.0"},{"$f":"'Übersicht Schützen'!L55","v":{"v":0,"d":"0.0"}},{"$f":"'Übersicht Schützen'!M55","v":{"v":0,"d":"0.0"}},{"$f":"'Übersicht Schützen'!N55","v":{"v":0,"d":"0.0"}},{"$f":"'Übersicht Schützen'!O55","v":{"v":0,"d":"0.0"}},{"$f":"'Übersicht Schützen'!P55","v":{"v":0,"d":"0.0"}},{"$f":"'Übersicht Schützen'!Q55","v":{"v":0,"d":"0.0"}},{"$f":"'Übersicht Schützen'!R55","v":{"v":0,"d":"0.00"}},{"v":0,"d":"0.0"},{"$f":"'Übersicht Schützen'!U55","v":{"v":0,"d":"0.00"}},{"v":0,"d":"0.0"},{"v":0,"d":"0.0"}]
[55,{"$f":"'Übersicht Schützen'!A56","v":"Schütze 55"},{"$f":"'Übersicht Schützen'!B56","v":"Verein XI"},{"$f":"'Übersicht Schützen'!C56","v":{"v":0,"d":"0.0"}},{"$f":"'Übersicht Schützen'!D56","v":{"v":0,"d":"0.0"}},{"$f":"'Übersicht Schützen'!E56","v":{"v":0,"d":"0.0"}},{"$f":"'Übersicht Schützen'!F56","v":{"v":0,"d":"0.0"}},{"$f":"'Übersicht Schützen'!G56","v":{"v":0,"d":"0.0"}},{"$f":"'Übersicht Schützen'!H56","v":{"v":0,"d":"0.0"}},{"$f":"'Übersicht Schützen'!I56","v":{"v":0,"d":"0.00"}},{"v":0,"d":"0.0"},{"$f":"'Übersicht Schützen'!L56","v":{"v":0,"d":"0.0"}},{"$f":"'Übersicht Schützen'!M56","v":{"v":0,"d":"0.0"}},{"$f":"'Übersicht Schützen'!N56","v":{"v":0,"d":"0.0"}},{"$f":"'Übersicht Schützen'!O56","v":{"v":0,"d":"0.0"}},{"$f":"'Übersicht Schützen'!P56","v":{"v":0,"d":"0.0"}},{"$f":"'Übersicht Schützen'!Q56","v":{"v":0,"d":"0.0"}},{"$f":"'Übersicht Schützen'!R56","v":{"v":0,"d":"0.00"}},{"v":0,"d":"0.0"},{"$f":"'Übersicht Schützen'!U56","v":{"v":0,"d":"0.00"}},{"v":0,"d":"0.0"},{"v":0,"d":"0.0"}]
[56,{"$f":"'Übersicht Schützen'!A57","v":"Schütze 56"},{"$f":"'Übersicht Schützen'!B57","v":"Verein XII"},{"$f":"'Übersicht Schützen'!C57","v":{"v":0,"d":"0.0"}},{"$f":"'Übersicht Schützen'!D57","v":{"v":0,"d":"0.0"}},{"$f":"'Übersicht Schützen'!E57","v":{"v":0,"d":"0.0"}},{"$f":"'Übersicht Schützen'!F57","v":{"v":0,"d":"0.0"}},{"$f":"'Übersicht Schützen'!G57","v":{"v":0,"d":"0.0"}},{"$f":"'Übersicht Schützen'!H57","v":{"v":0,"d":"0.0"}},{"$f":"'Übersicht Schützen'!I57","v":{"v":0,"d":"0.00"}},{"v":0,"d":"0.0"},{"$f":"'Übersicht Schützen'!L57","v":{"v":0,"d":"0.0"}},{"$f":"'Übersicht Schützen'!M57","v":{"v":0,"d":"0.0"}},{"$f":"'Übersicht Schützen'!N57","v":{"v":0,"d":"0.0"}},{"$f":"'Übersicht Schützen'!O57","v":{"v":0,"d":"0.0"}},{"$f":"'Übersicht Schützen'!P57","v":{"v":0,"d":"0.0"}},{"$f":"'Übersicht Schützen'!Q57","v":{"v":0,"d":"0.0"}},{"$f":"'Übersicht Schützen'!R57","v":{"v":0,"d":"0.00"}},{"v":0,"d":"0.0"},{"$f":"'Übersicht Schützen'!U57","v":{"v":0,"d":"0.00"}},{"v":0,"d":"0.0"},{"v":0,"d":"0.0"}]
[57,{"$f":"'Übersicht Schützen'!A58","v":"Schütze 57"},{"$f":"'Übersicht Schützen'!B58","v":"Verein XII"},{"$f":"'Übersicht Schützen'!C58","v":{"v":0,"d":"0.0"}},{"$f":"'Übersicht Schützen'!D58","v":{"v":0,"d":"0.0"}},{"$f":"'Übersicht Schützen'!E58","v":{"v":0,"d":"0.0"}},{"$f":"'Übersicht Schützen'!F58","v":{"v":0,"d":"0.0"}},{"$f":"'Übersicht Schützen'!G58","v":{"v":0,"d":"0.0"}},{"$f":"'Übersicht Schützen'!H58","v":{"v":0,"d":"0.0"}},{"$f":"'Übersicht Schützen'!I58","v":{"v":0,"d":"0.00"}},{"v":0,"d":"0.0"},{"$f":"'Übersicht Schützen'!L58","v":{"v":0,"d":"0.0"}},{"$f":"'Übersicht Schützen'!M58","v":{"v":0,"d":"0.0"}},{"$f":"'Übersicht Schützen'!N58","v":{"v":0,"d":"0.0"}},{"$f":"'Übersicht Schützen'!O58","v":{"v":0,"d":"0.0"}},{"$f":"'Übersicht Schützen'!P58","v":{"v":0,"d":"0.0"}},{"$f":"'Übersicht Schützen'!Q58","v":{"v":0,"d":"0.0"}},{"$f":"'Übersicht Schützen'!R58","v":{"v":0,"d":"0.00"}},{"v":0,"d":"0.0"},{"$f":"'Übersicht Schützen'!U58","v":{"v":0,"d":"0.00"}},{"v":0,"d":"0.0"},{"v":0,"d":"0.0"}]
[58,{"$f":"'Übersicht Schützen'!A59","v":"Schütze 58"},{"$f":"'Übersicht Schützen'!B59","v":"Verein XII"},{"$f":"'Übersicht Schützen'!C59","v":{"v":0,"d":"0.0"}},{"$f":"'Übersicht Schützen'!D59","v":{"v":0,"d":"0.0"}},{"$f":"'Übersicht Schützen'!E59","v":{"v":0,"d":"0.0"}},{"$f":"'Übersicht Schützen'!F59","v":{"v":0,"d":"0.0"}},{"$f":"'Übersicht Schützen'!G59","v":{"v":0,"d":"0.0"}},{"$f":"'Übersicht Schützen'!H59","v":{"v":0,"d":"0.0"}},{"$f":"'Übersicht Schützen'!I59","v":{"v":0,"d":"0.00"}},{"v":0,"d":"0.0"},{"$f":"'Übersicht Schützen'!L59","v":{"v":0,"d":"0.0"}},{"$f":"'Übersicht Schützen'!M59","v":{"v":0,"d":"0.0"}},{"$f":"'Übersicht Schützen'!N59","v":{"v":0,"d":"0.0"}},{"$f":"'Übersicht Schützen'!O59","v":{"v":0,"d":"0.0"}},{"$f":"'Übersicht Schützen'!P59","v":{"v":0,"d":"0.0"}},{"$f":"'Übersicht Schützen'!Q59","v":{"v":0,"d":"0.0"}},{"$f":"'Übersicht Schützen'!R59","v":{"v":0,"d":"0.00"}},{"v":0,"d":"0.0"},{"$f":"'Übersicht Schützen'!U59","v":{"v":0,"d":"0.00"}},{"v":0,"d":"0.0"},{"v":0,"d":"0.0"}]
[59,{"$f":"'Übersicht Schützen'!A60","v":"Schütze 59"},{"$f":"'Übersicht Schützen'!B60","v":"Verein XII"},{"$f":"'Übersicht Schützen'!C60","v":{"v":0,"d":"0.0"}},{"$f":"'Übersicht Schützen'!D60","v":{"v":0,"d":"0.0"}},{"$f":"'Übersicht Schützen'!E60","v":{"v":0,"d":"0.0"}},{"$f":"'Übersicht Schützen'!F60","v":{"v":0,"d":"0.0"}},{"$f":"'Übersicht Schützen'!G60","v":{"v":0,"d":"0.0"}},{"$f":"'Übersicht Schützen'!H60","v":{"v":0,"d":"0.0"}},{"$f":"'Übersicht Schützen'!I60","v":{"v":0,"d":"0.00"}},{"v":0,"d":"0.0"},{"$f":"'Übersicht Schützen'!L60","v":{"v":0,"d":"0.0"}},{"$f":"'Übersicht Schützen'!M60","v":{"v":0,"d":"0.0"}},{"$f":"'Übersicht Schützen'!N60","v":{"v":0,"d":"0.0"}},{"$f":"'Übersicht Schützen'!O60","v":{"v":0,"d":"0.0"}},{"$f":"'Übersicht Schützen'!P60","v":{"v":0,"d":"0.0"}},{"$f":"'Übersicht Schützen'!Q60","v":{"v":0,"d":"0.0"}},{"$f":"'Übersicht Schützen'!R60","v":{"v":0,"d":"0.00"}},{"v":0,"d":"0.0"},{"$f":"'Übersicht Schützen'!U60","v":{"v":0,"d":"0.00"}},{"v":0,"d":"0.0"},{"v":0,"d":"0.0"}]
[60,{"$f":"'Übersicht Schützen'!A61","v":"Schütze 60"},{"$f":"'Übersicht Schützen'!B61","v":"Verein XII"},{"$f":"'Übersicht Schützen'!C61","v":{"v":0,"d":"0.0"}},{"$f":"'Übersicht Schützen'!D61","v":{"v":0,"d":"0.0"}},{"$f":"'Übersicht Schützen'!E61","v":{"v":0,"d":"0.0"}},{"$f":"'Übersicht Schützen'!F61","v":{"v":0,"d":"0.0"}},{"$f":"'Übersicht Schützen'!G61","v":{"v":0,"d":"0.0"}},{"$f":"'Übersicht Schützen'!H61","v":{"v":0,"d":"0.0"}},{"$f":"'Übersicht Schützen'!I61","v":{"v":0,"d":"0.00"}},{"v":0,"d":"0.0"},{"$f":"'Übersicht Schützen'!L61","v":{"v":0,"d":"0.0"}},{"$f":"'Übersicht Schützen'!M61","v":{"v":0,"d":"0.0"}},{"$f":"'Übersicht Schützen'!N61","v":{"v":0,"d":"0.0"}},{"$f":"'Übersicht Schützen'!O61","v":{"v":0,"d":"0.0"}},{"$f":"'Übersicht Schützen'!P61","v":{"v":0,"d":"0.0"}},{"$f":"'Übersicht Schützen'!Q61","v":{"v":0,"d":"0.0"}},{"$f":"'Übersicht Schützen'!R61","v":{"v":0,"d":"0.00"}},{"v":0,"d":"0.0"},{"$f":"'Übersicht Schützen'!U61","v":{"v":0,"d":"0.00"}},{"v":0,"d":"0.0"},{"v":0,"d":"0.0"}]
[]
[null,null,"Schnitt:",{"$f":"IF(Formelhilfe!B75 > 0, SUM(D23:D82)/Formelhilfe!B75, 0)","v":{"v":292.31333333333333,"d":"292.3"}},{"$f":"IF(Formelhilfe!C75 > 0, SUM(E23:E82)/Formelhilfe!C75, 0)","v":{"v":315.37,"d":"315.4"}},{"$f":"IF(Formelhilfe!D75 > 0, SUM(F23:F82)/Formelhilfe!D75, 0)","v":{"v":320.20000000000005,"d":"320.2"}},{"$f":"IF(Formelhilfe!E75 > 0, SUM(G23:G82)/Formelhilfe!E75, 0)","v":{"v":317.2105263157896,"d":"317.2"}},{"$f":"IF(Formelhilfe!F75 > 0, SUM(H23:H82)/Formelhilfe!F75, 0)","v":{"v":318.68181818181824,"d":"318.7"}},{"$f":"IF(Formelhilfe!G75 > 0, SUM(I23:I82)/Formelhilfe!G75, 0)","v":{"v":0,"d":"0.0"}},{"$f":"IF(SUM(J23:J82)<>0,AVERAGEIF(J23:J82,\"<>0\"),0)","v":{"v":302.8470000000001,"d":"302.85"}},{"$f":"IF(SUM(K23:K82)<>0,AVERAGEIF(K23:K82,\"<>0\"),0)","v":{"v":1045.6649999999997,"d":"1045.67"}},{"$f":"IF(Formelhilfe!I75 > 0, SUM(L23:L82)/Formelhilfe!I75, 0)","v":{"v":328.03333333333336,"d":"328.0"}},{"$f":"IF(Formelhilfe!J75 > 0, SUM(M23:M82)/Formelhilfe!J75, 0)","v":{"v":331.96363636363634,"d":"332.0"}},{"$f":"IF(Formelhilfe!K75 > 0, SUM(N23:N82)/Formelhilfe!K75, 0)","v":{"v":0,"d":"0.0"}},{"$f":"IF(Formelhilfe!L75 > 0, SUM(O23:O82)/Formelhilfe!L75, 0)","v":{"v":0,"d":"0.0"}},{"$f":"IF(Formelhilfe!M75 > 0, SUM(P23:P82)/Formelhilfe!M75, 0)","v":{"v":0,"d":"0.0"}},{"$f":"IF(Formelhilfe!N75 > 0, SUM(Q23:Q82)/Formelhilfe!N75, 0)","v":{"v":0,"d":"0.0"}},{"$f":"IF(SUM(R23:R82)<>0,AVERAGEIF(R23:R82,\"<>0\"),0)","v":{"v":327.82916666666665,"d":"327.83"}},{"$f":"IF(SUM(S23:S82)<>0,AVERAGEIF(S23:S82,\"<>0\"),0)","v":{"v":632.3333333333333,"d":"632.33"}},{"$f":"IF(SUM(T23:T82)<>0,AVERAGEIF(T23:T82,\"<>0\"),0)","v":{"v":303.3049166666667,"d":"303.30"}},{"$f":"(K84+S84)","v":{"v":1677.998333333333,"d":"1,678.00 "}}]

{"sheet":"Wettkampf 1","index":1,"n_rows":77,"n_cols":41,"rows_kept":77,"merged":[[0,36,0,37],[1,36,1,37],[4,36,4,37],[5,36,5,37],[6,36,6,37],[14,34,14,37]]}
[null,"Verein / Gruppe",null,"Ergebnisse",{"$nulls":31},"Austragungsort:",{"$f":"Übersicht!D4","v":"Lorup"}]
[1,"Esterwegen",null,{"$f":"G76","v":200.6},{"$f":"IF(H76>4,\"Es sind zu viele Schützen in Wertung!\",\" \")","v":" "},{"$nulls":30},"Wettkampftag:",{"$f":"Übersicht!D3","v":"07.09."}]
[2,"Lähden Jugend I",null,{"$f":"I76","v":{"v":1059.8000000000002,"d":"1059.8"}},{"$f":"IF(J76>4,\"Es sind zu viele Schützen in Wertung!\",\" \")","v":" "}]
[3,"Börgerwald",null,{"$f":"K76","v":{"v":674,"d":"674.0"}},{"$f":"IF(L76>4,\"Es sind zu viele Schützen in Wertung!\",\" \")","v":" "},{"$nulls":32},"Ansprechpartner für Rückfragen:"]
[4,"Börgermoor",null,{"$f":"M76","v":955.5},{"$f":"IF(N76>4,\"Es sind zu viele Schützen in Wertung!\",\" \")","v":" "},{"$nulls":30},"Name:","Gretenabeln"]
[5,"Spahnharrenstätte",null,{"$f":"O76","v":613.5},{"$f":"IF(P76>4,\"Es sind zu viele Schützen in Wertung!\",\" \")","v":" "},{"$nulls":30},"Tel:"]
[6,"Lorup",null,{"$f":"Q76","v":274.7},{"$f":"IF(R76>4,\"Es sind zu viele Schützen in Wertung!\",\" \")","v":" "},{"$nulls":30},"Standaufsicht:","Luttmann"]
[7,"Lahn",null,{"$f":"S76","v":{"v":305,"d":"305.0"}},{"$f":"IF(T76>4,\"Es sind zu viele Schützen in Wertung!\",\" \")","v":" "}]
[8,"Sögel",null,{"$f":"U76","v":{"v":0,"d":"0.0"}},{"$f":"IF(V76>4,\"Es sind zu viele Schützen in Wertung!\",\" \")","v":"Es sind zu viele Schützen in Wertung!"}]
[9,"Verein IX",null,{"$f":"W76","v":{"v":0,"d":"0.0"}},{"$f":"IF(X76>4,\"Es sind zu viele Schützen in Wertung!\",\" \")","v":"Es sind zu viele Schützen in Wertung!"}]
[10,"Verein X",null,{"$f":"Y76","v":{"v":0,"d":"0.0"}},{"$f":"IF(Z76>4,\"Es sind zu viele Schützen in Wertung!\",\" \")","v":"Es sind zu viele Schützen in Wertung!"}]
[11,"Verein XI",null,{"$f":"AA76","v":{"v":0,"d":"0.0"}},{"$f":"IF(AB76>4,\"Es sind zu viele Schützen in Wertung!\",\" \")","v":"Es sind zu viele Schützen in Wertung!"}]
[12,"Verein XII",null,{"$f":"AC76","v":{"v":0,"d":"0.0"}},{"$f":"IF(AD76>4,\"Es sind zu viele Schützen in Wertung!\",\" \")","v":"Es sind zu viele Schützen in Wertung!"}]
[]
[null,"Einzelergebnisse:","Verein/Gruppe (per Dropdown-Feld einzutragen)","Ergebnisse","AW? Dann x eintippen",null,"Verein 1",null,"Verein 2",null,"Verein 3",null,"Verein 4",null,"Verein 5",null,"Verein 6",null,"Verein 7",null,"Verein 8",null,"Verein 9",null,"Verein 10",null,"Verein 11",null,"Verein 12",{"$nulls":3},"Geburtsdatum",null,"Proberechnung bei Streifen:"]
[1,"Gedecksnis Stefan",{"$f":"B2","v":"Esterwegen"},200.6,null,{"$f":"IF(E16=\"x\",\"0\",D16)","v":200.6},{"$f":"IF(C16=$B$2,F16,0)","v":200.6},{"$f":"(IF(AND($E16=\"\",$C16=$B$2),1,0))","v":1},{"$f":"IF($C16=$B$3,F16,0)","v":0},{"$f":"(IF(AND($E16=\"\",$C16=$B$3),1,0))","v":0},{"$f":"IF($C16=$B$4,F16,0)","v":0},{"$f":"(IF(AND($E16=\"\",$C16=$B$4),1,0))","v":0},{"$f":"IF($C16=$B$5,F16,0)","v":0},{"$f":"(IF(AND($E16=\"\",$C16=$B$5),1,0))","v":0},{"$f":"IF($C16=$B$6,F16,0)","v":0},{"$f":"(IF(AND($E16=\"\",$C16=$B$6),1,0))","v":0},{"$f":"IF($C16=$B$7,F16,0)","v":0},{"$f":"(IF(AND($E16=\"\",$C16=$B$7),1,0))","v":0},{"$f":"IF($C16=$B$8,F16,0)","v":0},{"$f":"(IF(AND($E16=\"\",$C16=$B$8),1,0))","v":0},{"$f":"IF($C16=$B$9,F16,0)","v":0},{"$f":"(IF(AND($E16=\"\",$C16=$B$9),1,0))","v":0},{"$f":"IF($C16=$B$10,F16,0)","v":0},{"$f":"(IF(AND($E16=\"\",$C16=$B$10),1,0))","v":0},{"$f":"IF($C16=$B$11,F16,0)","v":0},{"$f":"(IF(AND($E16=\"\",$C16=$B$11),1,0))","v":0},{"$f":"IF($C16=$B$12,F16,0)","v":0},{"$f":"(IF(AND($E16=\"\",$C16=$B$12),1,0))","v":0},{"$f":"IF($C16=$B$13,F16,0)","v":0},{"$f":"(IF(AND($E16=\"\",$C16=$B$13),1,0))","v":0},{"$nulls":7},{"$f":"SUM(AI16:AK16)","v":{"v":0,"d":"0.0"}},{"$f":"IF(AL16=D16,1,0)","v":0},{"$f":"IF(AL16=0,0,1)","v":0},{"$f":"IF(AM16+AN16=2,\"Korrekt\",\"\")","v":""}]
[2,"Wübben Jasper",{"$f":"B2","v":"Esterwegen"},null,null,{"$f":"IF(E17=\"x\",\"0\",D17)","v":0},0,{"$f":"(IF(AND($E17=\"\",$C17=$B$2),1,0))","v":1},0,{"$f":"(IF(AND($E17=\"\",$C17=$B$3),1,0))","v":0},0,{"$f":"(IF(AND($E17=\"\",$C17=$B$4),1,0))","v":0},0,{"$f":"(IF(AND($E17=\"\",$C17=$B$5),1,0))","v":0},0,{"$f":"(IF(AND($E17=\"\",$C17=$B$6),1,0))","v":0},0,{"$f":"(IF(AND($E17=\"\",$C17=$B$7),1,0))","v":0},{"$f":"IF($C17=$B$8,F17,0)","v":0},{"$f":"(IF(AND($E17=\"\",$C17=$B$8),1,0))","v":0},{"$f":"IF($C17=$B$9,F17,0)","v":0},{"$f":"(IF(AND($E17=\"\",$C17=$B$9),1,0))","v":0},{"$f":"IF($C17=$B$10,F17,0)","v":0},{"$f":"(IF(AND($E17=\"\",$C17=$B$10),1,0))","v":0},{"$f":"IF($C17=$B$11,F17,0)","v":0},{"$f":"(IF(AND($E17=\"\",$C17=$B$11),1,0))","v":0},{"$f":"IF($C17=$B$12,F17,0)","v":0},{"$f":"(IF(AND($E17=\"\",$C17=$B$12),1,0))","v":0},{"$f":"IF($C17=$B$13,F17,0)","v":0},{"$f":"(IF(AND($E17=\"\",$C17=$B$13),1,0))","v":0},{"$nulls":7},{"$f":"SUM(AI17:AK17)","v":{"v":0,"d":"0.0"}},{"$f":"IF(AL17=D17,1,0)","v":1},{"$f":"IF(AL17=0,0,1)","v":0},{"$f":"IF(AM17+AN17=2,\"Korrekt\",\"\")","v":""}]
[3,"Engbers Julian",{"$f":"B2","v":"Esterwegen"},null,null,0,0,1,0,0,0,0,0,0,0,0,0,0,0,0,0,0,0,0,0,0,0,0,0,0,{"$nulls":7},{"v":0,"d":"0.0"},1,0,""]
[4,"Meyer Johan",{"$f":"B2","v":"Esterwegen"},null,null,0,0,1,0,0,0,0,0,0,0,0,0,0,0,0,0,0,0,0,0,0,0,0,0,0,{"$nulls":7},{"v":0,"d":"0.0"},1,0,""]
[5,"Schütze 5",{"$f":"B2","v":"Esterwegen"},null,"x","0","0",0,0,0,0,0,0,0,0,0,0,0,0,0,0,0,0,0,0,0,0,0,0,0,{"$nulls":7},{"v":0,"d":"0.0"},1,0,""]
[6,"Strüwing Inja",{"$f":"B3","v":"Lähden Jugend I"},375.8,null,375.8,0,0,375.8,1,0,0,0,0,0,0,0,0,0,0,0,0,0,0,0,0,0,0,0,0,{"$nulls":7},{"v":0,"d":"0.0"},0,0,""]
[7,"Bruns Hendrik",{"$f":"B3","v":"Lähden Jugend I"},356.9,null,356.9,0,0,356.9,1,0,0,0,0,0,0,0,0,0,0,0,0,0,0,0,0,0,0,0,0,{"$nulls":7},{"v":0,"d":"0.0"},0,0,""]
[8,"Feldhaus Vanessa",{"$f":"B3","v":"Lähden Jugend I"},301.6,null,301.6,0,0,301.6,1,0,0,0,0,0,0,0,0,0,0,0,0,0,0,0,0,0,0,0,0,{"$nulls":7},{"v":0,"d":"0.0"},0,0,""]
[9,"Feldhaus Celien ",{"$f":"B3","v":"Lähden Jugend I"},327.1,null,327.1,0,0,327.1,1,0,0,0,0,0,0,0,0,0,0,0,0,0,0,0,0,0,0,0,0,{"$nulls":7},{"v":0,"d":"0.0"},0,0,""]
[10,"Stümpler Jan-Luca",{"$f":"B3","v":"Lähden Jugend I"},null,"x","0",0,0,"0",0,0,0,0,0,0,0,0,0,0,0,0,0,0,0,0,0,0,0,0,0,{"$nulls":7},{"v":0,"d":"0.0"},1,0,""]
[11,"Hanneken Maren",{"$f":"B4","v":"Börgerwald"},{"v":321,"d":"321.0"},null,321,0,0,0,0,321,1,0,0,0,0,0,0,0,0,0,0,0,0,0,0,0,0,0,0,{"$nulls":7},{"v":0,"d":"0.0"},0,0,""]
[12,"Köstering Nele",{"$f":"B4","v":"Börgerwald"},{"v":353,"d":"353.0"},null,353,0,0,0,0,353,1,0,0,0,0,0,0,0,0,0,0,0,0,0,0,0,0,0,0,{"$nulls":7},{"v":0,"d":"0.0"},0,0,""]
[13,"Lohmann Amy",{"$f":"B4","v":"Börgerwald"},null,null,0,0,0,0,0,0,1,0,0,0,0,0,0,0,0,0,0,0,0,0,0,0,0,0,0,{"$nulls":7},{"v":0,"d":"0.0"},1,0,""]
[14,"Schütze 14",{"$f":"B4","v":"Börgerwald"},null,null,0,0,0,0,0,0,1,0,0,0,0,0,0,0,0,0,0,0,0,0,0,0,0,0,0,{"$nulls":7},{"v":0,"d":"0.0"},1,0,""]
[15,"Schütze 15",{"$f":"B4","v":"Börgerwald"},null,"x","0",0,0,0,0,"0",0,0,0,0,0,0,0,0,0,0,0,0,0,0,0,0,0,0,0,{"$nulls":7},{"v":0,"d":"0.0"},1,0,""]
[16,"Brandt Mira",{"$f":"B5","v":"Börgermoor"},352.7,null,352.7,0,0,0,0,0,0,352.7,1,0,0,0,0,0,0,0,0,0,0,0,0,0,0,0,0,{"$nulls":7},{"v":0,"d":"0.0"},0,0,""]
[17,"Eichhorn Luca",{"$f":"B5","v":"Börgermoor"},298.1,null,298.1,0,{"$f":"(IF(AND($E32=\"\",$C32=$B$2),1,0))","v":0},0,{"$f":"(IF(AND($E32=\"\",$C32=$B$3),1,0))","v":0},0,{"$f":"(IF(AND($E32=\"\",$C32=$B$4),1,0))","v":0},298.1,{"$f":"(IF(AND($E32=\"\",$C32=$B$5),1,0))","v":1},0,{"$f":"(IF(AND($E32=\"\",$C32=$B$6),1,0))","v":0},0,{"$f":"(IF(AND($E32=\"\",$C32=$B$7),1,0))","v":0},{"$f":"IF($C32=$B$8,F32,0)","v":0},{"$f":"(IF(AND($E32=\"\",$C32=$B$8),1,0))","v":0},{"$f":"IF($C32=$B$9,F32,0)","v":0},{"$f":"(IF(AND($E32=\"\",$C32=$B$9),1,0))","v":0},{"$f":"IF($C32=$B$10,F32,0)","v":0},{"$f":"(IF(AND($E32=\"\",$C32=$B$10),1,0))","v":0},{"$f":"IF($C32=$B$11,F32,0)","v":0},{"$f":"(IF(AND($E32=\"\",$C32=$B$11),1,0))","v":0},{"$f":"IF($C32=$B$12,F32,0)","v":0},{"$f":"(IF(AND($E32=\"\",$C32=$B$12),1,0))","v":0},{"$f":"IF($C32=$B$13,F32,0)","v":0},{"$f":"(IF(AND($E32=\"\",$C32=$B$13),1,0))","v":0},{"$nulls":7},{"v":0,"d":"0.0"},0,0,""]
[18,"Kohnen Saskia",{"$f":"B5","v":"Börgermoor"},304.7,null,304.7,0,0,0,0,0,0,304.7,1,0,0,0,0,0,0,0,0,0,0,0,0,0,0,0,0,{"$nulls":7},{"v":0,"d":"0.0"},0,0,""]
[19,"Schütze 19",{"$f":"B5","v":"Börgermoor"},null,null,0,0,0,0,0,0,0,0,1,0,0,0,0,0,0,0,0,0,0,0,0,0,0,0,0,{"$nulls":7},{"v":0,"d":"0.0"},1,0,""]
[20,"Schütze 20",{"$f":"B5","v":"Börgermoor"},null,"x","0",0,0,0,0,0,0,"0",0,0,0,0,0,0,0,0,0,0,0,0,0,0,0,0,0,{"$nulls":7},{"v":0,"d":"0.0"},1,0,""]
[21,"Runde Marcel",{"$f":"B6","v":"Spahnharrenstätte"},295.5,null,295.5,0,0,0,0,0,0,0,0,295.5,1,0,0,0,0,0,0,0,0,0,0,0,0,0,0,{"$nulls":7},{"v":0,"d":"0.0"},0,0,""]
[22,"Leis Fynn Lucas ",{"$f":"B6","v":"Spahnharrenstätte"},83.8,null,83.8,0,0,0,0,0,0,0,0,83.8,1,0,0,0,0,0,0,0,0,0,0,0,0,0,0,{"$nulls":7},{"v":0,"d":"0.0"},0,0,""]
[23,"Jansen Lars",{"$f":"B6","v":"Spahnharrenstätte"},234.2,null,234.2,0,0,0,0,0,0,0,0,234.2,1,0,0,0,0,0,0,0,0,0,0,0,0,0,0,{"$nulls":7},{"v":0,"d":"0.0"},0,0,""]
[24,"Köster Thilo",{"$f":"B6","v":"Spahnharrenstätte"},null,null,0,0,0,0,0,0,0,0,0,0,1,0,0,0,0,0,0,0,0,0,0,0,0,0,0,{"$nulls":7},{"v":0,"d":"0.0"},1,0,""]
[25,"Schütze 25",{"$f":"B6","v":"Spahnharrenstätte"},null,"x","0",0,0,0,0,0,0,0,0,"0",0,0,0,0,0,0,0,0,0,0,0,0,0,0,0,{"$nulls":7},{"v":0,"d":"0.0"},1,0,""]
[26,"Dolling Leon",{"$f":"B7","v":"Lorup"},274.7,null,274.7,0,0,0,0,0,0,0,0,0,0,274.7,1,0,0,0,0,0,0,0,0,0,0,0,0,{"$nulls":7},{"v":0,"d":"0.0"},0,0,""]
[27,"Schütze 27",{"$f":"B7","v":"Lorup"},null,null,0,0,0,0,0,0,0,0,0,0,0,0,1,0,0,0,0,0,0,0,0,0,0,0,0,{"$nulls":7},{"v":0,"d":"0.0"},1,0,""]
[28,"Schütze 28",{"$f":"B7","v":"Lorup"},null,null,0,0,0,0,0,0,0,0,0,0,0,0,1,0,0,0,0,0,0,0,0,0,0,0,0,{"$nulls":7},{"v":0,"d":"0.0"},1,0,""]
[29,"Schütze 29",{"$f":"B7","v":"Lorup"},null,null,0,0,0,0,0,0,0,0,0,0,0,0,1,0,0,0,0,0,0,0,0,0,0,0,0,{"$nulls":7},{"v":0,"d":"0.0"},1,0,""]
[30,"Schütze 30",{"$f":"B7","v":"Lorup"},null,"x","0",0,0,0,0,0,0,0,0,0,0,"0",0,0,0,0,0,0,0,0,0,0,0,0,0,{"$nulls":7},{"v":0,"d":"0.0"},1,0,""]
[31,"Wilken Noah",{"$f":"B8","v":"Lahn"},{"v":305,"d":"305.0"},null,305,0,0,0,0,0,0,0,0,0,0,0,0,305,1,0,0,0,0,0,0,0,0,0,0,{"$nulls":7},{"v":0,"d":"0.0"},{"$f":"IF(AL46=D46,1,0)","v":0},{"$f":"IF(AL46=0,0,1)","v":0},{"$f":"IF(AM46+AN46=2,\"Korrekt\",\"\")","v":""}]
[32,"Schulz Mika",{"$f":"B8","v":"Lahn"},null,null,0,0,0,0,0,0,0,0,0,0,0,0,0,0,1,0,0,0,0,0,0,0,0,0,0,{"$nulls":7},{"v":0,"d":"0.0"},1,0,""]
[33,"Schütze 33",{"$f":"B8","v":"Lahn"},null,null,0,0,0,0,0,0,0,0,0,0,0,0,0,0,1,0,0,0,0,0,0,0,0,0,0,{"$nulls":7},{"v":0,"d":"0.0"},1,0,""]
[34,"Schütze 34",{"$f":"B8","v":"Lahn"},null,null,0,0,0,0,0,0,0,0,0,0,0,0,0,0,1,0,0,0,0,0,0,0,0,0,0,{"$nulls":7},{"v":0,"d":"0.0"},1,0,""]
[35,"Schütze 35",{"$f":"B8","v":"Lahn"},null,"x","0",0,0,0,0,0,0,0,0,0,0,0,0,"0",0,0,0,0,0,0,0,0,0,0,0,{"$nulls":7},{"v":0,"d":"0.0"},1,0,""]
[36,"Tharner Kim",{"$f":"B9","v":"Sögel"},null,null,0,0,0,0,0,0,0,0,0,0,0,0,0,0,0,0,1,0,0,0,0,0,0,0,0,{"$nulls":7},{"v":0,"d":"0.0"},{"$f":"IF(AL51=D51,1,0)","v":1},{"$f":"IF(AL51=0,0,1)","v":0},{"$f":"IF(AM51+AN51=2,\"Korrekt\",\"\")","v":""}]
[37,"Schütze 37",{"$f":"B9","v":"Sögel"},null,null,0,{"$f":"IF(C52=$B$2,F52,0)","v":0},0,{"$f":"IF($C52=$B$3,F52,0)","v":0},0,{"$f":"IF($C52=$B$4,F52,0)","v":0},0,{"$f":"IF($C52=$B$5,F52,0)","v":0},0,{"$f":"IF($C52=$B$6,F52,0)","v":0},0,{"$f":"IF($C52=$B$7,F52,0)","v":0},0,{"$f":"IF($C52=$B$8,F52,0)","v":0},0,{"$f":"IF($C52=$B$9,F52,0)","v":0},1,{"$f":"IF($C52=$B$10,F52,0)","v":0},0,{"$f":"IF($C52=$B$11,F52,0)","v":0},0,{"$f":"IF($C52=$B$12,F52,0)","v":0},0,{"$f":"IF($C52=$B$13,F52,0)","v":0},0,{"$nulls":7},{"v":0,"d":"0.0"}]
[38,"Schütze 38",{"$f":"B9","v":"Sögel"},null,null,0,0,0,0,0,0,0,0,0,0,0,0,0,0,0,0,1,0,0,0,0,0,0,0,0,{"$nulls":7},{"v":0,"d":"0.0"}]
[39,"Schütze 39",{"$f":"B9","v":"Sögel"},null,null,0,0,0,0,0,0,0,0,0,0,0,0,0,0,0,0,1,0,0,0,0,0,0,0,0,{"$nulls":7},{"v":0,"d":"0.0"}]
[40,"Schütze 40",{"$f":"B9","v":"Sögel"},null,null,0,0,0,0,0,0,0,0,0,0,0,0,0,0,0,0,1,0,0,0,0,0,0,0,0,{"$nulls":7},{"v":0,"d":"0.0"}]
[41,"Schütze 41",{"$f":"B10","v":"Verein IX"},null,null,0,0,0,0,0,0,0,0,0,0,0,0,0,0,0,0,0,0,1,0,0,0,0,0,0,{"$nulls":7},{"v":0,"d":"0.0"}]
[42,"Schütze 42",{"$f":"B10","v":"Verein IX"},null,null,0,0,0,0,0,0,0,0,0,0,0,0,0,0,0,0,0,0,1,0,0,0,0,0,0,{"$nulls":7},{"v":0,"d":"0.0"}]
[43,"Schütze 43",{"$f":"B10","v":"Verein IX"},null,null,0,0,0,0,0,0,0,0,0,0,0,0,0,0,0,0,0,0,1,0,0,0,0,0,0,{"$nulls":7},{"v":0,"d":"0.0"}]
[44,"Schütze 44",{"$f":"B10","v":"Verein IX"},null,null,0,0,0,0,0,0,0,0,0,0,0,0,0,0,0,0,0,0,1,0,0,0,0,0,0,{"$nulls":7},{"v":0,"d":"0.0"}]
[45,"Schütze 45",{"$f":"B10","v":"Verein IX"},null,null,0,0,0,0,0,0,0,0,0,0,0,0,0,0,0,0,0,0,1,0,0,0,0,0,0,{"$nulls":7},{"v":0,"d":"0.0"}]
[46,"Schütze 46",{"$f":"B11","v":"Verein X"},null,null,0,0,0,0,0,0,0,0,0,0,0,0,0,0,0,0,0,0,0,0,1,0,0,0,0,{"$nulls":7},{"v":0,"d":"0.0"}]
[47,"Schütze 47",{"$f":"B11","v":"Verein X"},null,null,0,0,0,0,0,0,0,0,0,0,0,0,0,0,0,0,0,0,0,0,1,0,0,0,0,{"$nulls":7},{"v":0,"d":"0.0"}]
[48,"Schütze 48",{"$f":"B11","v":"Verein X"},null,null,0,0,0,0,0,0,0,0,0,0,0,0,0,0,0,0,0,0,0,0,1,0,0,0,0,{"$nulls":7},{"v":0,"d":"0.0"}]
[49,"Schütze 49",{"$f":"B11","v":"Verein X"},null,null,0,0,0,0,0,0,0,0,0,0,0,0,0,0,0,0,0,0,0,0,1,0,0,0,0,{"$nulls":7},{"v":0,"d":"0.0"}]
[50,"Schütze 50",{"$f":"B11","v":"Verein X"},null,null,0,0,0,0,0,0,0,0,0,0,0,0,0,0,0,0,0,0,0,0,1,0,0,0,0,{"$nulls":7},{"v":0,"d":"0.0"}]
[51,"Schütze 51",{"$f":"B12","v":"Verein XI"},null,null,0,0,0,0,0,0,0,0,0,0,0,0,0,0,0,0,0,0,0,0,0,0,1,0,0,{"$nulls":7},{"v":0,"d":"0.0"}]
[52,"Schütze 52",{"$f":"B12","v":"Verein XI"},null,null,0,0,0,0,0,0,0,0,0,0,0,0,0,0,0,0,0,0,0,0,0,0,1,0,0,{"$nulls":7},{"v":0,"d":"0.0"}]
[53,"Schütze 53",{"$f":"B12","v":"Verein XI"},null,null,0,0,0,0,0,0,0,0,0,0,0,0,0,0,0,0,0,0,0,0,0,0,1,0,0,{"$nulls":7},{"v":0,"d":"0.0"}]
[54,"Schütze 54",{"$f":"B12","v":"Verein XI"},null,null,0,0,0,0,0,0,0,0,0,0,0,0,0,0,0,0,0,0,0,0,0,0,1,0,0,{"$nulls":7},{"v":0,"d":"0.0"}]
[55,"Schütze 55",{"$f":"B12","v":"Verein XI"},null,null,0,0,0,0,0,0,0,0,0,0,0,0,0,0,0,0,0,0,0,0,0,0,1,0,0,{"$nulls":7},{"v":0,"d":"0.0"}]
[56,"Schütze 56",{"$f":"B13","v":"Verein XII"},null,null,0,0,0,0,0,0,0,0,0,0,0,0,0,0,0,0,0,0,0,0,0,0,0,0,1,{"$nulls":7},{"v":0,"d":"0.0"}]
[57,"Schütze 57",{"$f":"B13","v":"Verein XII"},null,null,0,0,0,0,0,0,0,0,0,0,0,0,0,0,0,0,0,0,0,0,0,0,0,0,1,{"$nulls":7},{"v":0,"d":"0.0"}]
[58,"Schütze 58",{"$f":"B13","v":"Verein XII"},null,null,0,0,0,0,0,0,0,0,0,0,0,0,0,0,0,0,0,0,0,0,0,0,0,0,1,{"$nulls":7},{"v":0,"d":"0.0"}]
[59,"Schütze 59",{"$f":"B13","v":"Verein XII"},null,null,0,0,0,0,0,0,0,0,0,0,0,0,0,0,0,0,0,0,0,0,0,0,0,0,1,{"$nulls":7},{"v":0,"d":"0.0"}]
[60,"Schütze 60",{"$f":"B13","v":"Verein XII"},null,null,0,0,0,0,0,0,0,0,0,0,0,0,0,0,0,0,0,0,0,0,0,0,0,0,1,{"$nulls":7},{"v":0,"d":"0.0"}]
[{"$nulls":6},{"$f":"LARGE(G16:G75,1)+LARGE(G16:G75,2)+LARGE(G16:G75,3)","v":200.6},{"$f":"SUM(H16:H75)","v":4},{"$f":"LARGE(I16:I75,1)+LARGE(I16:I75,2)+LARGE(I16:I75,3)","v":1059.8000000000002},{"$f":"SUM(J16:J75)","v":4},{"$f":"LARGE(K16:K75,1)+LARGE(K16:K75,2)+LARGE(K16:K75,3)","v":674},{"$f":"SUM(L16:L75)","v":4},{"$f":"LARGE(M16:M75,1)+LARGE(M16:M75,2)+LARGE(M16:M75,3)","v":955.5},{"$f":"SUM(N16:N75)","v":4},{"$f":"LARGE(O16:O75,1)+LARGE(O16:O75,2)+LARGE(O16:O75,3)","v":613.5},{"$f":"SUM(P16:P75)","v":4},{"$f":"LARGE(Q16:Q75,1)+LARGE(Q16:Q75,2)+LARGE(Q16:Q75,3)","v":274.7},{"$f":"SUM(R16:R75)","v":4},{"$f":"LARGE(S16:S75,1)+LARGE(S16:S75,2)+LARGE(S16:S75,3)","v":305},{"$f":"SUM(T16:T75)","v":4},{"$f":"LARGE(U16:U75,1)+LARGE(U16:U75,2)+LARGE(U16:U75,3)","v":0},{"$f":"SUM(V16:V75)","v":5},{"$f":"LARGE(W16:W75,1)+LARGE(W16:W75,2)+LARGE(W16:W75,3)","v":0},{"$f":"SUM(X16:X75)","v":5},{"$f":"LARGE(Y16:Y75,1)+LARGE(Y16:Y75,2)+LARGE(Y16:Y75,3)","v":0},{"$f":"SUM(Z16:Z75)","v":5},{"$f":"LARGE(AA16:AA75,1)+LARGE(AA16:AA75,2)+LARGE(AA16:AA75,3)","v":0},{"$f":"SUM(AB16:AB75)","v":5},{"$f":"LARGE(AC16:AC75,1)+LARGE(AC16:AC75,2)+LARGE(AC16:AC75,3)","v":0},{"$f":"SUM(AD16:AD75)","v":5}]
[null,null,"per Email an: sk-huemmling@gmx.de"]

{"sheet":"2","index":2,"n_rows":77,"n_cols":39,"rows_kept":77,"merged":[[0,34,0,35],[1,34,1,35],[4,34,4,35],[5,34,5,35],[6,34,6,35],[14,32,14,35]]}
[null,"Verein / Gruppe",null,"Ergebnisse",{"$nulls":29},"Austragungsort:",{"$f":"Übersicht!E4","v":"Spahnharrenstätte"}]
[1,{"$f":"'Wettkampf 1'!B2","v":"Esterwegen"},null,{"$f":"G76","v":224.4},{"$f":"IF(H76>4,\"Es sind zu viele Schützen in Wertung!\",\" \")","v":"Es sind zu viele Schützen in Wertung!"},{"$nulls":28},"Wettkampftag:",{"$f":"Übersicht!E3","v":"28.09."}]
[2,{"$f":"'Wettkampf 1'!B3","v":"Lähden Jugend I"},null,{"$f":"I76","v":741.5},{"$f":"IF(J76>4,\"Es sind zu viele Schützen in Wertung!\",\" \")","v":"Es sind zu viele Schützen in Wertung!"}]
[3,{"$f":"'Wettkampf 1'!B4","v":"Börgerwald"},null,{"$f":"K76","v":319.9},{"$f":"IF(L76>4,\"Es sind zu viele Schützen in Wertung!\",\" \")","v":"Es sind zu viele Schützen in Wertung!"},{"$nulls":30},"Ansprechpartner für Rückfragen:"]
[4,{"$f":"'Wettkampf 1'!B5","v":"Börgermoor"},null,{"$f":"M76","v":1003.7},{"$f":"IF(N76>4,\"Es sind zu viele Schützen in Wertung!\",\" \")","v":"Es sind zu viele Schützen in Wertung!"},{"$nulls":28},"Name:","Bowe"]
[5,{"$f":"'Wettkampf 1'!B6","v":"Spahnharrenstätte"},null,{"$f":"O76","v":274.1},{"$f":"IF(P76>4,\"Es sind zu viele Schützen in Wertung!\",\" \")","v":"Es sind zu viele Schützen in Wertung!"},{"$nulls":28},"Tel:","059519955520"]
[6,{"$f":"'Wettkampf 1'!B7","v":"Lorup"},null,{"$f":"Q76","v":{"v":0,"d":"0.0"}},{"$f":"IF(R76>4,\"Es sind zu viele Schützen in Wertung!\",\" \")","v":"Es sind zu viele Schützen in Wertung!"},{"$nulls":28},"Standaufsicht:","Bowe"]
[7,{"$f":"'Wettkampf 1'!B8","v":"Lahn"},null,{"$f":"S76","v":590.1},{"$f":"IF(T76>4,\"Es sind zu viele Schützen in Wertung!\",\" \")","v":"Es sind zu viele Schützen in Wertung!"}]
[8,{"$f":"'Wettkampf 1'!B9","v":"Sögel"},null,{"$f":"U76","v":{"v":0,"d":"0.0"}},{"$f":"IF(V76>4,\"Es sind zu viele Schützen in Wertung!\",\" \")","v":"Es sind zu viele Schützen in Wertung!"}]
[9,{"$f":"'Wettkampf 1'!B10","v":"Verein IX"},null,{"$f":"W76","v":{"v":0,"d":"0.0"}},{"$f":"IF(X76>4,\"Es sind zu viele Schützen in Wertung!\",\" \")","v":"Es sind zu viele Schützen in Wertung!"}]
[10,{"$f":"'Wettkampf 1'!B11","v":"Verein X"},null,{"$f":"Y76","v":{"v":0,"d":"0.0"}},{"$f":"IF(Z76>4,\"Es sind zu viele Schützen in Wertung!\",\" \")","v":"Es sind zu viele Schützen in Wertung!"}]
[11,{"$f":"'Wettkampf 1'!B12","v":"Verein XI"},null,{"$f":"AA76","v":{"v":0,"d":"0.0"}},{"$f":"IF(AB76>4,\"Es sind zu viele Schützen in Wertung!\",\" \")","v":"Es sind zu viele Schützen in Wertung!"}]
[12,{"$f":"'Wettkampf 1'!B13","v":"Verein XII"},null,{"$f":"AC76","v":{"v":0,"d":"0.0"}},{"$f":"IF(AD76>4,\"Es sind zu viele Schützen in Wertung!\",\" \")","v":"Es sind zu viele Schützen in Wertung!"}]
[]
[null,"Einzelergebnisse:","Verein / Gruppe","Ergebnisse (mindestens 0 eintragen)","AW? Dann x eintippen",null,"Verein 1",null,"Verein 2",null,"Verein 3",null,"Verein 4",null,"Verein 5",null,"Verein 6",null,"Verein 7",null,"Verein 8",null,"Verein 9",null,"Verein 10",null,"Verein 11",null,"Verein 12",{"$nulls":3},"Proberechnung bei Streifen:"]
[1,{"$f":"'Wettkampf 1'!B16","v":"Gedecksnis Stefan"},{"$f":"'Wettkampf 1'!C16","v":"Esterwegen"},224.4,null,{"$f":"IF(E16=\"x\",\"0\",D16)","v":224.4},{"$f":"IF(C16=$B$2,F16,0)","v":224.4},{"$f":"(IF(AND($E16=\"\",$C16=$B$2),1,0))","v":1},{"$f":"IF($C16=$B$3,$F16,0)","v":0},{"$f":"(IF(AND($E16=\"\",$C16=$B$3),1,0))","v":0},{"$f":"IF($C16=$B$4,F16,0)","v":0},{"$f":"(IF(AND($E16=\"\",$C16=$B$4),1,0))","v":0},{"$f":"IF($C16=$B$5,F16,0)","v":0},{"$f":"(IF(AND($E16=\"\",$C16=$B$5),1,0))","v":0},{"$f":"IF($C16=$B$6,F16,0)","v":0},{"$f":"(IF(AND($E16=\"\",$C16=$B$6),1,0))","v":0},{"$f":"IF($C16=$B$7,F16,0)","v":0},{"$f":"(IF(AND($E16=\"\",$C16=$B$7),1,0))","v":0},{"$f":"IF($C16=$B$8,$F16,0)","v":0},{"$f":"(IF(AND($E16=\"\",$C16=$B$8),1,0))","v":0},{"$f":"IF($C16=$B$9,$F16,0)","v":0},{"$f":"(IF(AND($E16=\"\",$C16=$B$9),1,0))","v":0},{"$f":"IF($C16=$B$10,$F16,0)","v":0},{"$f":"(IF(AND($E16=\"\",$C16=$B$10),1,0))","v":0},{"$f":"IF($C16=$B$11,$F16,0)","v":0},{"$f":"(IF(AND($E16=\"\",$C16=$B$11),1,0))","v":0},{"$f":"IF($C16=$B$12,$F16,0)","v":0},{"$f":"(IF(AND($E16=\"\",$C16=$B$12),1,0))","v":0},{"$f":"IF($C16=$B$13,$F16,0)","v":0},{"$f":"(IF(AND($E16=\"\",$C16=$B$13),1,0))","v":0},{"$nulls":5},{"$f":"SUM(AG16:AI16)","v":{"v":0,"d":"0.0"}},{"$f":"IF(AJ16=D16,1,0)","v":0},{"$f":"IF(AJ16=0,0,1)","v":0},{"$f":"IF(AK16+AL16=2,\"Korrekt\",\"\")","v":""}]
[2,{"$f":"'Wettkampf 1'!B17","v":"Wübben Jasper"},{"$f":"'Wettkampf 1'!C17","v":"Esterwegen"},null,null,{"$f":"IF(E17=\"x\",\"0\",D17)","v":{"v":0,"d":"0.0"}},{"$f":"IF(C17=$B$2,F17,0)","v":0},{"$f":"(IF(AND($E17=\"\",$C17=$B$2),1,0))","v":1},{"$f":"IF($C17=$B$3,F17,0)","v":0},{"$f":"(IF(AND($E17=\"\",$C17=$B$3),1,0))","v":0},{"$f":"IF($C17=$B$4,F17,0)","v":0},{"$f":"(IF(AND($E17=\"\",$C17=$B$4),1,0))","v":0},{"$f":"IF($C17=$B$5,F17,0)","v":0},{"$f":"(IF(AND($E17=\"\",$C17=$B$5),1,0))","v":0},{"$f":"IF($C17=$B$6,F17,0)","v":0},{"$f":"(IF(AND($E17=\"\",$C17=$B$6),1,0))","v":0},{"$f":"IF($C17=$B$7,F17,0)","v":0},{"$f":"(IF(AND($E17=\"\",$C17=$B$7),1,0))","v":0},{"$f":"IF($C17=$B$8,$F17,0)","v":0},{"$f":"(IF(AND($E17=\"\",$C17=$B$8),1,0))","v":0},{"$f":"IF($C17=$B$9,$F17,0)","v":0},{"$f":"(IF(AND($E17=\"\",$C17=$B$9),1,0))","v":0},{"$f":"IF($C17=$B$10,$F17,0)","v":0},{"$f":"(IF(AND($E17=\"\",$C17=$B$10),1,0))","v":0},{"$f":"IF($C17=$B$11,$F17,0)","v":0},{"$f":"(IF(AND($E17=\"\",$C17=$B$11),1,0))","v":0},{"$f":"IF($C17=$B$12,$F17,0)","v":0},{"$f":"(IF(AND($E17=\"\",$C17=$B$12),1,0))","v":0},{"$f":"IF($C17=$B$13,$F17,0)","v":0},{"$f":"(IF(AND($E17=\"\",$C17=$B$13),1,0))","v":0},{"$nulls":5},{"$f":"SUM(AG17:AI17)","v":{"v":0,"d":"0.0"}},{"$f":"IF(AJ17=D17,1,0)","v":1},{"$f":"IF(AJ17=0,0,1)","v":0},{"$f":"IF(AK17+AL17=2,\"Korrekt\",\"\")","v":""}]
[3,{"$f":"'Wettkampf 1'!B18","v":"Engbers Julian"},{"$f":"'Wettkampf 1'!C18","v":"Esterwegen"},null,null,{"v":0,"d":"0.0"},0,1,0,0,0,0,0,0,0,0,0,0,0,0,0,0,0,0,0,0,0,0,0,0,{"$nulls":5},{"v":0,"d":"0.0"},1,0,""]
[4,{"$f":"'Wettkampf 1'!B19","v":"Meyer Johan"},{"$f":"'Wettkampf 1'!C19","v":"Esterwegen"},null,null,{"v":0,"d":"0.0"},0,1,0,0,0,0,0,0,0,0,0,0,0,0,0,0,0,0,0,0,0,0,0,0,{"$nulls":5},{"v":0,"d":"0.0"},1,0,""]
[5,{"$f":"'Wettkampf 1'!B20","v":"Schütze 5"},{"$f":"'Wettkampf 1'!C20","v":"Esterwegen"},null,null,{"v":0,"d":"0.0"},0,1,0,0,0,0,0,0,0,0,0,0,0,0,0,0,0,0,0,0,0,0,0,0,{"$nulls":5},{"v":0,"d":"0.0"},1,0,""]
[6,{"$f":"'Wettkampf 1'!B21","v":"Strüwing Inja"},{"$f":"'Wettkampf 1'!C21","v":"Lähden Jugend I"},374.1,null,374.1,0,0,374.1,1,0,0,0,0,0,0,0,0,0,0,0,0,0,0,0,0,0,0,0,0,{"$nulls":5},{"v":0,"d":"0.0"},0,0,""]
[7,{"$f":"'Wettkampf 1'!B22","v":"Bruns Hendrik"},{"$f":"'Wettkampf 1'!C22","v":"Lähden Jugend I"},367.4,null,367.4,0,0,367.4,1,0,0,0,0,0,0,0,0,0,0,0,0,0,0,0,0,0,0,0,0,{"$nulls":5},{"v":0,"d":"0.0"},0,0,""]
[8,{"$f":"'Wettkampf 1'!B23","v":"Feldhaus Vanessa"},{"$f":"'Wettkampf 1'!C23","v":"Lähden Jugend I"},null,null,{"v":0,"d":"0.0"},0,0,0,1,0,0,0,0,0,0,0,0,0,0,0,0,0,0,0,0,0,0,0,0,{"$nulls":5},{"v":0,"d":"0.0"},1,0,""]
[9,{"$f":"'Wettkampf 1'!B24","v":"Feldhaus Celien "},{"$f":"'Wettkampf 1'!C24","v":"Lähden Jugend I"},null,null,{"v":0,"d":"0.0"},0,0,0,1,0,0,0,0,0,0,0,0,0,0,0,0,0,0,0,0,0,0,0,0,{"$nulls":5},{"v":0,"d":"0.0"},1,0,""]
[10,{"$f":"'Wettkampf 1'!B25","v":"Stümpler Jan-Luca"},{"$f":"'Wettkampf 1'!C25","v":"Lähden Jugend I"},null,null,{"v":0,"d":"0.0"},0,0,0,1,0,0,0,0,0,0,0,0,0,0,0,0,0,0,0,0,0,0,0,0,{"$nulls":5},{"v":0,"d":"0.0"},1,0,""]
[11,{"$f":"'Wettkampf 1'!B26","v":"Hanneken Maren"},{"$f":"'Wettkampf 1'!C26","v":"Börgerwald"},319.9,null,319.9,0,0,0,0,319.9,1,0,0,0,0,0,0,0,0,0,0,0,0,0,0,0,0,0,0,{"$nulls":5},{"v":0,"d":"0.0"},0,0,""]
[12,{"$f":"'Wettkampf 1'!B27","v":"Köstering Nele"},{"$f":"'Wettkampf 1'!C27","v":"Börgerwald"},null,null,{"v":0,"d":"0.0"},0,0,0,0,0,1,0,0,0,0,0,0,0,0,0,0,0,0,0,0,0,0,0,0,{"$nulls":5},{"v":0,"d":"0.0"},1,0,""]
[13,{"$f":"'Wettkampf 1'!B28","v":"Lohmann Amy"},{"$f":"'Wettkampf 1'!C28","v":"Börgerwald"},null,null,{"v":0,"d":"0.0"},0,0,0,0,0,1,0,0,0,0,0,0,0,0,0,0,0,0,0,0,0,0,0,0,{"$nulls":5},{"v":0,"d":"0.0"},1,0,""]
[14,{"$f":"'Wettkampf 1'!B29","v":"Schütze 14"},{"$f":"'Wettkampf 1'!C29","v":"Börgerwald"},null,null,{"v":0,"d":"0.0"},0,0,0,0,0,1,0,0,0,0,0,0,0,0,0,0,0,0,0,0,0,0,0,0,{"$nulls":5},{"v":0,"d":"0.0"},1,0,""]
[15,{"$f":"'Wettkampf 1'!B30","v":"Schütze 15"},{"$f":"'Wettkampf 1'!C30","v":"Börgerwald"},null,null,{"v":0,"d":"0.0"},0,0,0,0,0,1,0,0,0,0,0,0,0,0,0,0,0,0,0,0,0,0,0,0,{"$nulls":5},{"v":0,"d":"0.0"},1,0,""]
[16,{"$f":"'Wettkampf 1'!B31","v":"Brandt Mira"},{"$f":"'Wettkampf 1'!C31","v":"Börgermoor"},354.6,null,354.6,0,0,0,0,0,0,354.6,1,0,0,0,0,0,0,0,0,0,0,0,0,0,0,0,0,{"$nulls":5},{"v":0,"d":"0.0"},0,0,""]
[17,{"$f":"'Wettkampf 1'!B32","v":"Eichhorn Luca"},{"$f":"'Wettkampf 1'!C32","v":"Börgermoor"},315.1,null,315.1,0,0,0,0,0,0,315.1,1,0,0,0,0,0,0,0,0,0,0,0,0,0,0,0,0,{"$nulls":5},{"v":0,"d":"0.0"},0,0,""]
[18,{"$f":"'Wettkampf 1'!B33","v":"Kohnen Saskia"},{"$f":"'Wettkampf 1'!C33","v":"Börgermoor"},{"v":334,"d":"334.0"},null,{"v":334,"d":"334.0"},0,0,0,0,0,0,334,1,0,0,0,0,0,0,0,0,0,0,0,0,0,0,0,0,{"$nulls":5},{"v":0,"d":"0.0"},0,0,""]
[19,{"$f":"'Wettkampf 1'!B34","v":"Schütze 19"},{"$f":"'Wettkampf 1'!C34","v":"Börgermoor"},null,null,{"v":0,"d":"0.0"},0,0,0,0,0,0,0,1,0,0,0,0,0,0,0,0,0,0,0,0,0,0,0,0,{"$nulls":5},{"v":0,"d":"0.0"},1,0,""]
[20,{"$f":"'Wettkampf 1'!B35","v":"Schütze 20"},{"$f":"'Wettkampf 1'!C35","v":"Börgermoor"},null,null,{"v":0,"d":"0.0"},0,0,0,0,0,0,0,1,0,0,0,0,0,0,0,0,0,0,0,0,0,0,0,0,{"$nulls":5},{"v":0,"d":"0.0"},1,0,""]
[21,{"$f":"'Wettkampf 1'!B36","v":"Runde Marcel"},{"$f":"'Wettkampf 1'!C36","v":"Spahnharrenstätte"},null,null,{"v":0,"d":"0.0"},0,0,0,0,0,0,0,0,0,1,0,0,0,0,0,0,0,0,0,0,0,0,0,0,{"$nulls":5},{"v":0,"d":"0.0"},1,0,""]
[22,{"$f":"'Wettkampf 1'!B37","v":"Leis Fynn Lucas "},{"$f":"'Wettkampf 1'!C37","v":"Spahnharrenstätte"},null,null,{"v":0,"d":"0.0"},0,0,0,0,0,0,0,0,0,1,0,0,0,0,0,0,0,0,0,0,0,0,0,0,{"$nulls":5},{"v":0,"d":"0.0"},1,0,""]
[23,{"$f":"'Wettkampf 1'!B38","v":"Jansen Lars"},{"$f":"'Wettkampf 1'!C38","v":"Spahnharrenstätte"},274.1,null,274.1,0,0,0,0,0,0,0,0,274.1,1,0,0,0,0,0,0,0,0,0,0,0,0,0,0,{"$nulls":5},{"v":0,"d":"0.0"},0,0,""]
[24,{"$f":"'Wettkampf 1'!B39","v":"Köster Thilo"},{"$f":"'Wettkampf 1'!C39","v":"Spahnharrenstätte"},null,null,{"v":0,"d":"0.0"},0,0,0,0,0,0,0,0,0,1,0,0,0,0,0,0,0,0,0,0,0,0,0,0,{"$nulls":5},{"v":0,"d":"0.0"},1,0,""]
[25,{"$f":"'Wettkampf 1'!B40","v":"Schütze 25"},{"$f":"'Wettkampf 1'!C40","v":"Spahnharrenstätte"},null,null,{"v":0,"d":"0.0"},0,0,0,0,0,0,0,0,0,1,0,0,0,0,0,0,0,0,0,0,0,0,0,0,{"$nulls":5},{"v":0,"d":"0.0"},1,0,""]
[26,{"$f":"'Wettkampf 1'!B41","v":"Dolling Leon"},{"$f":"'Wettkampf 1'!C41","v":"Lorup"},null,null,{"v":0,"d":"0.0"},0,0,0,0,0,0,0,0,0,0,0,1,0,0,0,0,0,0,0,0,0,0,0,0,{"$nulls":5},{"v":0,"d":"0.0"},1,0,""]
[27,{"$f":"'Wettkampf 1'!B42","v":"Schütze 27"},{"$f":"'Wettkampf 1'!C42","v":"Lorup"},null,null,{"v":0,"d":"0.0"},0,0,0,0,0,0,0,0,0,0,0,1,0,0,0,0,0,0,0,0,0,0,0,0,{"$nulls":5},{"v":0,"d":"0.0"},1,0,""]
[28,{"$f":"'Wettkampf 1'!B43","v":"Schütze 28"},{"$f":"'Wettkampf 1'!C43","v":"Lorup"},null,null,{"v":0,"d":"0.0"},0,0,0,0,0,0,0,0,0,0,0,1,0,0,0,0,0,0,0,0,0,0,0,0,{"$nulls":5},{"v":0,"d":"0.0"},1,0,""]
[29,{"$f":"'Wettkampf 1'!B44","v":"Schütze 29"},{"$f":"'Wettkampf 1'!C44","v":"Lorup"},null,null,{"v":0,"d":"0.0"},0,0,0,0,0,0,0,0,0,0,0,1,0,0,0,0,0,0,0,0,0,0,0,0,{"$nulls":5},{"v":0,"d":"0.0"},1,0,""]
[30,{"$f":"'Wettkampf 1'!B45","v":"Schütze 30"},{"$f":"'Wettkampf 1'!C45","v":"Lorup"},null,null,{"v":0,"d":"0.0"},0,0,0,0,0,0,0,0,0,0,0,1,0,0,0,0,0,0,0,0,0,0,0,0,{"$nulls":5},{"v":0,"d":"0.0"},1,0,""]
[31,{"$f":"'Wettkampf 1'!B46","v":"Wilken Noah"},{"$f":"'Wettkampf 1'!C46","v":"Lahn"},{"v":299,"d":"299.0"},null,{"v":299,"d":"299.0"},0,0,0,0,0,0,0,0,0,0,0,0,299,1,0,0,0,0,0,0,0,0,0,0,{"$nulls":5},{"v":0,"d":"0.0"},{"$f":"IF(AJ46=D46,1,0)","v":0},{"$f":"IF(AJ46=0,0,1)","v":0},{"$f":"IF(AK46+AL46=2,\"Korrekt\",\"\")","v":""}]
[32,{"$f":"'Wettkampf 1'!B47","v":"Schulz Mika"},{"$f":"'Wettkampf 1'!C47","v":"Lahn"},291.1,null,291.1,0,0,0,0,0,0,0,0,0,0,0,0,291.1,1,0,0,0,0,0,0,0,0,0,0,{"$nulls":5},{"v":0,"d":"0.0"},0,0,""]
[33,{"$f":"'Wettkampf 1'!B48","v":"Schütze 33"},{"$f":"'Wettkampf 1'!C48","v":"Lahn"},null,null,{"v":0,"d":"0.0"},0,0,0,0,0,0,0,0,0,0,0,0,0,1,0,0,0,0,0,0,0,0,0,0,{"$nulls":5},{"v":0,"d":"0.0"},1,0,""]
[34,{"$f":"'Wettkampf 1'!B49","v":"Schütze 34"},{"$f":"'Wettkampf 1'!C49","v":"Lahn"},null,null,{"v":0,"d":"0.0"},0,0,0,0,0,0,0,0,0,0,0,0,0,1,0,0,0,0,0,0,0,0,0,0,{"$nulls":5},{"v":0,"d":"0.0"},1,0,""]
[35,{"$f":"'Wettkampf 1'!B50","v":"Schütze 35"},{"$f":"'Wettkampf 1'!C50","v":"Lahn"},null,null,{"v":0,"d":"0.0"},0,0,0,0,0,0,0,0,0,0,0,0,0,1,0,0,0,0,0,0,0,0,0,0,{"$nulls":5},{"v":0,"d":"0.0"},1,0,""]
[36,{"$f":"'Wettkampf 1'!B51","v":"Tharner Kim"},{"$f":"'Wettkampf 1'!C51","v":"Sögel"},null,null,{"v":0,"d":"0.0"},0,0,0,0,0,0,0,0,0,0,0,0,0,0,0,1,0,0,0,0,0,0,0,0,{"$nulls":5},{"v":0,"d":"0.0"},{"$f":"IF(AJ51=D51,1,0)","v":1},{"$f":"IF(AJ51=0,0,1)","v":0},{"$f":"IF(AK51+AL51=2,\"Korrekt\",\"\")","v":""}]
[37,{"$f":"'Wettkampf 1'!B52","v":"Schütze 37"},{"$f":"'Wettkampf 1'!C52","v":"Sögel"},null,null,{"v":0,"d":"0.0"},0,0,0,0,{"$f":"IF($C52=$B$4,F52,0)","v":0},0,{"$f":"IF($C52=$B$5,F52,0)","v":0},0,{"$f":"IF($C52=$B$6,F52,0)","v":0},0,{"$f":"IF($C52=$B$7,F52,0)","v":0},0,0,0,0,1,0,0,0,0,0,0,0,0,{"$nulls":5},{"v":0,"d":"0.0"}]
[38,{"$f":"'Wettkampf 1'!B53","v":"Schütze 38"},{"$f":"'Wettkampf 1'!C53","v":"Sögel"},null,null,{"v":0,"d":"0.0"},0,0,0,0,0,0,0,0,0,0,0,0,0,0,0,1,0,0,0,0,0,0,0,0,{"$nulls":5},{"v":0,"d":"0.0"}]
[39,{"$f":"'Wettkampf 1'!B54","v":"Schütze 39"},{"$f":"'Wettkampf 1'!C54","v":"Sögel"},null,null,{"v":0,"d":"0.0"},0,0,0,0,0,0,0,0,0,0,0,0,{"$f":"IF($C54=$B$8,$F54,0)","v":0},{"$f":"(IF(AND($E54=\"\",$C54=$B$8),1,0))","v":0},{"$f":"IF($C54=$B$9,$F54,0)","v":0},{"$f":"(IF(AND($E54=\"\",$C54=$B$9),1,0))","v":1},{"$f":"IF($C54=$B$10,$F54,0)","v":0},{"$f":"(IF(AND($E54=\"\",$C54=$B$10),1,0))","v":0},{"$f":"IF($C54=$B$11,$F54,0)","v":0},{"$f":"(IF(AND($E54=\"\",$C54=$B$11),1,0))","v":0},{"$f":"IF($C54=$B$12,$F54,0)","v":0},{"$f":"(IF(AND($E54=\"\",$C54=$B$12),1,0))","v":0},{"$f":"IF($C54=$B$13,$F54,0)","v":0},{"$f":"(IF(AND($E54=\"\",$C54=$B$13),1,0))","v":0},{"$nulls":5},{"v":0,"d":"0.0"}]
[40,{"$f":"'Wettkampf 1'!B55","v":"Schütze 40"},{"$f":"'Wettkampf 1'!C55","v":"Sögel"},null,null,{"v":0,"d":"0.0"},0,0,0,0,0,0,0,0,0,0,0,0,0,0,0,1,0,0,0,0,0,0,0,0,{"$nulls":5},{"v":0,"d":"0.0"}]
[41,{"$f":"'Wettkampf 1'!B56","v":"Schütze 41"},{"$f":"'Wettkampf 1'!C56","v":"Verein IX"},null,null,{"v":0,"d":"0.0"},0,0,0,0,0,0,0,0,0,0,0,0,0,0,0,0,0,1,0,0,0,0,0,0,{"$nulls":5},{"v":0,"d":"0.0"}]
[42,{"$f":"'Wettkampf 1'!B57","v":"Schütze 42"},{"$f":"'Wettkampf 1'!C57","v":"Verein IX"},null,null,{"v":0,"d":"0.0"},0,0,0,0,0,0,0,0,0,0,0,0,0,0,0,0,0,1,0,0,0,0,0,0,{"$nulls":5},{"v":0,"d":"0.0"}]
[43,{"$f":"'Wettkampf 1'!B58","v":"Schütze 43"},{"$f":"'Wettkampf 1'!C58","v":"Verein IX"},null,null,{"v":0,"d":"0.0"},0,0,0,0,0,0,0,0,0,0,0,0,0,0,0,0,0,1,0,0,0,0,0,0,{"$nulls":5},{"v":0,"d":"0.0"}]
[44,{"$f":"'Wettkampf 1'!B59","v":"Schütze 44"},{"$f":"'Wettkampf 1'!C59","v":"Verein IX"},null,null,{"v":0,"d":"0.0"},0,0,0,0,0,0,0,0,0,0,0,0,0,0,0,0,0,1,0,0,0,0,0,0,{"$nulls":5},{"v":0,"d":"0.0"}]
[45,{"$f":"'Wettkampf 1'!B60","v":"Schütze 45"},{"$f":"'Wettkampf 1'!C60","v":"Verein IX"},null,null,{"v":0,"d":"0.0"},0,0,0,0,0,0,0,0,0,0,0,0,0,0,0,0,0,1,0,0,0,0,0,0,{"$nulls":5},{"v":0,"d":"0.0"}]
[46,{"$f":"'Wettkampf 1'!B61","v":"Schütze 46"},{"$f":"'Wettkampf 1'!C61","v":"Verein X"},null,null,{"v":0,"d":"0.0"},0,0,0,0,0,0,0,0,0,0,0,0,0,0,0,0,0,0,0,1,0,0,0,0,{"$nulls":5},{"v":0,"d":"0.0"}]
[47,{"$f":"'Wettkampf 1'!B62","v":"Schütze 47"},{"$f":"'Wettkampf 1'!C62","v":"Verein X"},null,null,{"v":0,"d":"0.0"},0,0,0,0,0,0,0,0,0,0,0,0,0,0,0,0,0,0,0,1,0,0,0,0,{"$nulls":5},{"v":0,"d":"0.0"}]
[48,{"$f":"'Wettkampf 1'!B63","v":"Schütze 48"},{"$f":"'Wettkampf 1'!C63","v":"Verein X"},null,null,{"v":0,"d":"0.0"},0,0,0,0,0,0,0,0,0,0,0,0,0,0,0,0,0,0,0,1,0,0,0,0,{"$nulls":5},{"v":0,"d":"0.0"}]
[49,{"$f":"'Wettkampf 1'!B64","v":"Schütze 49"},{"$f":"'Wettkampf 1'!C64","v":"Verein X"},null,null,{"v":0,"d":"0.0"},0,0,0,0,0,0,0,0,0,0,0,0,0,0,0,0,0,0,0,1,0,0,0,0,{"$nulls":5},{"v":0,"d":"0.0"}]
[50,{"$f":"'Wettkampf 1'!B65","v":"Schütze 50"},{"$f":"'Wettkampf 1'!C65","v":"Verein X"},null,null,{"v":0,"d":"0.0"},0,0,0,0,0,0,0,0,0,0,0,0,0,0,0,0,0,0,0,1,0,0,0,0,{"$nulls":5},{"v":0,"d":"0.0"}]
[51,{"$f":"'Wettkampf 1'!B66","v":"Schütze 51"},{"$f":"'Wettkampf 1'!C66","v":"Verein XI"},null,null,{"v":0,"d":"0.0"},0,0,0,0,0,0,0,0,0,0,0,0,0,0,0,0,0,0,0,0,0,1,0,0,{"$nulls":5},{"v":0,"d":"0.0"}]
[52,{"$f":"'Wettkampf 1'!B67","v":"Schütze 52"},{"$f":"'Wettkampf 1'!C67","v":"Verein XI"},null,null,{"v":0,"d":"0.0"},0,0,0,0,0,0,0,0,0,0,0,0,0,0,0,0,0,0,0,0,0,1,0,0,{"$nulls":5},{"v":0,"d":"0.0"}]
[53,{"$f":"'Wettkampf 1'!B68","v":"Schütze 53"},{"$f":"'Wettkampf 1'!C68","v":"Verein XI"},null,null,{"v":0,"d":"0.0"},0,0,0,0,0,0,0,0,0,0,0,0,0,0,0,0,0,0,0,0,0,1,0,0,{"$nulls":5},{"v":0,"d":"0.0"}]
[54,{"$f":"'Wettkampf 1'!B69","v":"Schütze 54"},{"$f":"'Wettkampf 1'!C69","v":"Verein XI"},null,null,{"v":0,"d":"0.0"},0,0,0,0,0,0,0,0,0,0,0,0,0,0,0,0,0,0,0,0,0,1,0,0,{"$nulls":5},{"v":0,"d":"0.0"}]
[55,{"$f":"'Wettkampf 1'!B70","v":"Schütze 55"},{"$f":"'Wettkampf 1'!C70","v":"Verein XI"},null,null,{"v":0,"d":"0.0"},0,0,0,0,0,0,0,0,0,0,0,0,0,0,0,0,0,0,0,0,0,1,0,0,{"$nulls":5},{"v":0,"d":"0.0"}]
[56,{"$f":"'Wettkampf 1'!B71","v":"Schütze 56"},{"$f":"'Wettkampf 1'!C71","v":"Verein XII"},null,null,{"v":0,"d":"0.0"},0,0,0,0,0,0,0,0,0,0,0,0,0,0,0,0,0,0,0,0,0,0,0,1,{"$nulls":5},{"v":0,"d":"0.0"}]
[57,{"$f":"'Wettkampf 1'!B72","v":"Schütze 57"},{"$f":"'Wettkampf 1'!C72","v":"Verein XII"},null,null,{"v":0,"d":"0.0"},0,0,0,0,0,0,0,0,0,0,0,0,0,0,0,0,0,0,0,0,0,0,0,1,{"$nulls":5},{"v":0,"d":"0.0"}]
[58,{"$f":"'Wettkampf 1'!B73","v":"Schütze 58"},{"$f":"'Wettkampf 1'!C73","v":"Verein XII"},null,null,{"v":0,"d":"0.0"},0,0,0,0,0,0,0,0,0,0,0,0,0,0,0,0,0,0,0,0,0,0,0,1,{"$nulls":5},{"v":0,"d":"0.0"}]
[59,{"$f":"'Wettkampf 1'!B74","v":"Schütze 59"},{"$f":"'Wettkampf 1'!C74","v":"Verein XII"},null,null,{"v":0,"d":"0.0"},0,0,0,0,0,0,0,0,0,0,0,0,0,0,0,0,0,0,0,0,0,0,0,1,{"$nulls":5},{"v":0,"d":"0.0"}]
[60,{"$f":"'Wettkampf 1'!B75","v":"Schütze 60"},{"$f":"'Wettkampf 1'!C75","v":"Verein XII"},null,null,{"v":0,"d":"0.0"},0,0,0,0,0,0,0,0,0,0,0,0,0,0,0,0,0,0,0,0,0,0,0,1,{"$nulls":5},{"v":0,"d":"0.0"}]
[{"$nulls":6},{"$f":"LARGE(G16:G75,1)+LARGE(G16:G75,2)+LARGE(G16:G75,3)","v":224.4},{"$f":"SUM(H16:H75)","v":5},{"$f":"LARGE(I16:I75,1)+LARGE(I16:I75,2)+LARGE(I16:I75,3)","v":741.5},{"$f":"SUM(J16:J75)","v":5},{"$f":"LARGE(K16:K75,1)+LARGE(K16:K75,2)+LARGE(K16:K75,3)","v":319.9},{"$f":"SUM(L16:L75)","v":5},{"$f":"LARGE(M16:M75,1)+LARGE(M16:M75,2)+LARGE(M16:M75,3)","v":1003.7},{"$f":"SUM(N16:N75)","v":5},{"$f":"LARGE(O16:O75,1)+LARGE(O16:O75,2)+LARGE(O16:O75,3)","v":274.1},{"$f":"SUM(P16:P75)","v":5},{"$f":"LARGE(Q16:Q75,1)+LARGE(Q16:Q75,2)+LARGE(Q16:Q75,3)","v":0},{"$f":"SUM(R16:R75)","v":5},{"$f":"LARGE(S16:S75,1)+LARGE(S16:S75,2)+LARGE(S16:S75,3)","v":590.1},{"$f":"SUM(T16:T75)","v":5},{"$f":"LARGE(U16:U75,1)+LARGE(U16:U75,2)+LARGE(U16:U75,3)","v":0},{"$f":"SUM(V16:V75)","v":5},{"$f":"LARGE(W16:W75,1)+LARGE(W16:W75,2)+LARGE(W16:W75,3)","v":0},{"$f":"SUM(X16:X75)","v":5},{"$f":"LARGE(Y16:Y75,1)+LARGE(Y16:Y75,2)+LARGE(Y16:Y75,3)","v":0},{"$f":"SUM(Z16:Z75)","v":5},{"$f":"LARGE(AA16:AA75,1)+LARGE(AA16:AA75,2)+LARGE(AA16:AA75,3)","v":0},{"$f":"SUM(AB16:AB75)","v":5},{"$f":"LARGE(AC16:AC75,1)+LARGE(AC16:AC75,2)+LARGE(AC16:AC75,3)","v":0},{"$f":"SUM(AD16:AD75)","v":5}]
[null,null,"per Email an: sk-huemmling@gmx.de"]

{"sheet":"3","index":3,"n_rows":77,"n_cols":39,"rows_kept":77,"merged":[[0,34,0,35],[1,34,1,35],[4,34,4,35],[5,34,5,35],[6,34,6,35],[14,32,14,35]]}
[null,"Verein / Gruppe",null,"Ergebnisse",{"$nulls":29},"Austragungsort:",{"$f":"Übersicht!F4","v":"Breddenberg"}]
[1,{"$f":"'Wettkampf 1'!B2","v":"Esterwegen"},null,{"$f":"G76","v":{"v":0,"d":"0.0"}},{"$f":"IF(H76>4,\"Es sind zu viele Schützen in Wertung!\",\" \")","v":"Es sind zu viele Schützen in Wertung!"},{"$nulls":28},"Wettkampftag:",{"$f":"Übersicht!F3","v":"19.10."}]
[2,{"$f":"'Wettkampf 1'!B3","v":"Lähden Jugend I"},null,{"$f":"I76","v":{"v":1080.1999999999998,"d":"1080.2"}},{"$f":"IF(J76>4,\"Es sind zu viele Schützen in Wertung!\",\" \")","v":"Es sind zu viele Schützen in Wertung!"}]
[3,{"$f":"'Wettkampf 1'!B4","v":"Börgerwald"},null,{"$f":"K76","v":650.2},{"$f":"IF(L76>4,\"Es sind zu viele Schützen in Wertung!\",\" \")","v":"Es sind zu viele Schützen in Wertung!"},{"$nulls":30},"Ansprechpartner für Rückfragen:"]
[4,{"$f":"'Wettkampf 1'!B5","v":"Börgermoor"},null,{"$f":"M76","v":{"v":930.8000000000001,"d":"930.8"}},{"$f":"IF(N76>4,\"Es sind zu viele Schützen in Wertung!\",\" \")","v":"Es sind zu viele Schützen in Wertung!"},{"$nulls":28},"Name:","Kuper"]
[5,{"$f":"'Wettkampf 1'!B6","v":"Spahnharrenstätte"},null,{"$f":"O76","v":307.4},{"$f":"IF(P76>4,\"Es sind zu viele Schützen in Wertung!\",\" \")","v":"Es sind zu viele Schützen in Wertung!"},{"$nulls":28},"Tel:","05955/988578"]
[6,{"$f":"'Wettkampf 1'!B7","v":"Lorup"},null,{"$f":"Q76","v":{"v":0,"d":"0.0"}},{"$f":"IF(R76>4,\"Es sind zu viele Schützen in Wertung!\",\" \")","v":"Es sind zu viele Schützen in Wertung!"},{"$nulls":28},"Standaufsicht:","Kuper/Jansen"]
[7,{"$f":"'Wettkampf 1'!B8","v":"Lahn"},null,{"$f":"S76","v":553.5},{"$f":"IF(T76>4,\"Es sind zu viele Schützen in Wertung!\",\" \")","v":"Es sind zu viele Schützen in Wertung!"}]
[8,{"$f":"'Wettkampf 1'!B9","v":"Sögel"},null,{"$f":"U76","v":{"v":0,"d":"0.0"}},{"$f":"IF(V76>4,\"Es sind zu viele Schützen in Wertung!\",\" \")","v":"Es sind zu viele Schützen in Wertung!"}]
[9,{"$f":"'Wettkampf 1'!B10","v":"Verein IX"},null,{"$f":"W76","v":{"v":0,"d":"0.0"}},{"$f":"IF(X76>4,\"Es sind zu viele Schützen in Wertung!\",\" \")","v":"Es sind zu viele Schützen in Wertung!"}]
[10,{"$f":"'Wettkampf 1'!B11","v":"Verein X"},null,{"$f":"Y76","v":{"v":0,"d":"0.0"}},{"$f":"IF(Z76>4,\"Es sind zu viele Schützen in Wertung!\",\" \")","v":"Es sind zu viele Schützen in Wertung!"}]
[11,{"$f":"'Wettkampf 1'!B12","v":"Verein XI"},null,{"$f":"AA76","v":{"v":0,"d":"0.0"}},{"$f":"IF(AB76>4,\"Es sind zu viele Schützen in Wertung!\",\" \")","v":"Es sind zu viele Schützen in Wertung!"}]
[12,{"$f":"'Wettkampf 1'!B13","v":"Verein XII"},null,{"$f":"AC76","v":{"v":0,"d":"0.0"}},{"$f":"IF(AD76>4,\"Es sind zu viele Schützen in Wertung!\",\" \")","v":"Es sind zu viele Schützen in Wertung!"}]
[]
[null,"Einzelergebnisse:","Verein / Gruppe","Ergebnisse (mindestens 0 eintragen)","AW? Dann x eintippen",null,"Verein 1",null,"Verein 2",null,"Verein 3",null,"Verein 4",null,"Verein 5",null,"Verein 6",null,"Verein 7",null,"Verein 8",null,"Verein 9",null,"Verein 10",null,"Verein 11",null,"Verein 12",{"$nulls":3},"Proberechnung bei Streifen:"]
[1,{"$f":"'Wettkampf 1'!B16","v":"Gedecksnis Stefan"},{"$f":"'Wettkampf 1'!C16","v":"Esterwegen"},null,null,{"$f":"IF(E16=\"x\",\"0\",D16)","v":{"v":0,"d":"0.0"}},{"$f":"IF(C16=$B$2,F16,0)","v":0},{"$f":"(IF(AND($E16=\"\",$C16=$B$2),1,0))","v":1},{"$f":"IF($C16=$B$3,$F16,0)","v":0},{"$f":"(IF(AND($E16=\"\",$C16=$B$3),1,0))","v":0},{"$f":"IF($C16=$B$4,F16,0)","v":0},{"$f":"(IF(AND($E16=\"\",$C16=$B$4),1,0))","v":0},{"$f":"IF($C16=$B$5,F16,0)","v":0},{"$f":"(IF(AND($E16=\"\",$C16=$B$5),1,0))","v":0},{"$f":"IF($C16=$B$6,F16,0)","v":0},{"$f":"(IF(AND($E16=\"\",$C16=$B$6),1,0))","v":0},{"$f":"IF($C16=$B$7,F16,0)","v":0},{"$f":"(IF(AND($E16=\"\",$C16=$B$7),1,0))","v":0},{"$f":"IF($C16=$B$8,$F16,0)","v":0},{"$f":"(IF(AND($E16=\"\",$C16=$B$8),1,0))","v":0},{"$f":"IF($C16=$B$9,$F16,0)","v":0},{"$f":"(IF(AND($E16=\"\",$C16=$B$9),1,0))","v":0},{"$f":"IF($C16=$B$10,$F16,0)","v":0},{"$f":"(IF(AND($E16=\"\",$C16=$B$10),1,0))","v":0},{"$f":"IF($C16=$B$11,$F16,0)","v":0},{"$f":"(IF(AND($E16=\"\",$C16=$B$11),1,0))","v":0},{"$f":"IF($C16=$B$12,$F16,0)","v":0},{"$f":"(IF(AND($E16=\"\",$C16=$B$12),1,0))","v":0},{"$f":"IF($C16=$B$13,$F16,0)","v":0},{"$f":"(IF(AND($E16=\"\",$C16=$B$13),1,0))","v":0},{"$nulls":5},{"$f":"SUM(AG16:AI16)","v":{"v":0,"d":"0.0"}},{"$f":"IF(AJ16=D16,1,0)","v":1},{"$f":"IF(AJ16=0,0,1)","v":0},{"$f":"IF(AK16+AL16=2,\"Korrekt\",\"\")","v":""}]
[2,{"$f":"'Wettkampf 1'!B17","v":"Wübben Jasper"},{"$f":"'Wettkampf 1'!C17","v":"Esterwegen"},null,null,{"$f":"IF(E17=\"x\",\"0\",D17)","v":{"v":0,"d":"0.0"}},{"$f":"IF(C17=$B$2,F17,0)","v":0},{"$f":"(IF(AND($E17=\"\",$C17=$B$2),1,0))","v":1},{"$f":"IF($C17=$B$3,F17,0)","v":0},{"$f":"(IF(AND($E17=\"\",$C17=$B$3),1,0))","v":0},{"$f":"IF($C17=$B$4,F17,0)","v":0},{"$f":"(IF(AND($E17=\"\",$C17=$B$4),1,0))","v":0},{"$f":"IF($C17=$B$5,F17,0)","v":0},{"$f":"(IF(AND($E17=\"\",$C17=$B$5),1,0))","v":0},{"$f":"IF($C17=$B$6,F17,0)","v":0},{"$f":"(IF(AND($E17=\"\",$C17=$B$6),1,0))","v":0},{"$f":"IF($C17=$B$7,F17,0)","v":0},{"$f":"(IF(AND($E17=\"\",$C17=$B$7),1,0))","v":0},{"$f":"IF($C17=$B$8,$F17,0)","v":0},{"$f":"(IF(AND($E17=\"\",$C17=$B$8),1,0))","v":0},{"$f":"IF($C17=$B$9,$F17,0)","v":0},{"$f":"(IF(AND($E17=\"\",$C17=$B$9),1,0))","v":0},{"$f":"IF($C17=$B$10,$F17,0)","v":0},{"$f":"(IF(AND($E17=\"\",$C17=$B$10),1,0))","v":0},{"$f":"IF($C17=$B$11,$F17,0)","v":0},{"$f":"(IF(AND($E17=\"\",$C17=$B$11),1,0))","v":0},{"$f":"IF($C17=$B$12,$F17,0)","v":0},{"$f":"(IF(AND($E17=\"\",$C17=$B$12),1,0))","v":0},{"$f":"IF($C17=$B$13,$F17,0)","v":0},{"$f":"(IF(AND($E17=\"\",$C17=$B$13),1,0))","v":0},{"$nulls":5},{"$f":"SUM(AG17:AI17)","v":{"v":0,"d":"0.0"}},{"$f":"IF(AJ17=D17,1,0)","v":1},{"$f":"IF(AJ17=0,0,1)","v":0},{"$f":"IF(AK17+AL17=2,\"Korrekt\",\"\")","v":""}]
[3,{"$f":"'Wettkampf 1'!B18","v":"Engbers Julian"},{"$f":"'Wettkampf 1'!C18","v":"Esterwegen"},null,null,{"v":0,"d":"0.0"},0,1,0,0,0,0,0,0,0,0,0,0,0,0,0,0,0,0,0,0,0,0,0,0,{"$nulls":5},{"v":0,"d":"0.0"},1,0,""]
[4,{"$f":"'Wettkampf 1'!B19","v":"Meyer Johan"},{"$f":"'Wettkampf 1'!C19","v":"Esterwegen"},null,null,{"v":0,"d":"0.0"},0,1,0,0,0,0,0,0,0,0,0,0,0,0,0,0,0,0,0,0,0,0,0,0,{"$nulls":5},{"v":0,"d":"0.0"},1,0,""]
[5,{"$f":"'Wettkampf 1'!B20","v":"Schütze 5"},{"$f":"'Wettkampf 1'!C20","v":"Esterwegen"},null,null,{"v":0,"d":"0.0"},0,1,0,0,0,0,0,0,0,0,0,0,0,0,0,0,0,0,0,0,0,0,0,0,{"$nulls":5},{"v":0,"d":"0.0"},1,0,""]
[6,{"$f":"'Wettkampf 1'!B21","v":"Strüwing Inja"},{"$f":"'Wettkampf 1'!C21","v":"Lähden Jugend I"},375.9,null,375.9,0,0,375.9,1,0,0,0,0,0,0,0,0,0,0,0,0,0,0,0,0,0,0,0,0,{"$nulls":5},{"v":0,"d":"0.0"},0,0,""]
[7,{"$f":"'Wettkampf 1'!B22","v":"Bruns Hendrik"},{"$f":"'Wettkampf 1'!C22","v":"Lähden Jugend I"},366.2,null,366.2,0,0,366.2,1,0,0,0,0,0,0,0,0,0,0,0,0,0,0,0,0,0,0,0,0,{"$nulls":5},{"v":0,"d":"0.0"},0,0,""]
[8,{"$f":"'Wettkampf 1'!B23","v":"Feldhaus Vanessa"},{"$f":"'Wettkampf 1'!C23","v":"Lähden Jugend I"},320.3,null,320.3,0,0,320.3,1,0,0,0,0,0,0,0,0,0,0,0,0,0,0,0,0,0,0,0,0,{"$nulls":5},{"v":0,"d":"0.0"},0,0,""]
[9,{"$f":"'Wettkampf 1'!B24","v":"Feldhaus Celien "},{"$f":"'Wettkampf 1'!C24","v":"Lähden Jugend I"},338.1,null,338.1,0,0,338.1,1,0,0,0,0,0,0,0,0,0,0,0,0,0,0,0,0,0,0,0,0,{"$nulls":5},{"v":0,"d":"0.0"},0,0,""]
[10,{"$f":"'Wettkampf 1'!B25","v":"Stümpler Jan-Luca"},{"$f":"'Wettkampf 1'!C25","v":"Lähden Jugend I"},null,null,{"v":0,"d":"0.0"},0,0,0,1,0,0,0,0,0,0,0,0,0,0,0,0,0,0,0,0,0,0,0,0,{"$nulls":5},{"v":0,"d":"0.0"},1,0,""]
[11,{"$f":"'Wettkampf 1'!B26","v":"Hanneken Maren"},{"$f":"'Wettkampf 1'!C26","v":"Börgerwald"},296.3,null,296.3,0,0,0,0,296.3,1,0,0,0,0,0,0,0,0,0,0,0,0,0,0,0,0,0,0,{"$nulls":5},{"v":0,"d":"0.0"},0,0,""]
[12,{"$f":"'Wettkampf 1'!B27","v":"Köstering Nele"},{"$f":"'Wettkampf 1'!C27","v":"Börgerwald"},null,null,{"v":0,"d":"0.0"},0,0,0,0,0,1,0,0,0,0,0,0,0,0,0,0,0,0,0,0,0,0,0,0,{"$nulls":5},{"v":0,"d":"0.0"},1,0,""]
[13,{"$f":"'Wettkampf 1'!B28","v":"Lohmann Amy"},{"$f":"'Wettkampf 1'!C28","v":"Börgerwald"},353.9,null,353.9,0,0,0,0,353.9,1,0,0,0,0,0,0,0,0,0,0,0,0,0,0,0,0,0,0,{"$nulls":5},{"v":0,"d":"0.0"},0,0,""]
[14,{"$f":"'Wettkampf 1'!B29","v":"Schütze 14"},{"$f":"'Wettkampf 1'!C29","v":"Börgerwald"},null,null,{"v":0,"d":"0.0"},0,0,0,0,0,1,0,0,0,0,0,0,0,0,0,0,0,0,0,0,0,0,0,0,{"$nulls":5},{"v":0,"d":"0.0"},1,0,""]
[15,{"$f":"'Wettkampf 1'!B30","v":"Schütze 15"},{"$f":"'Wettkampf 1'!C30","v":"Börgerwald"},null,null,{"v":0,"d":"0.0"},0,0,0,0,0,1,0,0,0,0,0,0,0,0,0,0,0,0,0,0,0,0,0,0,{"$nulls":5},{"v":0,"d":"0.0"},1,0,""]
[16,{"$f":"'Wettkampf 1'!B31","v":"Brandt Mira"},{"$f":"'Wettkampf 1'!C31","v":"Börgermoor"},331.7,null,331.7,0,0,0,0,0,0,331.7,1,0,0,0,0,0,0,0,0,0,0,0,0,0,0,0,0,{"$nulls":5},{"v":0,"d":"0.0"},0,0,""]
[17,{"$f":"'Wettkampf 1'!B32","v":"Eichhorn Luca"},{"$f":"'Wettkampf 1'!C32","v":"Börgermoor"},285.6,null,285.6,0,0,0,0,0,0,285.6,1,0,0,0,0,0,0,0,0,0,0,0,0,0,0,0,0,{"$nulls":5},{"v":0,"d":"0.0"},0,0,""]
[18,{"$f":"'Wettkampf 1'!B33","v":"Kohnen Saskia"},{"$f":"'Wettkampf 1'!C33","v":"Börgermoor"},313.5,null,313.5,0,0,0,0,0,0,313.5,1,0,0,0,0,0,0,0,0,0,0,0,0,0,0,0,0,{"$nulls":5},{"v":0,"d":"0.0"},0,0,""]
[19,{"$f":"'Wettkampf 1'!B34","v":"Schütze 19"},{"$f":"'Wettkampf 1'!C34","v":"Börgermoor"},null,null,{"v":0,"d":"0.0"},0,0,0,0,0,0,0,1,0,0,0,0,0,0,0,0,0,0,0,0,0,0,0,0,{"$nulls":5},{"v":0,"d":"0.0"},1,0,""]
[20,{"$f":"'Wettkampf 1'!B35","v":"Schütze 20"},{"$f":"'Wettkampf 1'!C35","v":"Börgermoor"},null,null,{"v":0,"d":"0.0"},0,0,0,0,0,0,0,1,0,0,0,0,0,0,0,0,0,0,0,0,0,0,0,0,{"$nulls":5},{"v":0,"d":"0.0"},1,0,""]
[21,{"$f":"'Wettkampf 1'!B36","v":"Runde Marcel"},{"$f":"'Wettkampf 1'!C36","v":"Spahnharrenstätte"},307.4,null,307.4,0,0,0,0,0,0,0,0,307.4,1,0,0,0,0,0,0,0,0,0,0,0,0,0,0,{"$nulls":5},{"v":0,"d":"0.0"},0,0,""]
[22,{"$f":"'Wettkampf 1'!B37","v":"Leis Fynn Lucas "},{"$f":"'Wettkampf 1'!C37","v":"Spahnharrenstätte"},null,null,{"v":0,"d":"0.0"},0,0,0,0,0,0,0,0,0,1,0,0,0,0,0,0,0,0,0,0,0,0,0,0,{"$nulls":5},{"v":0,"d":"0.0"},1,0,""]
[23,{"$f":"'Wettkampf 1'!B38","v":"Jansen Lars"},{"$f":"'Wettkampf 1'!C38","v":"Spahnharrenstätte"},null,null,{"v":0,"d":"0.0"},0,0,0,0,0,0,0,0,0,1,0,0,0,0,0,0,0,0,0,0,0,0,0,0,{"$nulls":5},{"v":0,"d":"0.0"},1,0,""]
[24,{"$f":"'Wettkampf 1'!B39","v":"Köster Thilo"},{"$f":"'Wettkampf 1'!C39","v":"Spahnharrenstätte"},null,null,{"v":0,"d":"0.0"},0,0,0,0,0,0,0,0,0,1,0,0,0,0,0,0,0,0,0,0,0,0,0,0,{"$nulls":5},{"v":0,"d":"0.0"},1,0,""]
[25,{"$f":"'Wettkampf 1'!B40","v":"Schütze 25"},{"$f":"'Wettkampf 1'!C40","v":"Spahnharrenstätte"},null,null,{"v":0,"d":"0.0"},0,0,0,0,0,0,0,0,0,1,0,0,0,0,0,0,0,0,0,0,0,0,0,0,{"$nulls":5},{"v":0,"d":"0.0"},1,0,""]
[26,{"$f":"'Wettkampf 1'!B41","v":"Dolling Leon"},{"$f":"'Wettkampf 1'!C41","v":"Lorup"},null,null,{"v":0,"d":"0.0"},0,0,0,0,0,0,0,0,0,0,0,1,0,0,0,0,0,0,0,0,0,0,0,0,{"$nulls":5},{"v":0,"d":"0.0"},1,0,""]
[27,{"$f":"'Wettkampf 1'!B42","v":"Schütze 27"},{"$f":"'Wettkampf 1'!C42","v":"Lorup"},null,null,{"v":0,"d":"0.0"},0,0,0,0,0,0,0,0,0,0,0,1,0,0,0,0,0,0,0,0,0,0,0,0,{"$nulls":5},{"v":0,"d":"0.0"},1,0,""]
[28,{"$f":"'Wettkampf 1'!B43","v":"Schütze 28"},{"$f":"'Wettkampf 1'!C43","v":"Lorup"},null,null,{"v":0,"d":"0.0"},0,0,0,0,0,0,0,0,0,0,0,1,0,0,0,0,0,0,0,0,0,0,0,0,{"$nulls":5},{"v":0,"d":"0.0"},1,0,""]
[29,{"$f":"'Wettkampf 1'!B44","v":"Schütze 29"},{"$f":"'Wettkampf 1'!C44","v":"Lorup"},null,null,{"v":0,"d":"0.0"},0,0,0,0,0,0,0,0,0,0,0,1,0,0,0,0,0,0,0,0,0,0,0,0,{"$nulls":5},{"v":0,"d":"0.0"},1,0,""]
[30,{"$f":"'Wettkampf 1'!B45","v":"Schütze 30"},{"$f":"'Wettkampf 1'!C45","v":"Lorup"},null,null,{"v":0,"d":"0.0"},0,0,0,0,0,0,0,0,0,0,0,1,0,0,0,0,0,0,0,0,0,0,0,0,{"$nulls":5},{"v":0,"d":"0.0"},1,0,""]
[31,{"$f":"'Wettkampf 1'!B46","v":"Wilken Noah"},{"$f":"'Wettkampf 1'!C46","v":"Lahn"},313.6,null,313.6,0,0,0,0,0,0,0,0,0,0,0,0,313.6,1,0,0,0,0,0,0,0,0,0,0,{"$nulls":5},{"v":0,"d":"0.0"},0,0,""]
[32,{"$f":"'Wettkampf 1'!B47","v":"Schulz Mika"},{"$f":"'Wettkampf 1'!C47","v":"Lahn"},239.9,null,239.9,0,0,0,0,0,0,0,0,0,0,0,0,239.9,1,0,0,0,0,0,0,0,0,0,0,{"$nulls":5},{"v":0,"d":"0.0"},0,0,""]
[33,{"$f":"'Wettkampf 1'!B48","v":"Schütze 33"},{"$f":"'Wettkampf 1'!C48","v":"Lahn"},null,null,{"v":0,"d":"0.0"},0,0,0,0,0,0,0,0,0,0,0,0,0,1,0,0,0,0,0,0,0,0,0,0,{"$nulls":5},{"v":0,"d":"0.0"},1,0,""]
[34,{"$f":"'Wettkampf 1'!B49","v":"Schütze 34"},{"$f":"'Wettkampf 1'!C49","v":"Lahn"},null,null,{"v":0,"d":"0.0"},0,0,0,0,0,0,0,0,0,0,0,0,0,1,0,0,0,0,0,0,0,0,0,0,{"$nulls":5},{"v":0,"d":"0.0"},1,0,""]
[35,{"$f":"'Wettkampf 1'!B50","v":"Schütze 35"},{"$f":"'Wettkampf 1'!C50","v":"Lahn"},null,null,{"v":0,"d":"0.0"},0,0,0,0,0,0,0,0,0,0,0,0,0,1,0,0,0,0,0,0,0,0,0,0,{"$nulls":5},{"v":0,"d":"0.0"},1,0,""]
[36,{"$f":"'Wettkampf 1'!B51","v":"Tharner Kim"},{"$f":"'Wettkampf 1'!C51","v":"Sögel"},null,null,{"v":0,"d":"0.0"},0,0,0,0,0,0,0,0,0,0,0,0,0,0,0,1,0,0,0,0,0,0,0,0,{"$nulls":5},{"v":0,"d":"0.0"},1,0,""]
[37,{"$f":"'Wettkampf 1'!B52","v":"Schütze 37"},{"$f":"'Wettkampf 1'!C52","v":"Sögel"},null,null,{"v":0,"d":"0.0"},0,0,0,0,0,0,0,0,0,0,0,0,0,0,0,1,0,0,0,0,0,0,0,0,{"$nulls":5},{"v":0,"d":"0.0"}]
[38,{"$f":"'Wettkampf 1'!B53","v":"Schütze 38"},{"$f":"'Wettkampf 1'!C53","v":"Sögel"},null,null,{"v":0,"d":"0.0"},0,0,0,0,0,0,0,0,0,0,0,0,0,0,0,1,0,0,0,0,0,0,0,0,{"$nulls":5},{"v":0,"d":"0.0"}]
[39,{"$f":"'Wettkampf 1'!B54","v":"Schütze 39"},{"$f":"'Wettkampf 1'!C54","v":"Sögel"},null,null,{"v":0,"d":"0.0"},0,0,0,0,0,0,0,0,0,0,0,0,{"$f":"IF($C54=$B$8,$F54,0)","v":0},{"$f":"(IF(AND($E54=\"\",$C54=$B$8),1,0))","v":0},{"$f":"IF($C54=$B$9,$F54,0)","v":0},{"$f":"(IF(AND($E54=\"\",$C54=$B$9),1,0))","v":1},{"$f":"IF($C54=$B$10,$F54,0)","v":0},{"$f":"(IF(AND($E54=\"\",$C54=$B$10),1,0))","v":0},{"$f":"IF($C54=$B$11,$F54,0)","v":0},{"$f":"(IF(AND($E54=\"\",$C54=$B$11),1,0))","v":0},{"$f":"IF($C54=$B$12,$F54,0)","v":0},{"$f":"(IF(AND($E54=\"\",$C54=$B$12),1,0))","v":0},{"$f":"IF($C54=$B$13,$F54,0)","v":0},{"$f":"(IF(AND($E54=\"\",$C54=$B$13),1,0))","v":0},{"$nulls":5},{"v":0,"d":"0.0"}]
[40,{"$f":"'Wettkampf 1'!B55","v":"Schütze 40"},{"$f":"'Wettkampf 1'!C55","v":"Sögel"},null,null,{"v":0,"d":"0.0"},0,0,0,0,0,0,0,0,0,0,0,0,0,0,0,1,0,0,0,0,0,0,0,0,{"$nulls":5},{"v":0,"d":"0.0"}]
[41,{"$f":"'Wettkampf 1'!B56","v":"Schütze 41"},{"$f":"'Wettkampf 1'!C56","v":"Verein IX"},null,null,{"v":0,"d":"0.0"},0,0,0,0,0,0,0,0,0,0,0,0,0,0,0,0,0,1,0,0,0,0,0,0,{"$nulls":5},{"v":0,"d":"0.0"}]
[42,{"$f":"'Wettkampf 1'!B57","v":"Schütze 42"},{"$f":"'Wettkampf 1'!C57","v":"Verein IX"},null,null,{"v":0,"d":"0.0"},0,0,0,0,0,0,0,0,0,0,0,0,0,0,0,0,0,1,0,0,0,0,0,0,{"$nulls":5},{"v":0,"d":"0.0"}]
[43,{"$f":"'Wettkampf 1'!B58","v":"Schütze 43"},{"$f":"'Wettkampf 1'!C58","v":"Verein IX"},null,null,{"v":0,"d":"0.0"},0,0,0,0,0,0,0,0,0,0,0,0,0,0,0,0,0,1,0,0,0,0,0,0,{"$nulls":5},{"v":0,"d":"0.0"}]
[44,{"$f":"'Wettkampf 1'!B59","v":"Schütze 44"},{"$f":"'Wettkampf 1'!C59","v":"Verein IX"},null,null,{"v":0,"d":"0.0"},0,0,0,0,0,0,0,0,0,0,0,0,0,0,0,0,0,1,0,0,0,0,0,0,{"$nulls":5},{"v":0,"d":"0.0"}]
[45,{"$f":"'Wettkampf 1'!B60","v":"Schütze 45"},{"$f":"'Wettkampf 1'!C60","v":"Verein IX"},null,null,{"v":0,"d":"0.0"},0,0,0,0,0,0,0,0,0,0,0,0,0,0,0,0,0,1,0,0,0,0,0,0,{"$nulls":5},{"v":0,"d":"0.0"}]
[46,{"$f":"'Wettkampf 1'!B61","v":"Schütze 46"},{"$f":"'Wettkampf 1'!C61","v":"Verein X"},null,null,{"v":0,"d":"0.0"},0,0,0,0,0,0,0,0,0,0,0,0,0,0,0,0,0,0,0,1,0,0,0,0,{"$nulls":5},{"v":0,"d":"0.0"}]
[47,{"$f":"'Wettkampf 1'!B62","v":"Schütze 47"},{"$f":"'Wettkampf 1'!C62","v":"Verein X"},null,null,{"v":0,"d":"0.0"},0,0,0,0,0,0,0,0,0,0,0,0,0,0,0,0,0,0,0,1,0,0,0,0,{"$nulls":5},{"v":0,"d":"0.0"}]
[48,{"$f":"'Wettkampf 1'!B63","v":"Schütze 48"},{"$f":"'Wettkampf 1'!C63","v":"Verein X"},null,null,{"v":0,"d":"0.0"},0,0,0,0,0,0,0,0,0,0,0,0,0,0,0,0,0,0,0,1,0,0,0,0,{"$nulls":5},{"v":0,"d":"0.0"}]
[49,{"$f":"'Wettkampf 1'!B64","v":"Schütze 49"},{"$f":"'Wettkampf 1'!C64","v":"Verein X"},null,null,{"v":0,"d":"0.0"},0,0,0,0,0,0,0,0,0,0,0,0,0,0,0,0,0,0,0,1,0,0,0,0,{"$nulls":5},{"v":0,"d":"0.0"}]
[50,{"$f":"'Wettkampf 1'!B65","v":"Schütze 50"},{"$f":"'Wettkampf 1'!C65","v":"Verein X"},null,null,{"v":0,"d":"0.0"},0,0,0,0,0,0,0,0,0,0,0,0,0,0,0,0,0,0,0,1,0,0,0,0,{"$nulls":5},{"v":0,"d":"0.0"}]
[51,{"$f":"'Wettkampf 1'!B66","v":"Schütze 51"},{"$f":"'Wettkampf 1'!C66","v":"Verein XI"},null,null,{"v":0,"d":"0.0"},0,0,0,0,0,0,0,0,0,0,0,0,0,0,0,0,0,0,0,0,0,1,0,0,{"$nulls":5},{"v":0,"d":"0.0"}]
[52,{"$f":"'Wettkampf 1'!B67","v":"Schütze 52"},{"$f":"'Wettkampf 1'!C67","v":"Verein XI"},null,null,{"v":0,"d":"0.0"},0,0,0,0,0,0,0,0,0,0,0,0,0,0,0,0,0,0,0,0,0,1,0,0,{"$nulls":5},{"v":0,"d":"0.0"}]
[53,{"$f":"'Wettkampf 1'!B68","v":"Schütze 53"},{"$f":"'Wettkampf 1'!C68","v":"Verein XI"},null,null,{"v":0,"d":"0.0"},0,0,0,0,0,0,0,0,0,0,0,0,0,0,0,0,0,0,0,0,0,1,0,0,{"$nulls":5},{"v":0,"d":"0.0"}]
[54,{"$f":"'Wettkampf 1'!B69","v":"Schütze 54"},{"$f":"'Wettkampf 1'!C69","v":"Verein XI"},null,null,{"v":0,"d":"0.0"},0,0,0,0,0,0,0,0,0,0,0,0,0,0,0,0,0,0,0,0,0,1,0,0,{"$nulls":5},{"v":0,"d":"0.0"}]
[55,{"$f":"'Wettkampf 1'!B70","v":"Schütze 55"},{"$f":"'Wettkampf 1'!C70","v":"Verein XI"},null,null,{"v":0,"d":"0.0"},0,0,0,0,0,0,0,0,0,0,0,0,0,0,0,0,0,0,0,0,0,1,0,0,{"$nulls":5},{"v":0,"d":"0.0"}]
[56,{"$f":"'Wettkampf 1'!B71","v":"Schütze 56"},{"$f":"'Wettkampf 1'!C71","v":"Verein XII"},null,null,{"v":0,"d":"0.0"},0,0,0,0,0,0,0,0,0,0,0,0,0,0,0,0,0,0,0,0,0,0,0,1,{"$nulls":5},{"v":0,"d":"0.0"}]
[57,{"$f":"'Wettkampf 1'!B72","v":"Schütze 57"},{"$f":"'Wettkampf 1'!C72","v":"Verein XII"},null,null,{"v":0,"d":"0.0"},0,0,0,0,0,0,0,0,0,0,0,0,0,0,0,0,0,0,0,0,0,0,0,1,{"$nulls":5},{"v":0,"d":"0.0"}]
[58,{"$f":"'Wettkampf 1'!B73","v":"Schütze 58"},{"$f":"'Wettkampf 1'!C73","v":"Verein XII"},null,null,{"v":0,"d":"0.0"},0,0,0,0,0,0,0,0,0,0,0,0,0,0,0,0,0,0,0,0,0,0,0,1,{"$nulls":5},{"v":0,"d":"0.0"}]
[59,{"$f":"'Wettkampf 1'!B74","v":"Schütze 59"},{"$f":"'Wettkampf 1'!C74","v":"Verein XII"},null,null,{"v":0,"d":"0.0"},0,0,0,0,0,0,0,0,0,0,0,0,0,0,0,0,0,0,0,0,0,0,0,1,{"$nulls":5},{"v":0,"d":"0.0"}]
[60,{"$f":"'Wettkampf 1'!B75","v":"Schütze 60"},{"$f":"'Wettkampf 1'!C75","v":"Verein XII"},null,null,{"v":0,"d":"0.0"},0,0,0,0,0,0,0,0,0,0,0,0,0,0,0,0,0,0,0,0,0,0,0,1,{"$nulls":5},{"v":0,"d":"0.0"}]
[{"$nulls":6},{"$f":"LARGE(G16:G75,1)+LARGE(G16:G75,2)+LARGE(G16:G75,3)","v":0},{"$f":"SUM(H16:H75)","v":5},{"$f":"LARGE(I16:I75,1)+LARGE(I16:I75,2)+LARGE(I16:I75,3)","v":1080.1999999999998},{"$f":"SUM(J16:J75)","v":5},{"$f":"LARGE(K16:K75,1)+LARGE(K16:K75,2)+LARGE(K16:K75,3)","v":650.2},{"$f":"SUM(L16:L75)","v":5},{"$f":"LARGE(M16:M75,1)+LARGE(M16:M75,2)+LARGE(M16:M75,3)","v":930.8000000000001},{"$f":"SUM(N16:N75)","v":5},{"$f":"LARGE(O16:O75,1)+LARGE(O16:O75,2)+LARGE(O16:O75,3)","v":307.4},{"$f":"SUM(P16:P75)","v":5},{"$f":"LARGE(Q16:Q75,1)+LARGE(Q16:Q75,2)+LARGE(Q16:Q75,3)","v":0},{"$f":"SUM(R16:R75)","v":5},{"$f":"LARGE(S16:S75,1)+LARGE(S16:S75,2)+LARGE(S16:S75,3)","v":553.5},{"$f":"SUM(T16:T75)","v":5},{"$f":"LARGE(U16:U75,1)+LARGE(U16:U75,2)+LARGE(U16:U75,3)","v":0},{"$f":"SUM(V16:V75)","v":5},{"$f":"LARGE(W16:W75,1)+LARGE(W16:W75,2)+LARGE(W16:W75,3)","v":0},{"$f":"SUM(X16:X75)","v":5},{"$f":"LARGE(Y16:Y75,1)+LARGE(Y16:Y75,2)+LARGE(Y16:Y75,3)","v":0},{"$f":"SUM(Z16:Z75)","v":5},{"$f":"LARGE(AA16:AA75,1)+LARGE(AA16:AA75,2)+LARGE(AA16:AA75,3)","v":0},{"$f":"SUM(AB16:AB75)","v":5},{"$f":"LARGE(AC16:AC75,1)+LARGE(AC16:AC75,2)+LARGE(AC16:AC75,3)","v":0},{"$f":"SUM(AD16:AD75)","v":5}]
[null,null,"per Email an: sk-huemmling@gmx.de"]

{"sheet":"4","index":4,"n_rows":77,"n_cols":39,"rows_kept":77,"merged":[[0,34,0,35],[1,34,1,35],[4,34,4,35],[5,34,5,35],[6,34,6,35],[14,32,14,35]]}
[null,"Verein / Gruppe",null,"Ergebnisse",{"$nulls":29},"Austragungsort:",{"$f":"Übersicht!G4","v":"Börgerwald"}]
[1,{"$f":"'Wettkampf 1'!B2","v":"Esterwegen"},null,{"$f":"G76","v":294.1},{"$f":"IF(H76>4,\"Es sind zu viele Schützen in Wertung!\",\" \")","v":"Es sind zu viele Schützen in Wertung!"},{"$nulls":28},"Wettkampftag:",{"$f":"Übersicht!G3","v":"16.11."}]
[2,{"$f":"'Wettkampf 1'!B3","v":"Lähden Jugend I"},null,{"$f":"I76","v":1132.2},{"$f":"IF(J76>4,\"Es sind zu viele Schützen in Wertung!\",\" \")","v":"Es sind zu viele Schützen in Wertung!"}]
[3,{"$f":"'Wettkampf 1'!B4","v":"Börgerwald"},null,{"$f":"K76","v":1042.5},{"$f":"IF(L76>4,\"Es sind zu viele Schützen in Wertung!\",\" \")","v":"Es sind zu viele Schützen in Wertung!"},{"$nulls":30},"Ansprechpartner für Rückfragen:"]
[4,{"$f":"'Wettkampf 1'!B5","v":"Börgermoor"},null,{"$f":"M76","v":{"v":1014.1000000000001,"d":"1014.1"}},{"$f":"IF(N76>4,\"Es sind zu viele Schützen in Wertung!\",\" \")","v":"Es sind zu viele Schützen in Wertung!"},{"$nulls":28},"Name:"]
[5,{"$f":"'Wettkampf 1'!B6","v":"Spahnharrenstätte"},null,{"$f":"O76","v":674.1},{"$f":"IF(P76>4,\"Es sind zu viele Schützen in Wertung!\",\" \")","v":"Es sind zu viele Schützen in Wertung!"},{"$nulls":28},"Tel:"]
[6,{"$f":"'Wettkampf 1'!B7","v":"Lorup"},null,{"$f":"Q76","v":287.1},{"$f":"IF(R76>4,\"Es sind zu viele Schützen in Wertung!\",\" \")","v":"Es sind zu viele Schützen in Wertung!"},{"$nulls":28},"Standaufsicht:","eintragen"]
[7,{"$f":"'Wettkampf 1'!B8","v":"Lahn"},null,{"$f":"S76","v":{"v":563,"d":"563.0"}},{"$f":"IF(T76>4,\"Es sind zu viele Schützen in Wertung!\",\" \")","v":"Es sind zu viele Schützen in Wertung!"}]
[8,{"$f":"'Wettkampf 1'!B9","v":"Sögel"},null,{"$f":"U76","v":358.1},{"$f":"IF(V76>4,\"Es sind zu viele Schützen in Wertung!\",\" \")","v":"Es sind zu viele Schützen in Wertung!"}]
[9,{"$f":"'Wettkampf 1'!B10","v":"Verein IX"},null,{"$f":"W76","v":{"v":0,"d":"0.0"}},{"$f":"IF(X76>4,\"Es sind zu viele Schützen in Wertung!\",\" \")","v":"Es sind zu viele Schützen in Wertung!"}]
[10,{"$f":"'Wettkampf 1'!B11","v":"Verein X"},null,{"$f":"Y76","v":{"v":0,"d":"0.0"}},{"$f":"IF(Z76>4,\"Es sind zu viele Schützen in Wertung!\",\" \")","v":"Es sind zu viele Schützen in Wertung!"}]
[11,{"$f":"'Wettkampf 1'!B12","v":"Verein XI"},null,{"$f":"AA76","v":{"v":0,"d":"0.0"}},{"$f":"IF(AB76>4,\"Es sind zu viele Schützen in Wertung!\",\" \")","v":"Es sind zu viele Schützen in Wertung!"}]
[12,{"$f":"'Wettkampf 1'!B13","v":"Verein XII"},null,{"$f":"AC76","v":{"v":0,"d":"0.0"}},{"$f":"IF(AD76>4,\"Es sind zu viele Schützen in Wertung!\",\" \")","v":"Es sind zu viele Schützen in Wertung!"}]
[]
[null,"Einzelergebnisse:","Verein / Gruppe","Ergebnisse (mindestens 0 eintragen)","AW? Dann x eintippen",null,"Verein 1",null,"Verein 2",null,"Verein 3",null,"Verein 4",null,"Verein 5",null,"Verein 6",null,"Verein 7",null,"Verein 8",null,"Verein 9",null,"Verein 10",null,"Verein 11",null,"Verein 12",{"$nulls":3},"Proberechnung bei Streifen:"]
[1,{"$f":"'Wettkampf 1'!B16","v":"Gedecksnis Stefan"},{"$f":"'Wettkampf 1'!C16","v":"Esterwegen"},294.1,null,{"$f":"IF(E16=\"x\",\"0\",D16)","v":294.1},{"$f":"IF(C16=$B$2,F16,0)","v":294.1},{"$f":"(IF(AND($E16=\"\",$C16=$B$2),1,0))","v":1},{"$f":"IF($C16=$B$3,$F16,0)","v":0},{"$f":"(IF(AND($E16=\"\",$C16=$B$3),1,0))","v":0},{"$f":"IF($C16=$B$4,F16,0)","v":0},{"$f":"(IF(AND($E16=\"\",$C16=$B$4),1,0))","v":0},{"$f":"IF($C16=$B$5,F16,0)","v":0},{"$f":"(IF(AND($E16=\"\",$C16=$B$5),1,0))","v":0},{"$f":"IF($C16=$B$6,F16,0)","v":0},{"$f":"(IF(AND($E16=\"\",$C16=$B$6),1,0))","v":0},{"$f":"IF($C16=$B$7,F16,0)","v":0},{"$f":"(IF(AND($E16=\"\",$C16=$B$7),1,0))","v":0},{"$f":"IF($C16=$B$8,$F16,0)","v":0},{"$f":"(IF(AND($E16=\"\",$C16=$B$8),1,0))","v":0},{"$f":"IF($C16=$B$9,$F16,0)","v":0},{"$f":"(IF(AND($E16=\"\",$C16=$B$9),1,0))","v":0},{"$f":"IF($C16=$B$10,$F16,0)","v":0},{"$f":"(IF(AND($E16=\"\",$C16=$B$10),1,0))","v":0},{"$f":"IF($C16=$B$11,$F16,0)","v":0},{"$f":"(IF(AND($E16=\"\",$C16=$B$11),1,0))","v":0},{"$f":"IF($C16=$B$12,$F16,0)","v":0},{"$f":"(IF(AND($E16=\"\",$C16=$B$12),1,0))","v":0},{"$f":"IF($C16=$B$13,$F16,0)","v":0},{"$f":"(IF(AND($E16=\"\",$C16=$B$13),1,0))","v":0},{"$nulls":5},{"$f":"SUM(AG16:AI16)","v":{"v":0,"d":"0.0"}},{"$f":"IF(AJ16=D16,1,0)","v":0},{"$f":"IF(AJ16=0,0,1)","v":0},{"$f":"IF(AK16+AL16=2,\"Korrekt\",\"\")","v":""}]
[2,{"$f":"'Wettkampf 1'!B17","v":"Wübben Jasper"},{"$f":"'Wettkampf 1'!C17","v":"Esterwegen"},null,null,{"$f":"IF(E17=\"x\",\"0\",D17)","v":{"v":0,"d":"0.0"}},{"$f":"IF(C17=$B$2,F17,0)","v":0},{"$f":"(IF(AND($E17=\"\",$C17=$B$2),1,0))","v":1},{"$f":"IF($C17=$B$3,F17,0)","v":0},{"$f":"(IF(AND($E17=\"\",$C17=$B$3),1,0))","v":0},{"$f":"IF($C17=$B$4,F17,0)","v":0},{"$f":"(IF(AND($E17=\"\",$C17=$B$4),1,0))","v":0},{"$f":"IF($C17=$B$5,F17,0)","v":0},{"$f":"(IF(AND($E17=\"\",$C17=$B$5),1,0))","v":0},{"$f":"IF($C17=$B$6,F17,0)","v":0},{"$f":"(IF(AND($E17=\"\",$C17=$B$6),1,0))","v":0},{"$f":"IF($C17=$B$7,F17,0)","v":0},{"$f":"(IF(AND($E17=\"\",$C17=$B$7),1,0))","v":0},{"$f":"IF($C17=$B$8,$F17,0)","v":0},{"$f":"(IF(AND($E17=\"\",$C17=$B$8),1,0))","v":0},{"$f":"IF($C17=$B$9,$F17,0)","v":0},{"$f":"(IF(AND($E17=\"\",$C17=$B$9),1,0))","v":0},{"$f":"IF($C17=$B$10,$F17,0)","v":0},{"$f":"(IF(AND($E17=\"\",$C17=$B$10),1,0))","v":0},{"$f":"IF($C17=$B$11,$F17,0)","v":0},{"$f":"(IF(AND($E17=\"\",$C17=$B$11),1,0))","v":0},{"$f":"IF($C17=$B$12,$F17,0)","v":0},{"$f":"(IF(AND($E17=\"\",$C17=$B$12),1,0))","v":0},{"$f":"IF($C17=$B$13,$F17,0)","v":0},{"$f":"(IF(AND($E17=\"\",$C17=$B$13),1,0))","v":0},{"$nulls":5},{"$f":"SUM(AG17:AI17)","v":{"v":0,"d":"0.0"}},{"$f":"IF(AJ17=D17,1,0)","v":1},{"$f":"IF(AJ17=0,0,1)","v":0},{"$f":"IF(AK17+AL17=2,\"Korrekt\",\"\")","v":""}]
[3,{"$f":"'Wettkampf 1'!B18","v":"Engbers Julian"},{"$f":"'Wettkampf 1'!C18","v":"Esterwegen"},null,null,{"v":0,"d":"0.0"},0,1,0,0,0,0,0,0,0,0,0,0,0,0,0,0,0,0,0,0,0,0,0,0,{"$nulls":5},{"v":0,"d":"0.0"},1,0,""]
[4,{"$f":"'Wettkampf 1'!B19","v":"Meyer Johan"},{"$f":"'Wettkampf 1'!C19","v":"Esterwegen"},null,null,{"v":0,"d":"0.0"},0,1,0,0,0,0,0,0,0,0,0,0,0,0,0,0,0,0,0,0,0,0,0,0,{"$nulls":5},{"v":0,"d":"0.0"},1,0,""]
[5,{"$f":"'Wettkampf 1'!B20","v":"Schütze 5"},{"$f":"'Wettkampf 1'!C20","v":"Esterwegen"},null,null,{"v":0,"d":"0.0"},0,1,0,0,0,0,0,0,0,0,0,0,0,0,0,0,0,0,0,0,0,0,0,0,{"$nulls":5},{"v":0,"d":"0.0"},1,0,""]
[6,{"$f":"'Wettkampf 1'!B21","v":"Strüwing Inja"},{"$f":"'Wettkampf 1'!C21","v":"Lähden Jugend I"},384.1,null,384.1,0,0,384.1,1,0,0,0,0,0,0,0,0,0,0,0,0,0,0,0,0,0,0,0,0,{"$nulls":5},{"v":0,"d":"0.0"},0,0,""]
[7,{"$f":"'Wettkampf 1'!B22","v":"Bruns Hendrik"},{"$f":"'Wettkampf 1'!C22","v":"Lähden Jugend I"},368.6,null,368.6,0,0,368.6,1,0,0,0,0,0,0,0,0,0,0,0,0,0,0,0,0,0,0,0,0,{"$nulls":5},{"v":0,"d":"0.0"},0,0,""]
[8,{"$f":"'Wettkampf 1'!B23","v":"Feldhaus Vanessa"},{"$f":"'Wettkampf 1'!C23","v":"Lähden Jugend I"},{"v":324,"d":"324.0"},null,{"v":324,"d":"324.0"},0,0,324,1,0,0,0,0,0,0,0,0,0,0,0,0,0,0,0,0,0,0,0,0,{"$nulls":5},{"v":0,"d":"0.0"},0,0,""]
[9,{"$f":"'Wettkampf 1'!B24","v":"Feldhaus Celien "},{"$f":"'Wettkampf 1'!C24","v":"Lähden Jugend I"},337.8,null,337.8,0,0,337.8,1,0,0,0,0,0,0,0,0,0,0,0,0,0,0,0,0,0,0,0,0,{"$nulls":5},{"v":0,"d":"0.0"},0,0,""]
[10,{"$f":"'Wettkampf 1'!B25","v":"Stümpler Jan-Luca"},{"$f":"'Wettkampf 1'!C25","v":"Lähden Jugend I"},379.5,null,379.5,0,0,379.5,1,0,0,0,0,0,0,0,0,0,0,0,0,0,0,0,0,0,0,0,0,{"$nulls":5},{"v":0,"d":"0.0"},0,0,""]
[11,{"$f":"'Wettkampf 1'!B26","v":"Hanneken Maren"},{"$f":"'Wettkampf 1'!C26","v":"Börgerwald"},{"v":331,"d":"331.0"},null,{"v":331,"d":"331.0"},0,0,0,0,331,1,0,0,0,0,0,0,0,0,0,0,0,0,0,0,0,0,0,0,{"$nulls":5},{"v":0,"d":"0.0"},0,0,""]
[12,{"$f":"'Wettkampf 1'!B27","v":"Köstering Nele"},{"$f":"'Wettkampf 1'!C27","v":"Börgerwald"},345.5,null,345.5,0,0,0,0,345.5,1,0,0,0,0,0,0,0,0,0,0,0,0,0,0,0,0,0,0,{"$nulls":5},{"v":0,"d":"0.0"},0,0,""]
[13,{"$f":"'Wettkampf 1'!B28","v":"Lohmann Amy"},{"$f":"'Wettkampf 1'!C28","v":"Börgerwald"},{"v":366,"d":"366.0"},null,{"v":366,"d":"366.0"},0,0,0,0,366,1,0,0,0,0,0,0,0,0,0,0,0,0,0,0,0,0,0,0,{"$nulls":5},{"v":0,"d":"0.0"},0,0,""]
[14,{"$f":"'Wettkampf 1'!B29","v":"Schütze 14"},{"$f":"'Wettkampf 1'!C29","v":"Börgerwald"},null,null,{"v":0,"d":"0.0"},0,0,0,0,0,1,0,0,0,0,0,0,0,0,0,0,0,0,0,0,0,0,0,0,{"$nulls":5},{"v":0,"d":"0.0"},1,0,""]
[15,{"$f":"'Wettkampf 1'!B30","v":"Schütze 15"},{"$f":"'Wettkampf 1'!C30","v":"Börgerwald"},null,null,{"v":0,"d":"0.0"},0,0,0,0,0,1,0,0,0,0,0,0,0,0,0,0,0,0,0,0,0,0,0,0,{"$nulls":5},{"v":0,"d":"0.0"},1,0,""]
[16,{"$f":"'Wettkampf 1'!B31","v":"Brandt Mira"},{"$f":"'Wettkampf 1'!C31","v":"Börgermoor"},355.1,null,355.1,0,0,0,0,0,0,355.1,1,0,0,0,0,0,0,0,0,0,0,0,0,0,0,0,0,{"$nulls":5},{"v":0,"d":"0.0"},0,0,""]
[17,{"$f":"'Wettkampf 1'!B32","v":"Eichhorn Luca"},{"$f":"'Wettkampf 1'!C32","v":"Börgermoor"},340.8,null,340.8,0,0,0,0,0,0,340.8,1,0,0,0,0,0,0,0,0,0,0,0,0,0,0,0,0,{"$nulls":5},{"v":0,"d":"0.0"},0,0,""]
[18,{"$f":"'Wettkampf 1'!B33","v":"Kohnen Saskia"},{"$f":"'Wettkampf 1'!C33","v":"Börgermoor"},318.2,null,318.2,0,0,0,0,0,0,318.2,1,0,0,0,0,0,0,0,0,0,0,0,0,0,0,0,0,{"$nulls":5},{"v":0,"d":"0.0"},0,0,""]
[19,{"$f":"'Wettkampf 1'!B34","v":"Schütze 19"},{"$f":"'Wettkampf 1'!C34","v":"Börgermoor"},null,null,{"v":0,"d":"0.0"},0,0,0,0,0,0,0,1,0,0,0,0,0,0,0,0,0,0,0,0,0,0,0,0,{"$nulls":5},{"v":0,"d":"0.0"},1,0,""]
[20,{"$f":"'Wettkampf 1'!B35","v":"Schütze 20"},{"$f":"'Wettkampf 1'!C35","v":"Börgermoor"},null,null,{"v":0,"d":"0.0"},0,0,0,0,0,0,0,1,0,0,0,0,0,0,0,0,0,0,0,0,0,0,0,0,{"$nulls":5},{"v":0,"d":"0.0"},1,0,""]
[21,{"$f":"'Wettkampf 1'!B36","v":"Runde Marcel"},{"$f":"'Wettkampf 1'!C36","v":"Spahnharrenstätte"},{"v":317,"d":"317.0"},null,{"v":317,"d":"317.0"},0,0,0,0,0,0,0,0,317,1,0,0,0,0,0,0,0,0,0,0,0,0,0,0,{"$nulls":5},{"v":0,"d":"0.0"},0,0,""]
[22,{"$f":"'Wettkampf 1'!B37","v":"Leis Fynn Lucas "},{"$f":"'Wettkampf 1'!C37","v":"Spahnharrenstätte"},null,null,{"v":0,"d":"0.0"},0,0,0,0,0,0,0,0,0,1,0,0,0,0,0,0,0,0,0,0,0,0,0,0,{"$nulls":5},{"v":0,"d":"0.0"},1,0,""]
[23,{"$f":"'Wettkampf 1'!B38","v":"Jansen Lars"},{"$f":"'Wettkampf 1'!C38","v":"Spahnharrenstätte"},224.5,null,224.5,0,0,0,0,0,0,0,0,224.5,1,0,0,0,0,0,0,0,0,0,0,0,0,0,0,{"$nulls":5},{"v":0,"d":"0.0"},0,0,""]
[24,{"$f":"'Wettkampf 1'!B39","v":"Köster Thilo"},{"$f":"'Wettkampf 1'!C39","v":"Spahnharrenstätte"},132.6,null,132.6,0,0,0,0,0,0,0,0,132.6,1,0,0,0,0,0,0,0,0,0,0,0,0,0,0,{"$nulls":5},{"v":0,"d":"0.0"},0,0,""]
[25,{"$f":"'Wettkampf 1'!B40","v":"Schütze 25"},{"$f":"'Wettkampf 1'!C40","v":"Spahnharrenstätte"},null,null,{"v":0,"d":"0.0"},0,0,0,0,0,0,0,0,0,1,0,0,0,0,0,0,0,0,0,0,0,0,0,0,{"$nulls":5},{"v":0,"d":"0.0"},1,0,""]
[26,{"$f":"'Wettkampf 1'!B41","v":"Dolling Leon"},{"$f":"'Wettkampf 1'!C41","v":"Lorup"},287.1,null,287.1,0,0,0,0,0,0,0,0,0,0,287.1,1,0,0,0,0,0,0,0,0,0,0,0,0,{"$nulls":5},{"v":0,"d":"0.0"},0,0,""]
[27,{"$f":"'Wettkampf 1'!B42","v":"Schütze 27"},{"$f":"'Wettkampf 1'!C42","v":"Lorup"},null,null,{"v":0,"d":"0.0"},0,0,0,0,0,0,0,0,0,0,0,1,0,0,0,0,0,0,0,0,0,0,0,0,{"$nulls":5},{"v":0,"d":"0.0"},1,0,""]
[28,{"$f":"'Wettkampf 1'!B43","v":"Schütze 28"},{"$f":"'Wettkampf 1'!C43","v":"Lorup"},null,null,{"v":0,"d":"0.0"},0,0,0,0,0,0,0,0,0,0,0,1,0,0,0,0,0,0,0,0,0,0,0,0,{"$nulls":5},{"v":0,"d":"0.0"},1,0,""]
[29,{"$f":"'Wettkampf 1'!B44","v":"Schütze 29"},{"$f":"'Wettkampf 1'!C44","v":"Lorup"},null,null,{"v":0,"d":"0.0"},0,0,0,0,0,0,0,0,0,0,0,1,0,0,0,0,0,0,0,0,0,0,0,0,{"$nulls":5},{"v":0,"d":"0.0"},1,0,""]
[30,{"$f":"'Wettkampf 1'!B45","v":"Schütze 30"},{"$f":"'Wettkampf 1'!C45","v":"Lorup"},null,null,{"v":0,"d":"0.0"},0,0,0,0,0,0,0,0,0,0,0,1,0,0,0,0,0,0,0,0,0,0,0,0,{"$nulls":5},{"v":0,"d":"0.0"},1,0,""]
[31,{"$f":"'Wettkampf 1'!B46","v":"Wilken Noah"},{"$f":"'Wettkampf 1'!C46","v":"Lahn"},310.5,null,310.5,0,0,0,0,0,0,0,0,0,0,0,0,310.5,1,0,0,0,0,0,0,0,0,0,0,{"$nulls":5},{"v":0,"d":"0.0"},0,0,""]
[32,{"$f":"'Wettkampf 1'!B47","v":"Schulz Mika"},{"$f":"'Wettkampf 1'!C47","v":"Lahn"},252.5,null,252.5,0,0,0,0,0,0,0,0,0,0,0,0,252.5,1,0,0,0,0,0,0,0,0,0,0,{"$nulls":5},{"v":0,"d":"0.0"},0,0,""]
[33,{"$f":"'Wettkampf 1'!B48","v":"Schütze 33"},{"$f":"'Wettkampf 1'!C48","v":"Lahn"},null,null,{"v":0,"d":"0.0"},0,0,0,0,0,0,0,0,0,0,0,0,0,1,0,0,0,0,0,0,0,0,0,0,{"$nulls":5},{"v":0,"d":"0.0"},1,0,""]
[34,{"$f":"'Wettkampf 1'!B49","v":"Schütze 34"},{"$f":"'Wettkampf 1'!C49","v":"Lahn"},null,null,{"v":0,"d":"0.0"},0,0,0,0,0,0,0,0,0,0,0,0,0,1,0,0,0,0,0,0,0,0,0,0,{"$nulls":5},{"v":0,"d":"0.0"},1,0,""]
[35,{"$f":"'Wettkampf 1'!B50","v":"Schütze 35"},{"$f":"'Wettkampf 1'!C50","v":"Lahn"},null,null,{"v":0,"d":"0.0"},0,0,0,0,0,0,0,0,0,0,0,0,0,1,0,0,0,0,0,0,0,0,0,0,{"$nulls":5},{"v":0,"d":"0.0"},1,0,""]
[36,{"$f":"'Wettkampf 1'!B51","v":"Tharner Kim"},{"$f":"'Wettkampf 1'!C51","v":"Sögel"},358.1,null,358.1,0,0,0,0,0,0,0,0,0,0,0,0,0,0,358.1,1,0,0,0,0,0,0,0,0,{"$nulls":5},{"v":0,"d":"0.0"},0,0,""]
[37,{"$f":"'Wettkampf 1'!B52","v":"Schütze 37"},{"$f":"'Wettkampf 1'!C52","v":"Sögel"},null,null,{"v":0,"d":"0.0"},0,0,0,0,0,0,0,0,0,0,0,0,0,0,0,1,0,0,0,0,0,0,0,0,{"$nulls":5},{"v":0,"d":"0.0"}]
[38,{"$f":"'Wettkampf 1'!B53","v":"Schütze 38"},{"$f":"'Wettkampf 1'!C53","v":"Sögel"},null,null,{"v":0,"d":"0.0"},0,0,0,0,0,0,0,0,0,0,0,0,0,0,0,1,0,0,0,0,0,0,0,0,{"$nulls":5},{"v":0,"d":"0.0"}]
[39,{"$f":"'Wettkampf 1'!B54","v":"Schütze 39"},{"$f":"'Wettkampf 1'!C54","v":"Sögel"},null,null,{"v":0,"d":"0.0"},0,0,0,0,0,0,0,0,0,0,0,0,{"$f":"IF($C54=$B$8,$F54,0)","v":0},{"$f":"(IF(AND($E54=\"\",$C54=$B$8),1,0))","v":0},{"$f":"IF($C54=$B$9,$F54,0)","v":0},{"$f":"(IF(AND($E54=\"\",$C54=$B$9),1,0))","v":1},{"$f":"IF($C54=$B$10,$F54,0)","v":0},{"$f":"(IF(AND($E54=\"\",$C54=$B$10),1,0))","v":0},{"$f":"IF($C54=$B$11,$F54,0)","v":0},{"$f":"(IF(AND($E54=\"\",$C54=$B$11),1,0))","v":0},{"$f":"IF($C54=$B$12,$F54,0)","v":0},{"$f":"(IF(AND($E54=\"\",$C54=$B$12),1,0))","v":0},{"$f":"IF($C54=$B$13,$F54,0)","v":0},{"$f":"(IF(AND($E54=\"\",$C54=$B$13),1,0))","v":0},{"$nulls":5},{"v":0,"d":"0.0"}]
[40,{"$f":"'Wettkampf 1'!B55","v":"Schütze 40"},{"$f":"'Wettkampf 1'!C55","v":"Sögel"},null,null,{"v":0,"d":"0.0"},0,0,0,0,0,0,0,0,0,0,0,0,0,0,0,1,0,0,0,0,0,0,0,0,{"$nulls":5},{"v":0,"d":"0.0"}]
[41,{"$f":"'Wettkampf 1'!B56","v":"Schütze 41"},{"$f":"'Wettkampf 1'!C56","v":"Verein IX"},null,null,{"v":0,"d":"0.0"},0,0,0,0,0,0,0,0,0,0,0,0,0,0,0,0,0,1,0,0,0,0,0,0,{"$nulls":5},{"v":0,"d":"0.0"}]
[42,{"$f":"'Wettkampf 1'!B57","v":"Schütze 42"},{"$f":"'Wettkampf 1'!C57","v":"Verein IX"},null,null,{"v":0,"d":"0.0"},0,0,0,0,0,0,0,0,0,0,0,0,0,0,0,0,0,1,0,0,0,0,0,0,{"$nulls":5},{"v":0,"d":"0.0"}]
[43,{"$f":"'Wettkampf 1'!B58","v":"Schütze 43"},{"$f":"'Wettkampf 1'!C58","v":"Verein IX"},null,null,{"v":0,"d":"0.0"},0,0,0,0,0,0,0,0,0,0,0,0,0,0,0,0,0,1,0,0,0,0,0,0,{"$nulls":5},{"v":0,"d":"0.0"}]
[44,{"$f":"'Wettkampf 1'!B59","v":"Schütze 44"},{"$f":"'Wettkampf 1'!C59","v":"Verein IX"},null,null,{"v":0,"d":"0.0"},0,0,0,0,0,0,0,0,0,0,0,0,0,0,0,0,0,1,0,0,0,0,0,0,{"$nulls":5},{"v":0,"d":"0.0"}]
[45,{"$f":"'Wettkampf 1'!B60","v":"Schütze 45"},{"$f":"'Wettkampf 1'!C60","v":"Verein IX"},null,null,{"v":0,"d":"0.0"},0,0,0,0,0,0,0,0,0,0,0,0,0,0,0,0,0,1,0,0,0,0,0,0,{"$nulls":5},{"v":0,"d":"0.0"}]
[46,{"$f":"'Wettkampf 1'!B61","v":"Schütze 46"},{"$f":"'Wettkampf 1'!C61","v":"Verein X"},null,null,{"v":0,"d":"0.0"},0,0,0,0,0,0,0,0,0,0,0,0,0,0,0,0,0,0,0,1,0,0,0,0,{"$nulls":5},{"v":0,"d":"0.0"}]
[47,{"$f":"'Wettkampf 1'!B62","v":"Schütze 47"},{"$f":"'Wettkampf 1'!C62","v":"Verein X"},null,null,{"v":0,"d":"0.0"},0,0,0,0,0,0,0,0,0,0,0,0,0,0,0,0,0,0,0,1,0,0,0,0,{"$nulls":5},{"v":0,"d":"0.0"}]
[48,{"$f":"'Wettkampf 1'!B63","v":"Schütze 48"},{"$f":"'Wettkampf 1'!C63","v":"Verein X"},null,null,{"v":0,"d":"0.0"},0,0,0,0,0,0,0,0,0,0,0,0,0,0,0,0,0,0,0,1,0,0,0,0,{"$nulls":5},{"v":0,"d":"0.0"}]
[49,{"$f":"'Wettkampf 1'!B64","v":"Schütze 49"},{"$f":"'Wettkampf 1'!C64","v":"Verein X"},null,null,{"v":0,"d":"0.0"},0,0,0,0,0,0,0,0,0,0,0,0,0,0,0,0,0,0,0,1,0,0,0,0,{"$nulls":5},{"v":0,"d":"0.0"}]
[50,{"$f":"'Wettkampf 1'!B65","v":"Schütze 50"},{"$f":"'Wettkampf 1'!C65","v":"Verein X"},null,null,{"v":0,"d":"0.0"},0,0,0,0,0,0,0,0,0,0,0,0,0,0,0,0,0,0,0,1,0,0,0,0,{"$nulls":5},{"v":0,"d":"0.0"}]
[51,{"$f":"'Wettkampf 1'!B66","v":"Schütze 51"},{"$f":"'Wettkampf 1'!C66","v":"Verein XI"},null,null,{"v":0,"d":"0.0"},0,0,0,0,0,0,0,0,0,0,0,0,0,0,0,0,0,0,0,0,0,1,0,0,{"$nulls":5},{"v":0,"d":"0.0"}]
[52,{"$f":"'Wettkampf 1'!B67","v":"Schütze 52"},{"$f":"'Wettkampf 1'!C67","v":"Verein XI"},null,null,{"v":0,"d":"0.0"},0,0,0,0,0,0,0,0,0,0,0,0,0,0,0,0,0,0,0,0,0,1,0,0,{"$nulls":5},{"v":0,"d":"0.0"}]
[53,{"$f":"'Wettkampf 1'!B68","v":"Schütze 53"},{"$f":"'Wettkampf 1'!C68","v":"Verein XI"},null,null,{"v":0,"d":"0.0"},0,0,0,0,0,0,0,0,0,0,0,0,0,0,0,0,0,0,0,0,0,1,0,0,{"$nulls":5},{"v":0,"d":"0.0"}]
[54,{"$f":"'Wettkampf 1'!B69","v":"Schütze 54"},{"$f":"'Wettkampf 1'!C69","v":"Verein XI"},null,null,{"v":0,"d":"0.0"},0,0,0,0,0,0,0,0,0,0,0,0,0,0,0,0,0,0,0,0,0,1,0,0,{"$nulls":5},{"v":0,"d":"0.0"}]
[55,{"$f":"'Wettkampf 1'!B70","v":"Schütze 55"},{"$f":"'Wettkampf 1'!C70","v":"Verein XI"},null,null,{"v":0,"d":"0.0"},0,0,0,0,0,0,0,0,0,0,0,0,0,0,0,0,0,0,0,0,0,1,0,0,{"$nulls":5},{"v":0,"d":"0.0"}]
[56,{"$f":"'Wettkampf 1'!B71","v":"Schütze 56"},{"$f":"'Wettkampf 1'!C71","v":"Verein XII"},null,null,{"v":0,"d":"0.0"},0,0,0,0,0,0,0,0,0,0,0,0,0,0,0,0,0,0,0,0,0,0,0,1,{"$nulls":5},{"v":0,"d":"0.0"}]
[57,{"$f":"'Wettkampf 1'!B72","v":"Schütze 57"},{"$f":"'Wettkampf 1'!C72","v":"Verein XII"},null,null,{"v":0,"d":"0.0"},0,0,0,0,0,0,0,0,0,0,0,0,0,0,0,0,0,0,0,0,0,0,0,1,{"$nulls":5},{"v":0,"d":"0.0"}]
[58,{"$f":"'Wettkampf 1'!B73","v":"Schütze 58"},{"$f":"'Wettkampf 1'!C73","v":"Verein XII"},null,null,{"v":0,"d":"0.0"},0,0,0,0,0,0,0,0,0,0,0,0,0,0,0,0,0,0,0,0,0,0,0,1,{"$nulls":5},{"v":0,"d":"0.0"}]
[59,{"$f":"'Wettkampf 1'!B74","v":"Schütze 59"},{"$f":"'Wettkampf 1'!C74","v":"Verein XII"},null,null,{"v":0,"d":"0.0"},0,0,0,0,0,0,0,0,0,0,0,0,0,0,0,0,0,0,0,0,0,0,0,1,{"$nulls":5},{"v":0,"d":"0.0"}]
[60,{"$f":"'Wettkampf 1'!B75","v":"Schütze 60"},{"$f":"'Wettkampf 1'!C75","v":"Verein XII"},null,null,{"v":0,"d":"0.0"},0,0,0,0,0,0,0,0,0,0,0,0,0,0,0,0,0,0,0,0,0,0,0,1,{"$nulls":5},{"v":0,"d":"0.0"}]
[{"$nulls":6},{"$f":"LARGE(G16:G75,1)+LARGE(G16:G75,2)+LARGE(G16:G75,3)","v":294.1},{"$f":"SUM(H16:H75)","v":5},{"$f":"LARGE(I16:I75,1)+LARGE(I16:I75,2)+LARGE(I16:I75,3)","v":1132.2},{"$f":"SUM(J16:J75)","v":5},{"$f":"LARGE(K16:K75,1)+LARGE(K16:K75,2)+LARGE(K16:K75,3)","v":1042.5},{"$f":"SUM(L16:L75)","v":5},{"$f":"LARGE(M16:M75,1)+LARGE(M16:M75,2)+LARGE(M16:M75,3)","v":1014.1000000000001},{"$f":"SUM(N16:N75)","v":5},{"$f":"LARGE(O16:O75,1)+LARGE(O16:O75,2)+LARGE(O16:O75,3)","v":674.1},{"$f":"SUM(P16:P75)","v":5},{"$f":"LARGE(Q16:Q75,1)+LARGE(Q16:Q75,2)+LARGE(Q16:Q75,3)","v":287.1},{"$f":"SUM(R16:R75)","v":5},{"$f":"LARGE(S16:S75,1)+LARGE(S16:S75,2)+LARGE(S16:S75,3)","v":563},{"$f":"SUM(T16:T75)","v":5},{"$f":"LARGE(U16:U75,1)+LARGE(U16:U75,2)+LARGE(U16:U75,3)","v":358.1},{"$f":"SUM(V16:V75)","v":5},{"$f":"LARGE(W16:W75,1)+LARGE(W16:W75,2)+LARGE(W16:W75,3)","v":0},{"$f":"SUM(X16:X75)","v":5},{"$f":"LARGE(Y16:Y75,1)+LARGE(Y16:Y75,2)+LARGE(Y16:Y75,3)","v":0},{"$f":"SUM(Z16:Z75)","v":5},{"$f":"LARGE(AA16:AA75,1)+LARGE(AA16:AA75,2)+LARGE(AA16:AA75,3)","v":0},{"$f":"SUM(AB16:AB75)","v":5},{"$f":"LARGE(AC16:AC75,1)+LARGE(AC16:AC75,2)+LARGE(AC16:AC75,3)","v":0},{"$f":"SUM(AD16:AD75)","v":5}]
[null,null,"per Email an: sk-huemmling@gmx.de"]

{"sheet":"5","index":5,"n_rows":77,"n_cols":39,"rows_kept":77,"merged":[[0,34,0,35],[1,34,1,35],[4,34,4,35],[5,34,5,35],[6,34,6,35],[14,32,14,35]]}
[null,"Verein / Gruppe",null,"Ergebnisse",{"$nulls":29},"Austragungsort:",{"$f":"Übersicht!H4","v":"Neubörger"}]
[1,{"$f":"'Wettkampf 1'!B2","v":"Esterwegen"},null,{"$f":"G76","v":289.8},{"$f":"IF(H76>4,\"Es sind zu viele Schützen in Wertung!\",\" \")","v":"Es sind zu viele Schützen in Wertung!"},{"$nulls":28},"Wettkampftag:",{"$f":"Übersicht!H3","v":"30.11."}]
[2,{"$f":"'Wettkampf 1'!B3","v":"Lähden Jugend I"},null,{"$f":"I76","v":1120.3},{"$f":"IF(J76>4,\"Es sind zu viele Schützen in Wertung!\",\" \")","v":"Es sind zu viele Schützen in Wertung!"}]
[3,{"$f":"'Wettkampf 1'!B4","v":"Börgerwald"},null,{"$f":"K76","v":{"v":0,"d":"0.0"}},{"$f":"IF(L76>4,\"Es sind zu viele Schützen in Wertung!\",\" \")","v":"Es sind zu viele Schützen in Wertung!"},{"$nulls":30},"Ansprechpartner für Rückfragen:"]
[4,{"$f":"'Wettkampf 1'!B5","v":"Börgermoor"},null,{"$f":"M76","v":1015.3},{"$f":"IF(N76>4,\"Es sind zu viele Schützen in Wertung!\",\" \")","v":"Es sind zu viele Schützen in Wertung!"},{"$nulls":28},"Name:"]
[5,{"$f":"'Wettkampf 1'!B6","v":"Spahnharrenstätte"},null,{"$f":"O76","v":795.4},{"$f":"IF(P76>4,\"Es sind zu viele Schützen in Wertung!\",\" \")","v":"Es sind zu viele Schützen in Wertung!"},{"$nulls":28},"Tel:"]
[6,{"$f":"'Wettkampf 1'!B7","v":"Lorup"},null,{"$f":"Q76","v":{"v":0,"d":"0.0"}},{"$f":"IF(R76>4,\"Es sind zu viele Schützen in Wertung!\",\" \")","v":"Es sind zu viele Schützen in Wertung!"},{"$nulls":28},"Standaufsicht:","eintragen"]
[7,{"$f":"'Wettkampf 1'!B8","v":"Lahn"},null,{"$f":"S76","v":284.7},{"$f":"IF(T76>4,\"Es sind zu viele Schützen in Wertung!\",\" \")","v":"Es sind zu viele Schützen in Wertung!"}]
[8,{"$f":"'Wettkampf 1'!B9","v":"Sögel"},null,{"$f":"U76","v":{"v":0,"d":"0.0"}},{"$f":"IF(V76>4,\"Es sind zu viele Schützen in Wertung!\",\" \")","v":"Es sind zu viele Schützen in Wertung!"}]
[9,{"$f":"'Wettkampf 1'!B10","v":"Verein IX"},null,{"$f":"W76","v":{"v":0,"d":"0.0"}},{"$f":"IF(X76>4,\"Es sind zu viele Schützen in Wertung!\",\" \")","v":"Es sind zu viele Schützen in Wertung!"}]
[10,{"$f":"'Wettkampf 1'!B11","v":"Verein X"},null,{"$f":"Y76","v":{"v":0,"d":"0.0"}},{"$f":"IF(Z76>4,\"Es sind zu viele Schützen in Wertung!\",\" \")","v":"Es sind zu viele Schützen in Wertung!"}]
[11,{"$f":"'Wettkampf 1'!B12","v":"Verein XI"},null,{"$f":"AA76","v":{"v":0,"d":"0.0"}},{"$f":"IF(AB76>4,\"Es sind zu viele Schützen in Wertung!\",\" \")","v":"Es sind zu viele Schützen in Wertung!"}]
[12,{"$f":"'Wettkampf 1'!B13","v":"Verein XII"},null,{"$f":"AC76","v":{"v":0,"d":"0.0"}},{"$f":"IF(AD76>4,\"Es sind zu viele Schützen in Wertung!\",\" \")","v":"Es sind zu viele Schützen in Wertung!"}]
[]
[null,"Einzelergebnisse:","Verein / Gruppe","Ergebnisse (mindestens 0 eintragen)","AW? Dann x eintippen",null,"Verein 1",null,"Verein 2",null,"Verein 3",null,"Verein 4",null,"Verein 5",null,"Verein 6",null,"Verein 7",null,"Verein 8",null,"Verein 9",null,"Verein 10",null,"Verein 11",null,"Verein 12",{"$nulls":3},"Proberechnung bei Streifen:"]
[1,{"$f":"'Wettkampf 1'!B16","v":"Gedecksnis Stefan"},{"$f":"'Wettkampf 1'!C16","v":"Esterwegen"},289.8,null,{"$f":"IF(E16=\"x\",\"0\",D16)","v":289.8},{"$f":"IF(C16=$B$2,F16,0)","v":289.8},{"$f":"(IF(AND($E16=\"\",$C16=$B$2),1,0))","v":1},{"$f":"IF($C16=$B$3,$F16,0)","v":0},{"$f":"(IF(AND($E16=\"\",$C16=$B$3),1,0))","v":0},{"$f":"IF($C16=$B$4,F16,0)","v":0},{"$f":"(IF(AND($E16=\"\",$C16=$B$4),1,0))","v":0},{"$f":"IF($C16=$B$5,F16,0)","v":0},{"$f":"(IF(AND($E16=\"\",$C16=$B$5),1,0))","v":0},{"$f":"IF($C16=$B$6,F16,0)","v":0},{"$f":"(IF(AND($E16=\"\",$C16=$B$6),1,0))","v":0},{"$f":"IF($C16=$B$7,F16,0)","v":0},{"$f":"(IF(AND($E16=\"\",$C16=$B$7),1,0))","v":0},{"$f":"IF($C16=$B$8,$F16,0)","v":0},{"$f":"(IF(AND($E16=\"\",$C16=$B$8),1,0))","v":0},{"$f":"IF($C16=$B$9,$F16,0)","v":0},{"$f":"(IF(AND($E16=\"\",$C16=$B$9),1,0))","v":0},{"$f":"IF($C16=$B$10,$F16,0)","v":0},{"$f":"(IF(AND($E16=\"\",$C16=$B$10),1,0))","v":0},{"$f":"IF($C16=$B$11,$F16,0)","v":0},{"$f":"(IF(AND($E16=\"\",$C16=$B$11),1,0))","v":0},{"$f":"IF($C16=$B$12,$F16,0)","v":0},{"$f":"(IF(AND($E16=\"\",$C16=$B$12),1,0))","v":0},{"$f":"IF($C16=$B$13,$F16,0)","v":0},{"$f":"(IF(AND($E16=\"\",$C16=$B$13),1,0))","v":0},{"$nulls":5},{"$f":"SUM(AG16:AI16)","v":{"v":0,"d":"0.0"}},{"$f":"IF(AJ16=D16,1,0)","v":0},{"$f":"IF(AJ16=0,0,1)","v":0},{"$f":"IF(AK16+AL16=2,\"Korrekt\",\"\")","v":""}]
[2,{"$f":"'Wettkampf 1'!B17","v":"Wübben Jasper"},{"$f":"'Wettkampf 1'!C17","v":"Esterwegen"},null,null,{"$f":"IF(E17=\"x\",\"0\",D17)","v":{"v":0,"d":"0.0"}},{"$f":"IF(C17=$B$2,F17,0)","v":0},{"$f":"(IF(AND($E17=\"\",$C17=$B$2),1,0))","v":1},{"$f":"IF($C17=$B$3,F17,0)","v":0},{"$f":"(IF(AND($E17=\"\",$C17=$B$3),1,0))","v":0},{"$f":"IF($C17=$B$4,F17,0)","v":0},{"$f":"(IF(AND($E17=\"\",$C17=$B$4),1,0))","v":0},{"$f":"IF($C17=$B$5,F17,0)","v":0},{"$f":"(IF(AND($E17=\"\",$C17=$B$5),1,0))","v":0},{"$f":"IF($C17=$B$6,F17,0)","v":0},{"$f":"(IF(AND($E17=\"\",$C17=$B$6),1,0))","v":0},{"$f":"IF($C17=$B$7,F17,0)","v":0},{"$f":"(IF(AND($E17=\"\",$C17=$B$7),1,0))","v":0},{"$f":"IF($C17=$B$8,$F17,0)","v":0},{"$f":"(IF(AND($E17=\"\",$C17=$B$8),1,0))","v":0},{"$f":"IF($C17=$B$9,$F17,0)","v":0},{"$f":"(IF(AND($E17=\"\",$C17=$B$9),1,0))","v":0},{"$f":"IF($C17=$B$10,$F17,0)","v":0},{"$f":"(IF(AND($E17=\"\",$C17=$B$10),1,0))","v":0},{"$f":"IF($C17=$B$11,$F17,0)","v":0},{"$f":"(IF(AND($E17=\"\",$C17=$B$11),1,0))","v":0},{"$f":"IF($C17=$B$12,$F17,0)","v":0},{"$f":"(IF(AND($E17=\"\",$C17=$B$12),1,0))","v":0},{"$f":"IF($C17=$B$13,$F17,0)","v":0},{"$f":"(IF(AND($E17=\"\",$C17=$B$13),1,0))","v":0},{"$nulls":5},{"$f":"SUM(AG17:AI17)","v":{"v":0,"d":"0.0"}},{"$f":"IF(AJ17=D17,1,0)","v":1},{"$f":"IF(AJ17=0,0,1)","v":0},{"$f":"IF(AK17+AL17=2,\"Korrekt\",\"\")","v":""}]
[3,{"$f":"'Wettkampf 1'!B18","v":"Engbers Julian"},{"$f":"'Wettkampf 1'!C18","v":"Esterwegen"},null,null,{"v":0,"d":"0.0"},0,1,0,0,0,0,0,0,0,0,0,0,0,0,0,0,0,0,0,0,0,0,0,0,{"$nulls":5},{"v":0,"d":"0.0"},1,0,""]
[4,{"$f":"'Wettkampf 1'!B19","v":"Meyer Johan"},{"$f":"'Wettkampf 1'!C19","v":"Esterwegen"},null,null,{"v":0,"d":"0.0"},0,1,0,0,0,0,0,0,0,0,0,0,0,0,0,0,0,0,0,0,0,0,0,0,{"$nulls":5},{"v":0,"d":"0.0"},1,0,""]
[5,{"$f":"'Wettkampf 1'!B20","v":"Schütze 5"},{"$f":"'Wettkampf 1'!C20","v":"Esterwegen"},null,null,{"v":0,"d":"0.0"},0,1,0,0,0,0,0,0,0,0,0,0,0,0,0,0,0,0,0,0,0,0,0,0,{"$nulls":5},{"v":0,"d":"0.0"},1,0,""]
[6,{"$f":"'Wettkampf 1'!B21","v":"Strüwing Inja"},{"$f":"'Wettkampf 1'!C21","v":"Lähden Jugend I"},{"v":373,"d":"373.0"},null,{"v":373,"d":"373.0"},0,0,373,1,0,0,0,0,0,0,0,0,0,0,0,0,0,0,0,0,0,0,0,0,{"$nulls":5},{"v":0,"d":"0.0"},0,0,""]
[7,{"$f":"'Wettkampf 1'!B22","v":"Bruns Hendrik"},{"$f":"'Wettkampf 1'!C22","v":"Lähden Jugend I"},{"v":359,"d":"359.0"},null,{"v":359,"d":"359.0"},0,0,359,1,0,0,0,0,0,0,0,0,0,0,0,0,0,0,0,0,0,0,0,0,{"$nulls":5},{"v":0,"d":"0.0"},0,0,""]
[8,{"$f":"'Wettkampf 1'!B23","v":"Feldhaus Vanessa"},{"$f":"'Wettkampf 1'!C23","v":"Lähden Jugend I"},null,null,{"v":0,"d":"0.0"},0,0,0,1,0,0,0,0,0,0,0,0,0,0,0,0,0,0,0,0,0,0,0,0,{"$nulls":5},{"v":0,"d":"0.0"},1,0,""]
[9,{"$f":"'Wettkampf 1'!B24","v":"Feldhaus Celien "},{"$f":"'Wettkampf 1'!C24","v":"Lähden Jugend I"},null,null,{"v":0,"d":"0.0"},0,0,0,1,0,0,0,0,0,0,0,0,0,0,0,0,0,0,0,0,0,0,0,0,{"$nulls":5},{"v":0,"d":"0.0"},1,0,""]
[10,{"$f":"'Wettkampf 1'!B25","v":"Stümpler Jan-Luca"},{"$f":"'Wettkampf 1'!C25","v":"Lähden Jugend I"},388.3,null,388.3,0,0,388.3,1,0,0,0,0,0,0,0,0,0,0,0,0,0,0,0,0,0,0,0,0,{"$nulls":5},{"v":0,"d":"0.0"},0,0,""]
[11,{"$f":"'Wettkampf 1'!B26","v":"Hanneken Maren"},{"$f":"'Wettkampf 1'!C26","v":"Börgerwald"},null,null,{"v":0,"d":"0.0"},0,0,0,0,0,1,0,0,0,0,0,0,0,0,0,0,0,0,0,0,0,0,0,0,{"$nulls":5},{"v":0,"d":"0.0"},1,0,""]
[12,{"$f":"'Wettkampf 1'!B27","v":"Köstering Nele"},{"$f":"'Wettkampf 1'!C27","v":"Börgerwald"},null,null,{"v":0,"d":"0.0"},0,0,0,0,0,1,0,0,0,0,0,0,0,0,0,0,0,0,0,0,0,0,0,0,{"$nulls":5},{"v":0,"d":"0.0"},1,0,""]
[13,{"$f":"'Wettkampf 1'!B28","v":"Lohmann Amy"},{"$f":"'Wettkampf 1'!C28","v":"Börgerwald"},null,null,{"v":0,"d":"0.0"},0,0,0,0,0,1,0,0,0,0,0,0,0,0,0,0,0,0,0,0,0,0,0,0,{"$nulls":5},{"v":0,"d":"0.0"},1,0,""]
[14,{"$f":"'Wettkampf 1'!B29","v":"Schütze 14"},{"$f":"'Wettkampf 1'!C29","v":"Börgerwald"},null,null,{"v":0,"d":"0.0"},0,0,0,0,0,1,0,0,0,0,0,0,0,0,0,0,0,0,0,0,0,0,0,0,{"$nulls":5},{"v":0,"d":"0.0"},1,0,""]
[15,{"$f":"'Wettkampf 1'!B30","v":"Schütze 15"},{"$f":"'Wettkampf 1'!C30","v":"Börgerwald"},null,null,{"v":0,"d":"0.0"},0,0,0,0,0,1,0,0,0,0,0,0,0,0,0,0,0,0,0,0,0,0,0,0,{"$nulls":5},{"v":0,"d":"0.0"},1,0,""]
[16,{"$f":"'Wettkampf 1'!B31","v":"Brandt Mira"},{"$f":"'Wettkampf 1'!C31","v":"Börgermoor"},364.8,null,364.8,0,0,0,0,0,0,364.8,1,0,0,0,0,0,0,0,0,0,0,0,0,0,0,0,0,{"$nulls":5},{"v":0,"d":"0.0"},0,0,""]
[17,{"$f":"'Wettkampf 1'!B32","v":"Eichhorn Luca"},{"$f":"'Wettkampf 1'!C32","v":"Börgermoor"},333.8,null,333.8,0,0,0,0,0,0,333.8,1,0,0,0,0,0,0,0,0,0,0,0,0,0,0,0,0,{"$nulls":5},{"v":0,"d":"0.0"},0,0,""]
[18,{"$f":"'Wettkampf 1'!B33","v":"Kohnen Saskia"},{"$f":"'Wettkampf 1'!C33","v":"Börgermoor"},316.7,null,316.7,0,0,0,0,0,0,316.7,1,0,0,0,0,0,0,0,0,0,0,0,0,0,0,0,0,{"$nulls":5},{"v":0,"d":"0.0"},0,0,""]
[19,{"$f":"'Wettkampf 1'!B34","v":"Schütze 19"},{"$f":"'Wettkampf 1'!C34","v":"Börgermoor"},null,null,{"v":0,"d":"0.0"},0,0,0,0,0,0,0,1,0,0,0,0,0,0,0,0,0,0,0,0,0,0,0,0,{"$nulls":5},{"v":0,"d":"0.0"},1,0,""]
[20,{"$f":"'Wettkampf 1'!B35","v":"Schütze 20"},{"$f":"'Wettkampf 1'!C35","v":"Börgermoor"},null,null,{"v":0,"d":"0.0"},0,0,0,0,0,0,0,1,0,0,0,0,0,0,0,0,0,0,0,0,0,0,0,0,{"$nulls":5},{"v":0,"d":"0.0"},1,0,""]
[21,{"$f":"'Wettkampf 1'!B36","v":"Runde Marcel"},{"$f":"'Wettkampf 1'!C36","v":"Spahnharrenstätte"},315.8,null,315.8,0,0,0,0,0,0,0,0,315.8,1,0,0,0,0,0,0,0,0,0,0,0,0,0,0,{"$nulls":5},{"v":0,"d":"0.0"},0,0,""]
[22,{"$f":"'Wettkampf 1'!B37","v":"Leis Fynn Lucas "},{"$f":"'Wettkampf 1'!C37","v":"Spahnharrenstätte"},null,null,{"v":0,"d":"0.0"},0,0,0,0,0,0,0,0,0,1,0,0,0,0,0,0,0,0,0,0,0,0,0,0,{"$nulls":5},{"v":0,"d":"0.0"},1,0,""]
[23,{"$f":"'Wettkampf 1'!B38","v":"Jansen Lars"},{"$f":"'Wettkampf 1'!C38","v":"Spahnharrenstätte"},255.6,null,255.6,0,0,0,0,0,0,0,0,255.6,1,0,0,0,0,0,0,0,0,0,0,0,0,0,0,{"$nulls":5},{"v":0,"d":"0.0"},0,0,""]
[24,{"$f":"'Wettkampf 1'!B39","v":"Köster Thilo"},{"$f":"'Wettkampf 1'!C39","v":"Spahnharrenstätte"},{"v":224,"d":"224.0"},null,{"v":224,"d":"224.0"},0,0,0,0,0,0,0,0,224,1,0,0,0,0,0,0,0,0,0,0,0,0,0,0,{"$nulls":5},{"v":0,"d":"0.0"},0,0,""]
[25,{"$f":"'Wettkampf 1'!B40","v":"Schütze 25"},{"$f":"'Wettkampf 1'!C40","v":"Spahnharrenstätte"},null,null,{"v":0,"d":"0.0"},0,0,0,0,0,0,0,0,0,1,0,0,0,0,0,0,0,0,0,0,0,0,0,0,{"$nulls":5},{"v":0,"d":"0.0"},1,0,""]
[26,{"$f":"'Wettkampf 1'!B41","v":"Dolling Leon"},{"$f":"'Wettkampf 1'!C41","v":"Lorup"},null,null,{"v":0,"d":"0.0"},0,0,0,0,0,0,0,0,0,0,0,1,0,0,0,0,0,0,0,0,0,0,0,0,{"$nulls":5},{"v":0,"d":"0.0"},1,0,""]
[27,{"$f":"'Wettkampf 1'!B42","v":"Schütze 27"},{"$f":"'Wettkampf 1'!C42","v":"Lorup"},null,null,{"v":0,"d":"0.0"},0,0,0,0,0,0,0,0,0,0,0,1,0,0,0,0,0,0,0,0,0,0,0,0,{"$nulls":5},{"v":0,"d":"0.0"},1,0,""]
[28,{"$f":"'Wettkampf 1'!B43","v":"Schütze 28"},{"$f":"'Wettkampf 1'!C43","v":"Lorup"},null,null,{"v":0,"d":"0.0"},0,0,0,0,0,0,0,0,0,0,0,1,0,0,0,0,0,0,0,0,0,0,0,0,{"$nulls":5},{"v":0,"d":"0.0"},1,0,""]
[29,{"$f":"'Wettkampf 1'!B44","v":"Schütze 29"},{"$f":"'Wettkampf 1'!C44","v":"Lorup"},null,null,{"v":0,"d":"0.0"},0,0,0,0,0,0,0,0,0,0,0,1,0,0,0,0,0,0,0,0,0,0,0,0,{"$nulls":5},{"v":0,"d":"0.0"},1,0,""]
[30,{"$f":"'Wettkampf 1'!B45","v":"Schütze 30"},{"$f":"'Wettkampf 1'!C45","v":"Lorup"},null,null,{"v":0,"d":"0.0"},0,0,0,0,0,0,0,0,0,0,0,1,0,0,0,0,0,0,0,0,0,0,0,0,{"$nulls":5},{"v":0,"d":"0.0"},1,0,""]
[31,{"$f":"'Wettkampf 1'!B46","v":"Wilken Noah"},{"$f":"'Wettkampf 1'!C46","v":"Lahn"},284.7,null,284.7,0,0,0,0,0,0,0,0,0,0,0,0,284.7,1,0,0,0,0,0,0,0,0,0,0,{"$nulls":5},{"v":0,"d":"0.0"},0,0,""]
[32,{"$f":"'Wettkampf 1'!B47","v":"Schulz Mika"},{"$f":"'Wettkampf 1'!C47","v":"Lahn"},null,null,{"v":0,"d":"0.0"},0,0,0,0,0,0,0,0,0,0,0,0,0,1,0,0,0,0,0,0,0,0,0,0,{"$nulls":5},{"v":0,"d":"0.0"},1,0,""]
[33,{"$f":"'Wettkampf 1'!B48","v":"Schütze 33"},{"$f":"'Wettkampf 1'!C48","v":"Lahn"},null,null,{"v":0,"d":"0.0"},0,0,0,0,0,0,0,0,0,0,0,0,0,1,0,0,0,0,0,0,0,0,0,0,{"$nulls":5},{"v":0,"d":"0.0"},1,0,""]
[34,{"$f":"'Wettkampf 1'!B49","v":"Schütze 34"},{"$f":"'Wettkampf 1'!C49","v":"Lahn"},null,null,{"v":0,"d":"0.0"},0,0,0,0,0,0,0,0,0,0,0,0,0,1,0,0,0,0,0,0,0,0,0,0,{"$nulls":5},{"v":0,"d":"0.0"},1,0,""]
[35,{"$f":"'Wettkampf 1'!B50","v":"Schütze 35"},{"$f":"'Wettkampf 1'!C50","v":"Lahn"},null,null,{"v":0,"d":"0.0"},0,0,0,0,0,0,0,0,0,0,0,0,0,1,0,0,0,0,0,0,0,0,0,0,{"$nulls":5},{"v":0,"d":"0.0"},1,0,""]
[36,{"$f":"'Wettkampf 1'!B51","v":"Tharner Kim"},{"$f":"'Wettkampf 1'!C51","v":"Sögel"},null,null,{"v":0,"d":"0.0"},0,0,0,0,0,0,0,0,0,0,0,0,0,0,0,1,0,0,0,0,0,0,0,0,{"$nulls":5},{"v":0,"d":"0.0"},1,0,""]
[37,{"$f":"'Wettkampf 1'!B52","v":"Schütze 37"},{"$f":"'Wettkampf 1'!C52","v":"Sögel"},null,null,{"v":0,"d":"0.0"},0,0,0,0,0,0,0,0,0,0,0,0,0,0,0,1,0,0,0,0,0,0,0,0,{"$nulls":5},{"v":0,"d":"0.0"}]
[38,{"$f":"'Wettkampf 1'!B53","v":"Schütze 38"},{"$f":"'Wettkampf 1'!C53","v":"Sögel"},null,null,{"v":0,"d":"0.0"},0,0,0,0,0,0,0,0,0,0,0,0,0,0,0,1,0,0,0,0,0,0,0,0,{"$nulls":5},{"v":0,"d":"0.0"}]
[39,{"$f":"'Wettkampf 1'!B54","v":"Schütze 39"},{"$f":"'Wettkampf 1'!C54","v":"Sögel"},null,null,{"v":0,"d":"0.0"},0,0,0,0,0,0,0,0,0,0,0,0,{"$f":"IF($C54=$B$8,$F54,0)","v":0},{"$f":"(IF(AND($E54=\"\",$C54=$B$8),1,0))","v":0},{"$f":"IF($C54=$B$9,$F54,0)","v":0},{"$f":"(IF(AND($E54=\"\",$C54=$B$9),1,0))","v":1},{"$f":"IF($C54=$B$10,$F54,0)","v":0},{"$f":"(IF(AND($E54=\"\",$C54=$B$10),1,0))","v":0},{"$f":"IF($C54=$B$11,$F54,0)","v":0},{"$f":"(IF(AND($E54=\"\",$C54=$B$11),1,0))","v":0},{"$f":"IF($C54=$B$12,$F54,0)","v":0},{"$f":"(IF(AND($E54=\"\",$C54=$B$12),1,0))","v":0},{"$f":"IF($C54=$B$13,$F54,0)","v":0},{"$f":"(IF(AND($E54=\"\",$C54=$B$13),1,0))","v":0},{"$nulls":5},{"v":0,"d":"0.0"}]
[40,{"$f":"'Wettkampf 1'!B55","v":"Schütze 40"},{"$f":"'Wettkampf 1'!C55","v":"Sögel"},null,null,{"v":0,"d":"0.0"},0,0,0,0,0,0,0,0,0,0,0,0,0,0,0,1,0,0,0,0,0,0,0,0,{"$nulls":5},{"v":0,"d":"0.0"}]
[41,{"$f":"'Wettkampf 1'!B56","v":"Schütze 41"},{"$f":"'Wettkampf 1'!C56","v":"Verein IX"},null,null,{"v":0,"d":"0.0"},0,0,0,0,0,0,0,0,0,0,0,0,0,0,0,0,0,1,0,0,0,0,0,0,{"$nulls":5},{"v":0,"d":"0.0"}]
[42,{"$f":"'Wettkampf 1'!B57","v":"Schütze 42"},{"$f":"'Wettkampf 1'!C57","v":"Verein IX"},null,null,{"v":0,"d":"0.0"},0,0,0,0,0,0,0,0,0,0,0,0,0,0,0,0,0,1,0,0,0,0,0,0,{"$nulls":5},{"v":0,"d":"0.0"}]
[43,{"$f":"'Wettkampf 1'!B58","v":"Schütze 43"},{"$f":"'Wettkampf 1'!C58","v":"Verein IX"},null,null,{"v":0,"d":"0.0"},0,0,0,0,0,0,0,0,0,0,0,0,0,0,0,0,0,1,0,0,0,0,0,0,{"$nulls":5},{"v":0,"d":"0.0"}]
[44,{"$f":"'Wettkampf 1'!B59","v":"Schütze 44"},{"$f":"'Wettkampf 1'!C59","v":"Verein IX"},null,null,{"v":0,"d":"0.0"},0,0,0,0,0,0,0,0,0,0,0,0,0,0,0,0,0,1,0,0,0,0,0,0,{"$nulls":5},{"v":0,"d":"0.0"}]
[45,{"$f":"'Wettkampf 1'!B60","v":"Schütze 45"},{"$f":"'Wettkampf 1'!C60","v":"Verein IX"},null,null,{"v":0,"d":"0.0"},0,0,0,0,0,0,0,0,0,0,0,0,0,0,0,0,0,1,0,0,0,0,0,0,{"$nulls":5},{"v":0,"d":"0.0"}]
[46,{"$f":"'Wettkampf 1'!B61","v":"Schütze 46"},{"$f":"'Wettkampf 1'!C61","v":"Verein X"},null,null,{"v":0,"d":"0.0"},0,0,0,0,0,0,0,0,0,0,0,0,0,0,0,0,0,0,0,1,0,0,0,0,{"$nulls":5},{"v":0,"d":"0.0"}]
[47,{"$f":"'Wettkampf 1'!B62","v":"Schütze 47"},{"$f":"'Wettkampf 1'!C62","v":"Verein X"},null,null,{"v":0,"d":"0.0"},0,0,0,0,0,0,0,0,0,0,0,0,0,0,0,0,0,0,0,1,0,0,0,0,{"$nulls":5},{"v":0,"d":"0.0"}]
[48,{"$f":"'Wettkampf 1'!B63","v":"Schütze 48"},{"$f":"'Wettkampf 1'!C63","v":"Verein X"},null,null,{"v":0,"d":"0.0"},0,0,0,0,0,0,0,0,0,0,0,0,0,0,0,0,0,0,0,1,0,0,0,0,{"$nulls":5},{"v":0,"d":"0.0"}]
[49,{"$f":"'Wettkampf 1'!B64","v":"Schütze 49"},{"$f":"'Wettkampf 1'!C64","v":"Verein X"},null,null,{"v":0,"d":"0.0"},0,0,0,0,0,0,0,0,0,0,0,0,0,0,0,0,0,0,0,1,0,0,0,0,{"$nulls":5},{"v":0,"d":"0.0"}]
[50,{"$f":"'Wettkampf 1'!B65","v":"Schütze 50"},{"$f":"'Wettkampf 1'!C65","v":"Verein X"},null,null,{"v":0,"d":"0.0"},0,0,0,0,0,0,0,0,0,0,0,0,0,0,0,0,0,0,0,1,0,0,0,0,{"$nulls":5},{"v":0,"d":"0.0"}]
[51,{"$f":"'Wettkampf 1'!B66","v":"Schütze 51"},{"$f":"'Wettkampf 1'!C66","v":"Verein XI"},null,null,{"v":0,"d":"0.0"},0,0,0,0,0,0,0,0,0,0,0,0,0,0,0,0,0,0,0,0,0,1,0,0,{"$nulls":5},{"v":0,"d":"0.0"}]
[52,{"$f":"'Wettkampf 1'!B67","v":"Schütze 52"},{"$f":"'Wettkampf 1'!C67","v":"Verein XI"},null,null,{"v":0,"d":"0.0"},0,0,0,0,0,0,0,0,0,0,0,0,0,0,0,0,0,0,0,0,0,1,0,0,{"$nulls":5},{"v":0,"d":"0.0"}]
[53,{"$f":"'Wettkampf 1'!B68","v":"Schütze 53"},{"$f":"'Wettkampf 1'!C68","v":"Verein XI"},null,null,{"v":0,"d":"0.0"},0,0,0,0,0,0,0,0,0,0,0,0,0,0,0,0,0,0,0,0,0,1,0,0,{"$nulls":5},{"v":0,"d":"0.0"}]
[54,{"$f":"'Wettkampf 1'!B69","v":"Schütze 54"},{"$f":"'Wettkampf 1'!C69","v":"Verein XI"},null,null,{"v":0,"d":"0.0"},0,0,0,0,0,0,0,0,0,0,0,0,0,0,0,0,0,0,0,0,0,1,0,0,{"$nulls":5},{"v":0,"d":"0.0"}]
[55,{"$f":"'Wettkampf 1'!B70","v":"Schütze 55"},{"$f":"'Wettkampf 1'!C70","v":"Verein XI"},null,null,{"v":0,"d":"0.0"},0,0,0,0,0,0,0,0,0,0,0,0,0,0,0,0,0,0,0,0,0,1,0,0,{"$nulls":5},{"v":0,"d":"0.0"}]
[56,{"$f":"'Wettkampf 1'!B71","v":"Schütze 56"},{"$f":"'Wettkampf 1'!C71","v":"Verein XII"},null,null,{"v":0,"d":"0.0"},0,0,0,0,0,0,0,0,0,0,0,0,0,0,0,0,0,0,0,0,0,0,0,1,{"$nulls":5},{"v":0,"d":"0.0"}]
[57,{"$f":"'Wettkampf 1'!B72","v":"Schütze 57"},{"$f":"'Wettkampf 1'!C72","v":"Verein XII"},null,null,{"v":0,"d":"0.0"},0,0,0,0,0,0,0,0,0,0,0,0,0,0,0,0,0,0,0,0,0,0,0,1,{"$nulls":5},{"v":0,"d":"0.0"}]
[58,{"$f":"'Wettkampf 1'!B73","v":"Schütze 58"},{"$f":"'Wettkampf 1'!C73","v":"Verein XII"},null,null,{"v":0,"d":"0.0"},0,0,0,0,0,0,0,0,0,0,0,0,0,0,0,0,0,0,0,0,0,0,0,1,{"$nulls":5},{"v":0,"d":"0.0"}]
[59,{"$f":"'Wettkampf 1'!B74","v":"Schütze 59"},{"$f":"'Wettkampf 1'!C74","v":"Verein XII"},null,null,{"v":0,"d":"0.0"},0,0,0,0,0,0,0,0,0,0,0,0,0,0,0,0,0,0,0,0,0,0,0,1,{"$nulls":5},{"v":0,"d":"0.0"}]
[60,{"$f":"'Wettkampf 1'!B75","v":"Schütze 60"},{"$f":"'Wettkampf 1'!C75","v":"Verein XII"},null,null,{"v":0,"d":"0.0"},0,0,0,0,0,0,0,0,0,0,0,0,0,0,0,0,0,0,0,0,0,0,0,1,{"$nulls":5},{"v":0,"d":"0.0"}]
[{"$nulls":6},{"$f":"LARGE(G16:G75,1)+LARGE(G16:G75,2)+LARGE(G16:G75,3)","v":289.8},{"$f":"SUM(H16:H75)","v":5},{"$f":"LARGE(I16:I75,1)+LARGE(I16:I75,2)+LARGE(I16:I75,3)","v":1120.3},{"$f":"SUM(J16:J75)","v":5},{"$f":"LARGE(K16:K75,1)+LARGE(K16:K75,2)+LARGE(K16:K75,3)","v":0},{"$f":"SUM(L16:L75)","v":5},{"$f":"LARGE(M16:M75,1)+LARGE(M16:M75,2)+LARGE(M16:M75,3)","v":1015.3},{"$f":"SUM(N16:N75)","v":5},{"$f":"LARGE(O16:O75,1)+LARGE(O16:O75,2)+LARGE(O16:O75,3)","v":795.4},{"$f":"SUM(P16:P75)","v":5},{"$f":"LARGE(Q16:Q75,1)+LARGE(Q16:Q75,2)+LARGE(Q16:Q75,3)","v":0},{"$f":"SUM(R16:R75)","v":5},{"$f":"LARGE(S16:S75,1)+LARGE(S16:S75,2)+LARGE(S16:S75,3)","v":284.7},{"$f":"SUM(T16:T75)","v":5},{"$f":"LARGE(U16:U75,1)+LARGE(U16:U75,2)+LARGE(U16:U75,3)","v":0},{"$f":"SUM(V16:V75)","v":5},{"$f":"LARGE(W16:W75,1)+LARGE(W16:W75,2)+LARGE(W16:W75,3)","v":0},{"$f":"SUM(X16:X75)","v":5},{"$f":"LARGE(Y16:Y75,1)+LARGE(Y16:Y75,2)+LARGE(Y16:Y75,3)","v":0},{"$f":"SUM(Z16:Z75)","v":5},{"$f":"LARGE(AA16:AA75,1)+LARGE(AA16:AA75,2)+LARGE(AA16:AA75,3)","v":0},{"$f":"SUM(AB16:AB75)","v":5},{"$f":"LARGE(AC16:AC75,1)+LARGE(AC16:AC75,2)+LARGE(AC16:AC75,3)","v":0},{"$f":"SUM(AD16:AD75)","v":5}]
[null,null,"per Email an: sk-huemmling@gmx.de"]

{"sheet":"6","index":6,"n_rows":77,"n_cols":39,"rows_kept":77,"merged":[[0,34,0,35],[1,34,1,35],[4,34,4,35],[5,34,5,35],[6,34,6,35],[14,32,14,35]]}
[null,"Verein / Gruppe",null,"Ergebnisse",{"$nulls":29},"Austragungsort:",{"$f":"Übersicht!I4","v":0}]
[1,{"$f":"'Wettkampf 1'!B2","v":"Esterwegen"},null,{"$f":"G76","v":{"v":0,"d":"0.0"}},{"$f":"IF(H76>4,\"Es sind zu viele Schützen in Wertung!\",\" \")","v":"Es sind zu viele Schützen in Wertung!"},{"$nulls":28},"Wettkampftag:",{"$f":"Übersicht!I3","v":0}]
[2,{"$f":"'Wettkampf 1'!B3","v":"Lähden Jugend I"},null,{"$f":"I76","v":{"v":0,"d":"0.0"}},{"$f":"IF(J76>4,\"Es sind zu viele Schützen in Wertung!\",\" \")","v":"Es sind zu viele Schützen in Wertung!"}]
[3,{"$f":"'Wettkampf 1'!B4","v":"Börgerwald"},null,{"$f":"K76","v":{"v":0,"d":"0.0"}},{"$f":"IF(L76>4,\"Es sind zu viele Schützen in Wertung!\",\" \")","v":"Es sind zu viele Schützen in Wertung!"},{"$nulls":30},"Ansprechpartner für Rückfragen:"]
[4,{"$f":"'Wettkampf 1'!B5","v":"Börgermoor"},null,{"$f":"M76","v":{"v":0,"d":"0.0"}},{"$f":"IF(N76>4,\"Es sind zu viele Schützen in Wertung!\",\" \")","v":"Es sind zu viele Schützen in Wertung!"},{"$nulls":28},"Name:"]
[5,{"$f":"'Wettkampf 1'!B6","v":"Spahnharrenstätte"},null,{"$f":"O76","v":{"v":0,"d":"0.0"}},{"$f":"IF(P76>4,\"Es sind zu viele Schützen in Wertung!\",\" \")","v":"Es sind zu viele Schützen in Wertung!"},{"$nulls":28},"Tel:"]
[6,{"$f":"'Wettkampf 1'!B7","v":"Lorup"},null,{"$f":"Q76","v":{"v":0,"d":"0.0"}},{"$f":"IF(R76>4,\"Es sind zu viele Schützen in Wertung!\",\" \")","v":"Es sind zu viele Schützen in Wertung!"},{"$nulls":28},"Standaufsicht:","eintragen"]
[7,{"$f":"'Wettkampf 1'!B8","v":"Lahn"},null,{"$f":"S76","v":{"v":0,"d":"0.0"}},{"$f":"IF(T76>4,\"Es sind zu viele Schützen in Wertung!\",\" \")","v":"Es sind zu viele Schützen in Wertung!"}]
[8,{"$f":"'Wettkampf 1'!B9","v":"Sögel"},null,{"$f":"U76","v":{"v":0,"d":"0.0"}},{"$f":"IF(V76>4,\"Es sind zu viele Schützen in Wertung!\",\" \")","v":"Es sind zu viele Schützen in Wertung!"}]
[9,{"$f":"'Wettkampf 1'!B10","v":"Verein IX"},null,{"$f":"W76","v":{"v":0,"d":"0.0"}},{"$f":"IF(X76>4,\"Es sind zu viele Schützen in Wertung!\",\" \")","v":"Es sind zu viele Schützen in Wertung!"}]
[10,{"$f":"'Wettkampf 1'!B11","v":"Verein X"},null,{"$f":"Y76","v":{"v":0,"d":"0.0"}},{"$f":"IF(Z76>4,\"Es sind zu viele Schützen in Wertung!\",\" \")","v":"Es sind zu viele Schützen in Wertung!"}]
[11,{"$f":"'Wettkampf 1'!B12","v":"Verein XI"},null,{"$f":"AA76","v":{"v":0,"d":"0.0"}},{"$f":"IF(AB76>4,\"Es sind zu viele Schützen in Wertung!\",\" \")","v":"Es sind zu viele Schützen in Wertung!"}]
[12,{"$f":"'Wettkampf 1'!B13","v":"Verein XII"},null,{"$f":"AC76","v":{"v":0,"d":"0.0"}},{"$f":"IF(AD76>4,\"Es sind zu viele Schützen in Wertung!\",\" \")","v":"Es sind zu viele Schützen in Wertung!"}]
[]
[null,"Einzelergebnisse:","Verein / Gruppe","Ergebnisse (mindestens 0 eintragen)","AW? Dann x eintippen",null,"Verein 1",null,"Verein 2",null,"Verein 3",null,"Verein 4",null,"Verein 5",null,"Verein 6",null,"Verein 7",null,"Verein 8",null,"Verein 9",null,"Verein 10",null,"Verein 11",null,"Verein 12",{"$nulls":3},"Proberechnung bei Streifen:"]
[1,{"$f":"'Wettkampf 1'!B16","v":"Gedecksnis Stefan"},{"$f":"'Wettkampf 1'!C16","v":"Esterwegen"},null,null,{"$f":"IF(E16=\"x\",\"0\",D16)","v":{"v":0,"d":"0.0"}},{"$f":"IF(C16=$B$2,F16,0)","v":0},{"$f":"(IF(AND($E16=\"\",$C16=$B$2),1,0))","v":1},{"$f":"IF($C16=$B$3,$F16,0)","v":0},{"$f":"(IF(AND($E16=\"\",$C16=$B$3),1,0))","v":0},{"$f":"IF($C16=$B$4,F16,0)","v":0},{"$f":"(IF(AND($E16=\"\",$C16=$B$4),1,0))","v":0},{"$f":"IF($C16=$B$5,F16,0)","v":0},{"$f":"(IF(AND($E16=\"\",$C16=$B$5),1,0))","v":0},{"$f":"IF($C16=$B$6,F16,0)","v":0},{"$f":"(IF(AND($E16=\"\",$C16=$B$6),1,0))","v":0},{"$f":"IF($C16=$B$7,F16,0)","v":0},{"$f":"(IF(AND($E16=\"\",$C16=$B$7),1,0))","v":0},{"$f":"IF($C16=$B$8,$F16,0)","v":0},{"$f":"(IF(AND($E16=\"\",$C16=$B$8),1,0))","v":0},{"$f":"IF($C16=$B$9,$F16,0)","v":0},{"$f":"(IF(AND($E16=\"\",$C16=$B$9),1,0))","v":0},{"$f":"IF($C16=$B$10,$F16,0)","v":0},{"$f":"(IF(AND($E16=\"\",$C16=$B$10),1,0))","v":0},{"$f":"IF($C16=$B$11,$F16,0)","v":0},{"$f":"(IF(AND($E16=\"\",$C16=$B$11),1,0))","v":0},{"$f":"IF($C16=$B$12,$F16,0)","v":0},{"$f":"(IF(AND($E16=\"\",$C16=$B$12),1,0))","v":0},{"$f":"IF($C16=$B$13,$F16,0)","v":0},{"$f":"(IF(AND($E16=\"\",$C16=$B$13),1,0))","v":0},{"$nulls":5},{"$f":"SUM(AG16:AI16)","v":{"v":0,"d":"0.0"}},{"$f":"IF(AJ16=D16,1,0)","v":1},{"$f":"IF(AJ16=0,0,1)","v":0},{"$f":"IF(AK16+AL16=2,\"Korrekt\",\"\")","v":""}]
[2,{"$f":"'Wettkampf 1'!B17","v":"Wübben Jasper"},{"$f":"'Wettkampf 1'!C17","v":"Esterwegen"},null,null,{"$f":"IF(E17=\"x\",\"0\",D17)","v":{"v":0,"d":"0.0"}},{"$f":"IF(C17=$B$2,F17,0)","v":0},{"$f":"(IF(AND($E17=\"\",$C17=$B$2),1,0))","v":1},{"$f":"IF($C17=$B$3,F17,0)","v":0},{"$f":"(IF(AND($E17=\"\",$C17=$B$3),1,0))","v":0},{"$f":"IF($C17=$B$4,F17,0)","v":0},{"$f":"(IF(AND($E17=\"\",$C17=$B$4),1,0))","v":0},{"$f":"IF($C17=$B$5,F17,0)","v":0},{"$f":"(IF(AND($E17=\"\",$C17=$B$5),1,0))","v":0},{"$f":"IF($C17=$B$6,F17,0)","v":0},{"$f":"(IF(AND($E17=\"\",$C17=$B$6),1,0))","v":0},{"$f":"IF($C17=$B$7,F17,0)","v":0},{"$f":"(IF(AND($E17=\"\",$C17=$B$7),1,0))","v":0},{"$f":"IF($C17=$B$8,$F17,0)","v":0},{"$f":"(IF(AND($E17=\"\",$C17=$B$8),1,0))","v":0},{"$f":"IF($C17=$B$9,$F17,0)","v":0},{"$f":"(IF(AND($E17=\"\",$C17=$B$9),1,0))","v":0},{"$f":"IF($C17=$B$10,$F17,0)","v":0},{"$f":"(IF(AND($E17=\"\",$C17=$B$10),1,0))","v":0},{"$f":"IF($C17=$B$11,$F17,0)","v":0},{"$f":"(IF(AND($E17=\"\",$C17=$B$11),1,0))","v":0},{"$f":"IF($C17=$B$12,$F17,0)","v":0},{"$f":"(IF(AND($E17=\"\",$C17=$B$12),1,0))","v":0},{"$f":"IF($C17=$B$13,$F17,0)","v":0},{"$f":"(IF(AND($E17=\"\",$C17=$B$13),1,0))","v":0},{"$nulls":5},{"$f":"SUM(AG17:AI17)","v":{"v":0,"d":"0.0"}},{"$f":"IF(AJ17=D17,1,0)","v":1},{"$f":"IF(AJ17=0,0,1)","v":0},{"$f":"IF(AK17+AL17=2,\"Korrekt\",\"\")","v":""}]
[3,{"$f":"'Wettkampf 1'!B18","v":"Engbers Julian"},{"$f":"'Wettkampf 1'!C18","v":"Esterwegen"},null,null,{"v":0,"d":"0.0"},0,1,0,0,0,0,0,0,0,0,0,0,0,0,0,0,0,0,0,0,0,0,0,0,{"$nulls":5},{"v":0,"d":"0.0"},1,0,""]
[4,{"$f":"'Wettkampf 1'!B19","v":"Meyer Johan"},{"$f":"'Wettkampf 1'!C19","v":"Esterwegen"},null,null,{"v":0,"d":"0.0"},0,1,0,0,0,0,0,0,0,0,0,0,0,0,0,0,0,0,0,0,0,0,0,0,{"$nulls":5},{"v":0,"d":"0.0"},1,0,""]
[5,{"$f":"'Wettkampf 1'!B20","v":"Schütze 5"},{"$f":"'Wettkampf 1'!C20","v":"Esterwegen"},null,null,{"v":0,"d":"0.0"},0,1,0,0,0,0,0,0,0,0,0,0,0,0,0,0,0,0,0,0,0,0,0,0,{"$nulls":5},{"v":0,"d":"0.0"},1,0,""]
[6,{"$f":"'Wettkampf 1'!B21","v":"Strüwing Inja"},{"$f":"'Wettkampf 1'!C21","v":"Lähden Jugend I"},null,null,{"v":0,"d":"0.0"},0,0,0,1,0,0,0,0,0,0,0,0,0,0,0,0,0,0,0,0,0,0,0,0,{"$nulls":5},{"v":0,"d":"0.0"},1,0,""]
[7,{"$f":"'Wettkampf 1'!B22","v":"Bruns Hendrik"},{"$f":"'Wettkampf 1'!C22","v":"Lähden Jugend I"},null,null,{"v":0,"d":"0.0"},0,0,0,1,0,0,0,0,0,0,0,0,0,0,0,0,0,0,0,0,0,0,0,0,{"$nulls":5},{"v":0,"d":"0.0"},1,0,""]
[8,{"$f":"'Wettkampf 1'!B23","v":"Feldhaus Vanessa"},{"$f":"'Wettkampf 1'!C23","v":"Lähden Jugend I"},null,null,{"v":0,"d":"0.0"},0,0,0,1,0,0,0,0,0,0,0,0,0,0,0,0,0,0,0,0,0,0,0,0,{"$nulls":5},{"v":0,"d":"0.0"},1,0,""]
[9,{"$f":"'Wettkampf 1'!B24","v":"Feldhaus Celien "},{"$f":"'Wettkampf 1'!C24","v":"Lähden Jugend I"},null,null,{"v":0,"d":"0.0"},0,0,0,1,0,0,0,0,0,0,0,0,0,0,0,0,0,0,0,0,0,0,0,0,{"$nulls":5},{"v":0,"d":"0.0"},1,0,""]
[10,{"$f":"'Wettkampf 1'!B25","v":"Stümpler Jan-Luca"},{"$f":"'Wettkampf 1'!C25","v":"Lähden Jugend I"},null,null,{"v":0,"d":"0.0"},0,0,0,1,0,0,0,0,0,0,0,0,0,0,0,0,0,0,0,0,0,0,0,0,{"$nulls":5},{"v":0,"d":"0.0"},1,0,""]
[11,{"$f":"'Wettkampf 1'!B26","v":"Hanneken Maren"},{"$f":"'Wettkampf 1'!C26","v":"Börgerwald"},null,null,{"v":0,"d":"0.0"},0,0,0,0,0,1,0,0,0,0,0,0,0,0,0,0,0,0,0,0,0,0,0,0,{"$nulls":5},{"v":0,"d":"0.0"},1,0,""]
[12,{"$f":"'Wettkampf 1'!B27","v":"Köstering Nele"},{"$f":"'Wettkampf 1'!C27","v":"Börgerwald"},null,null,{"v":0,"d":"0.0"},0,0,0,0,0,1,0,0,0,0,0,0,0,0,0,0,0,0,0,0,0,0,0,0,{"$nulls":5},{"v":0,"d":"0.0"},1,0,""]
[13,{"$f":"'Wettkampf 1'!B28","v":"Lohmann Amy"},{"$f":"'Wettkampf 1'!C28","v":"Börgerwald"},null,null,{"v":0,"d":"0.0"},0,0,0,0,0,1,0,0,0,0,0,0,0,0,0,0,0,0,0,0,0,0,0,0,{"$nulls":5},{"v":0,"d":"0.0"},1,0,""]
[14,{"$f":"'Wettkampf 1'!B29","v":"Schütze 14"},{"$f":"'Wettkampf 1'!C29","v":"Börgerwald"},null,null,{"v":0,"d":"0.0"},0,0,0,0,0,1,0,0,0,0,0,0,0,0,0,0,0,0,0,0,0,0,0,0,{"$nulls":5},{"v":0,"d":"0.0"},1,0,""]
[15,{"$f":"'Wettkampf 1'!B30","v":"Schütze 15"},{"$f":"'Wettkampf 1'!C30","v":"Börgerwald"},null,null,{"v":0,"d":"0.0"},0,0,0,0,0,1,0,0,0,0,0,0,0,0,0,0,0,0,0,0,0,0,0,0,{"$nulls":5},{"v":0,"d":"0.0"},1,0,""]
[16,{"$f":"'Wettkampf 1'!B31","v":"Brandt Mira"},{"$f":"'Wettkampf 1'!C31","v":"Börgermoor"},null,null,{"v":0,"d":"0.0"},0,0,0,0,0,0,0,1,0,0,0,0,0,0,0,0,0,0,0,0,0,0,0,0,{"$nulls":5},{"v":0,"d":"0.0"},1,0,""]
[17,{"$f":"'Wettkampf 1'!B32","v":"Eichhorn Luca"},{"$f":"'Wettkampf 1'!C32","v":"Börgermoor"},null,null,{"v":0,"d":"0.0"},0,0,0,0,0,0,0,1,0,0,0,0,0,0,0,0,0,0,0,0,0,0,0,0,{"$nulls":5},{"v":0,"d":"0.0"},1,0,""]
[18,{"$f":"'Wettkampf 1'!B33","v":"Kohnen Saskia"},{"$f":"'Wettkampf 1'!C33","v":"Börgermoor"},null,null,{"v":0,"d":"0.0"},0,0,0,0,0,0,0,1,0,0,0,0,0,0,0,0,0,0,0,0,0,0,0,0,{"$nulls":5},{"v":0,"d":"0.0"},1,0,""]
[19,{"$f":"'Wettkampf 1'!B34","v":"Schütze 19"},{"$f":"'Wettkampf 1'!C34","v":"Börgermoor"},null,null,{"v":0,"d":"0.0"},0,0,0,0,0,0,0,1,0,0,0,0,0,0,0,0,0,0,0,0,0,0,0,0,{"$nulls":5},{"v":0,"d":"0.0"},1,0,""]
[20,{"$f":"'Wettkampf 1'!B35","v":"Schütze 20"},{"$f":"'Wettkampf 1'!C35","v":"Börgermoor"},null,null,{"v":0,"d":"0.0"},0,0,0,0,0,0,0,1,0,0,0,0,0,0,0,0,0,0,0,0,0,0,0,0,{"$nulls":5},{"v":0,"d":"0.0"},1,0,""]
[21,{"$f":"'Wettkampf 1'!B36","v":"Runde Marcel"},{"$f":"'Wettkampf 1'!C36","v":"Spahnharrenstätte"},null,null,{"v":0,"d":"0.0"},0,0,0,0,0,0,0,0,0,1,0,0,0,0,0,0,0,0,0,0,0,0,0,0,{"$nulls":5},{"v":0,"d":"0.0"},1,0,""]
[22,{"$f":"'Wettkampf 1'!B37","v":"Leis Fynn Lucas "},{"$f":"'Wettkampf 1'!C37","v":"Spahnharrenstätte"},null,null,{"v":0,"d":"0.0"},0,0,0,0,0,0,0,0,0,1,0,0,0,0,0,0,0,0,0,0,0,0,0,0,{"$nulls":5},{"v":0,"d":"0.0"},1,0,""]
[23,{"$f":"'Wettkampf 1'!B38","v":"Jansen Lars"},{"$f":"'Wettkampf 1'!C38","v":"Spahnharrenstätte"},null,null,{"v":0,"d":"0.0"},0,0,0,0,0,0,0,0,0,1,0,0,0,0,0,0,0,0,0,0,0,0,0,0,{"$nulls":5},{"v":0,"d":"0.0"},1,0,""]
[24,{"$f":"'Wettkampf 1'!B39","v":"Köster Thilo"},{"$f":"'Wettkampf 1'!C39","v":"Spahnharrenstätte"},null,null,{"v":0,"d":"0.0"},0,0,0,0,0,0,0,0,0,1,0,0,0,0,0,0,0,0,0,0,0,0,0,0,{"$nulls":5},{"v":0,"d":"0.0"},1,0,""]
[25,{"$f":"'Wettkampf 1'!B40","v":"Schütze 25"},{"$f":"'Wettkampf 1'!C40","v":"Spahnharrenstätte"},null,null,{"v":0,"d":"0.0"},0,0,0,0,0,0,0,0,0,1,0,0,0,0,0,0,0,0,0,0,0,0,0,0,{"$nulls":5},{"v":0,"d":"0.0"},1,0,""]
[26,{"$f":"'Wettkampf 1'!B41","v":"Dolling Leon"},{"$f":"'Wettkampf 1'!C41","v":"Lorup"},null,null,{"v":0,"d":"0.0"},0,0,0,0,0,0,0,0,0,0,0,1,0,0,0,0,0,0,0,0,0,0,0,0,{"$nulls":5},{"v":0,"d":"0.0"},1,0,""]
[27,{"$f":"'Wettkampf 1'!B42","v":"Schütze 27"},{"$f":"'Wettkampf 1'!C42","v":"Lorup"},null,null,{"v":0,"d":"0.0"},0,0,0,0,0,0,0,0,0,0,0,1,0,0,0,0,0,0,0,0,0,0,0,0,{"$nulls":5},{"v":0,"d":"0.0"},1,0,""]
[28,{"$f":"'Wettkampf 1'!B43","v":"Schütze 28"},{"$f":"'Wettkampf 1'!C43","v":"Lorup"},null,null,{"v":0,"d":"0.0"},0,0,0,0,0,0,0,0,0,0,0,1,0,0,0,0,0,0,0,0,0,0,0,0,{"$nulls":5},{"v":0,"d":"0.0"},1,0,""]
[29,{"$f":"'Wettkampf 1'!B44","v":"Schütze 29"},{"$f":"'Wettkampf 1'!C44","v":"Lorup"},null,null,{"v":0,"d":"0.0"},0,0,0,0,0,0,0,0,0,0,0,1,0,0,0,0,0,0,0,0,0,0,0,0,{"$nulls":5},{"v":0,"d":"0.0"},1,0,""]
[30,{"$f":"'Wettkampf 1'!B45","v":"Schütze 30"},{"$f":"'Wettkampf 1'!C45","v":"Lorup"},null,null,{"v":0,"d":"0.0"},0,0,0,0,0,0,0,0,0,0,0,1,0,0,0,0,0,0,0,0,0,0,0,0,{"$nulls":5},{"v":0,"d":"0.0"},1,0,""]
[31,{"$f":"'Wettkampf 1'!B46","v":"Wilken Noah"},{"$f":"'Wettkampf 1'!C46","v":"Lahn"},null,null,{"v":0,"d":"0.0"},0,0,0,0,0,0,0,0,0,0,0,0,0,1,0,0,0,0,0,0,0,0,0,0,{"$nulls":5},{"v":0,"d":"0.0"},1,0,""]
[32,{"$f":"'Wettkampf 1'!B47","v":"Schulz Mika"},{"$f":"'Wettkampf 1'!C47","v":"Lahn"},null,null,{"v":0,"d":"0.0"},0,0,0,0,0,0,0,0,0,0,0,0,0,1,0,0,0,0,0,0,0,0,0,0,{"$nulls":5},{"v":0,"d":"0.0"},1,0,""]
[33,{"$f":"'Wettkampf 1'!B48","v":"Schütze 33"},{"$f":"'Wettkampf 1'!C48","v":"Lahn"},null,null,{"v":0,"d":"0.0"},0,0,0,0,0,0,0,0,0,0,0,0,0,1,0,0,0,0,0,0,0,0,0,0,{"$nulls":5},{"v":0,"d":"0.0"},1,0,""]
[34,{"$f":"'Wettkampf 1'!B49","v":"Schütze 34"},{"$f":"'Wettkampf 1'!C49","v":"Lahn"},null,null,{"v":0,"d":"0.0"},0,0,0,0,0,0,0,0,0,0,0,0,0,1,0,0,0,0,0,0,0,0,0,0,{"$nulls":5},{"v":0,"d":"0.0"},1,0,""]
[35,{"$f":"'Wettkampf 1'!B50","v":"Schütze 35"},{"$f":"'Wettkampf 1'!C50","v":"Lahn"},null,null,{"v":0,"d":"0.0"},0,0,0,0,0,0,0,0,0,0,0,0,0,1,0,0,0,0,0,0,0,0,0,0,{"$nulls":5},{"v":0,"d":"0.0"},1,0,""]
[36,{"$f":"'Wettkampf 1'!B51","v":"Tharner Kim"},{"$f":"'Wettkampf 1'!C51","v":"Sögel"},null,null,{"v":0,"d":"0.0"},0,0,0,0,0,0,0,0,0,0,0,0,0,0,0,1,0,0,0,0,0,0,0,0,{"$nulls":5},{"v":0,"d":"0.0"},1,0,""]
[37,{"$f":"'Wettkampf 1'!B52","v":"Schütze 37"},{"$f":"'Wettkampf 1'!C52","v":"Sögel"},null,null,{"v":0,"d":"0.0"},0,0,0,0,0,0,0,0,0,0,0,0,0,0,0,1,0,0,0,0,0,0,0,0,{"$nulls":5},{"v":0,"d":"0.0"}]
[38,{"$f":"'Wettkampf 1'!B53","v":"Schütze 38"},{"$f":"'Wettkampf 1'!C53","v":"Sögel"},null,null,{"v":0,"d":"0.0"},0,0,0,0,0,0,0,0,0,0,0,0,0,0,0,1,0,0,0,0,0,0,0,0,{"$nulls":5},{"v":0,"d":"0.0"}]
[39,{"$f":"'Wettkampf 1'!B54","v":"Schütze 39"},{"$f":"'Wettkampf 1'!C54","v":"Sögel"},null,null,{"v":0,"d":"0.0"},0,0,0,0,0,0,0,0,0,0,0,0,{"$f":"IF($C54=$B$8,$F54,0)","v":0},{"$f":"(IF(AND($E54=\"\",$C54=$B$8),1,0))","v":0},{"$f":"IF($C54=$B$9,$F54,0)","v":0},{"$f":"(IF(AND($E54=\"\",$C54=$B$9),1,0))","v":1},{"$f":"IF($C54=$B$10,$F54,0)","v":0},{"$f":"(IF(AND($E54=\"\",$C54=$B$10),1,0))","v":0},{"$f":"IF($C54=$B$11,$F54,0)","v":0},{"$f":"(IF(AND($E54=\"\",$C54=$B$11),1,0))","v":0},{"$f":"IF($C54=$B$12,$F54,0)","v":0},{"$f":"(IF(AND($E54=\"\",$C54=$B$12),1,0))","v":0},{"$f":"IF($C54=$B$13,$F54,0)","v":0},{"$f":"(IF(AND($E54=\"\",$C54=$B$13),1,0))","v":0},{"$nulls":5},{"v":0,"d":"0.0"}]
[40,{"$f":"'Wettkampf 1'!B55","v":"Schütze 40"},{"$f":"'Wettkampf 1'!C55","v":"Sögel"},null,null,{"v":0,"d":"0.0"},0,0,0,0,0,0,0,0,0,0,0,0,0,0,0,1,0,0,0,0,0,0,0,0,{"$nulls":5},{"v":0,"d":"0.0"}]
[41,{"$f":"'Wettkampf 1'!B56","v":"Schütze 41"},{"$f":"'Wettkampf 1'!C56","v":"Verein IX"},null,null,{"v":0,"d":"0.0"},0,0,0,0,0,0,0,0,0,0,0,0,0,0,0,0,0,1,0,0,0,0,0,0,{"$nulls":5},{"v":0,"d":"0.0"}]
[42,{"$f":"'Wettkampf 1'!B57","v":"Schütze 42"},{"$f":"'Wettkampf 1'!C57","v":"Verein IX"},null,null,{"v":0,"d":"0.0"},0,0,0,0,0,0,0,0,0,0,0,0,0,0,0,0,0,1,0,0,0,0,0,0,{"$nulls":5},{"v":0,"d":"0.0"}]
[43,{"$f":"'Wettkampf 1'!B58","v":"Schütze 43"},{"$f":"'Wettkampf 1'!C58","v":"Verein IX"},null,null,{"v":0,"d":"0.0"},0,0,0,0,0,0,0,0,0,0,0,0,0,0,0,0,0,1,0,0,0,0,0,0,{"$nulls":5},{"v":0,"d":"0.0"}]
[44,{"$f":"'Wettkampf 1'!B59","v":"Schütze 44"},{"$f":"'Wettkampf 1'!C59","v":"Verein IX"},null,null,{"v":0,"d":"0.0"},0,0,0,0,0,0,0,0,0,0,0,0,0,0,0,0,0,1,0,0,0,0,0,0,{"$nulls":5},{"v":0,"d":"0.0"}]
[45,{"$f":"'Wettkampf 1'!B60","v":"Schütze 45"},{"$f":"'Wettkampf 1'!C60","v":"Verein IX"},null,null,{"v":0,"d":"0.0"},0,0,0,0,0,0,0,0,0,0,0,0,0,0,0,0,0,1,0,0,0,0,0,0,{"$nulls":5},{"v":0,"d":"0.0"}]
[46,{"$f":"'Wettkampf 1'!B61","v":"Schütze 46"},{"$f":"'Wettkampf 1'!C61","v":"Verein X"},null,null,{"v":0,"d":"0.0"},0,0,0,0,0,0,0,0,0,0,0,0,0,0,0,0,0,0,0,1,0,0,0,0,{"$nulls":5},{"v":0,"d":"0.0"}]
[47,{"$f":"'Wettkampf 1'!B62","v":"Schütze 47"},{"$f":"'Wettkampf 1'!C62","v":"Verein X"},null,null,{"v":0,"d":"0.0"},0,0,0,0,0,0,0,0,0,0,0,0,0,0,0,0,0,0,0,1,0,0,0,0,{"$nulls":5},{"v":0,"d":"0.0"}]
[48,{"$f":"'Wettkampf 1'!B63","v":"Schütze 48"},{"$f":"'Wettkampf 1'!C63","v":"Verein X"},null,null,{"v":0,"d":"0.0"},0,0,0,0,0,0,0,0,0,0,0,0,0,0,0,0,0,0,0,1,0,0,0,0,{"$nulls":5},{"v":0,"d":"0.0"}]
[49,{"$f":"'Wettkampf 1'!B64","v":"Schütze 49"},{"$f":"'Wettkampf 1'!C64","v":"Verein X"},null,null,{"v":0,"d":"0.0"},0,0,0,0,0,0,0,0,0,0,0,0,0,0,0,0,0,0,0,1,0,0,0,0,{"$nulls":5},{"v":0,"d":"0.0"}]
[50,{"$f":"'Wettkampf 1'!B65","v":"Schütze 50"},{"$f":"'Wettkampf 1'!C65","v":"Verein X"},null,null,{"v":0,"d":"0.0"},0,0,0,0,0,0,0,0,0,0,0,0,0,0,0,0,0,0,0,1,0,0,0,0,{"$nulls":5},{"v":0,"d":"0.0"}]
[51,{"$f":"'Wettkampf 1'!B66","v":"Schütze 51"},{"$f":"'Wettkampf 1'!C66","v":"Verein XI"},null,null,{"v":0,"d":"0.0"},0,0,0,0,0,0,0,0,0,0,0,0,0,0,0,0,0,0,0,0,0,1,0,0,{"$nulls":5},{"v":0,"d":"0.0"}]
[52,{"$f":"'Wettkampf 1'!B67","v":"Schütze 52"},{"$f":"'Wettkampf 1'!C67","v":"Verein XI"},null,null,{"v":0,"d":"0.0"},0,0,0,0,0,0,0,0,0,0,0,0,0,0,0,0,0,0,0,0,0,1,0,0,{"$nulls":5},{"v":0,"d":"0.0"}]
[53,{"$f":"'Wettkampf 1'!B68","v":"Schütze 53"},{"$f":"'Wettkampf 1'!C68","v":"Verein XI"},null,null,{"v":0,"d":"0.0"},0,0,0,0,0,0,0,0,0,0,0,0,0,0,0,0,0,0,0,0,0,1,0,0,{"$nulls":5},{"v":0,"d":"0.0"}]
[54,{"$f":"'Wettkampf 1'!B69","v":"Schütze 54"},{"$f":"'Wettkampf 1'!C69","v":"Verein XI"},null,null,{"v":0,"d":"0.0"},0,0,0,0,0,0,0,0,0,0,0,0,0,0,0,0,0,0,0,0,0,1,0,0,{"$nulls":5},{"v":0,"d":"0.0"}]
[55,{"$f":"'Wettkampf 1'!B70","v":"Schütze 55"},{"$f":"'Wettkampf 1'!C70","v":"Verein XI"},null,null,{"v":0,"d":"0.0"},0,0,0,0,0,0,0,0,0,0,0,0,0,0,0,0,0,0,0,0,0,1,0,0,{"$nulls":5},{"v":0,"d":"0.0"}]
[56,{"$f":"'Wettkampf 1'!B71","v":"Schütze 56"},{"$f":"'Wettkampf 1'!C71","v":"Verein XII"},null,null,{"v":0,"d":"0.0"},0,0,0,0,0,0,0,0,0,0,0,0,0,0,0,0,0,0,0,0,0,0,0,1,{"$nulls":5},{"v":0,"d":"0.0"}]
[57,{"$f":"'Wettkampf 1'!B72","v":"Schütze 57"},{"$f":"'Wettkampf 1'!C72","v":"Verein XII"},null,null,{"v":0,"d":"0.0"},0,0,0,0,0,0,0,0,0,0,0,0,0,0,0,0,0,0,0,0,0,0,0,1,{"$nulls":5},{"v":0,"d":"0.0"}]
[58,{"$f":"'Wettkampf 1'!B73","v":"Schütze 58"},{"$f":"'Wettkampf 1'!C73","v":"Verein XII"},null,null,{"v":0,"d":"0.0"},0,0,0,0,0,0,0,0,0,0,0,0,0,0,0,0,0,0,0,0,0,0,0,1,{"$nulls":5},{"v":0,"d":"0.0"}]
[59,{"$f":"'Wettkampf 1'!B74","v":"Schütze 59"},{"$f":"'Wettkampf 1'!C74","v":"Verein XII"},null,null,{"v":0,"d":"0.0"},0,0,0,0,0,0,0,0,0,0,0,0,0,0,0,0,0,0,0,0,0,0,0,1,{"$nulls":5},{"v":0,"d":"0.0"}]
[60,{"$f":"'Wettkampf 1'!B75","v":"Schütze 60"},{"$f":"'Wettkampf 1'!C75","v":"Verein XII"},null,null,{"v":0,"d":"0.0"},0,0,0,0,0,0,0,0,0,0,0,0,0,0,0,0,0,0,0,0,0,0,0,1,{"$nulls":5},{"v":0,"d":"0.0"}]
[{"$nulls":6},{"$f":"LARGE(G16:G75,1)+LARGE(G16:G75,2)+LARGE(G16:G75,3)","v":0},{"$f":"SUM(H16:H75)","v":5},{"$f":"LARGE(I16:I75,1)+LARGE(I16:I75,2)+LARGE(I16:I75,3)","v":0},{"$f":"SUM(J16:J75)","v":5},{"$f":"LARGE(K16:K75,1)+LARGE(K16:K75,2)+LARGE(K16:K75,3)","v":0},{"$f":"SUM(L16:L75)","v":5},{"$f":"LARGE(M16:M75,1)+LARGE(M16:M75,2)+LARGE(M16:M75,3)","v":0},{"$f":"SUM(N16:N75)","v":5},{"$f":"LARGE(O16:O75,1)+LARGE(O16:O75,2)+LARGE(O16:O75,3)","v":0},{"$f":"SUM(P16:P75)","v":5},{"$f":"LARGE(Q16:Q75,1)+LARGE(Q16:Q75,2)+LARGE(Q16:Q75,3)","v":0},{"$f":"SUM(R16:R75)","v":5},{"$f":"LARGE(S16:S75,1)+LARGE(S16:S75,2)+LARGE(S16:S75,3)","v":0},{"$f":"SUM(T16:T75)","v":5},{"$f":"LARGE(U16:U75,1)+LARGE(U16:U75,2)+LARGE(U16:U75,3)","v":0},{"$f":"SUM(V16:V75)","v":5},{"$f":"LARGE(W16:W75,1)+LARGE(W16:W75,2)+LARGE(W16:W75,3)","v":0},{"$f":"SUM(X16:X75)","v":5},{"$f":"LARGE(Y16:Y75,1)+LARGE(Y16:Y75,2)+LARGE(Y16:Y75,3)","v":0},{"$f":"SUM(Z16:Z75)","v":5},{"$f":"LARGE(AA16:AA75,1)+LARGE(AA16:AA75,2)+LARGE(AA16:AA75,3)","v":0},{"$f":"SUM(AB16:AB75)","v":5},{"$f":"LARGE(AC16:AC75,1)+LARGE(AC16:AC75,2)+LARGE(AC16:AC75,3)","v":0},{"$f":"SUM(AD16:AD75)","v":5}]
[null,null,"per Email an: sk-huemmling@gmx.de"]

{"sheet":"7","index":7,"n_rows":77,"n_cols":39,"rows_kept":77,"merged":[[0,34,0,35],[1,34,1,35],[4,34,4,35],[5,34,5,35],[6,34,6,35],[14,32,14,35]]}
[null,"Verein / Gruppe",null,"Ergebnisse",{"$nulls":29},"Austragungsort:",{"$f":"Übersicht!L4","v":"Börgermoor"}]
[1,{"$f":"'Wettkampf 1'!B2","v":"Esterwegen"},null,{"$f":"G76","v":279.9},{"$f":"IF(H76>4,\"Es sind zu viele Schützen in Wertung!\",\" \")","v":"Es sind zu viele Schützen in Wertung!"},{"$nulls":28},"Wettkampftag:",{"$f":"Übersicht!L3","v":"11.01."}]
[2,{"$f":"'Wettkampf 1'!B3","v":"Lähden Jugend I"},null,{"$f":"I76","v":1158.4},{"$f":"IF(J76>4,\"Es sind zu viele Schützen in Wertung!\",\" \")","v":" "}]
[3,{"$f":"'Wettkampf 1'!B4","v":"Börgerwald"},null,{"$f":"K76","v":{"v":0,"d":"0.0"}},{"$f":"IF(L76>4,\"Es sind zu viele Schützen in Wertung!\",\" \")","v":"Es sind zu viele Schützen in Wertung!"},{"$nulls":30},"Ansprechpartner für Rückfragen:"]
[4,{"$f":"'Wettkampf 1'!B5","v":"Börgermoor"},null,{"$f":"M76","v":{"v":1018.5999999999999,"d":"1018.6"}},{"$f":"IF(N76>4,\"Es sind zu viele Schützen in Wertung!\",\" \")","v":"Es sind zu viele Schützen in Wertung!"},{"$nulls":28},"Name:","Yvonne Segbers"]
[5,{"$f":"'Wettkampf 1'!B6","v":"Spahnharrenstätte"},null,{"$f":"O76","v":319.5},{"$f":"IF(P76>4,\"Es sind zu viele Schützen in Wertung!\",\" \")","v":"Es sind zu viele Schützen in Wertung!"},{"$nulls":28},"Tel:","015120960756"]
[6,{"$f":"'Wettkampf 1'!B7","v":"Lorup"},null,{"$f":"Q76","v":{"v":0,"d":"0.0"}},{"$f":"IF(R76>4,\"Es sind zu viele Schützen in Wertung!\",\" \")","v":"Es sind zu viele Schützen in Wertung!"},{"$nulls":28},"Standaufsicht:","Yvonne Segbers"]
[7,{"$f":"'Wettkampf 1'!B8","v":"Lahn"},null,{"$f":"S76","v":464.9},{"$f":"IF(T76>4,\"Es sind zu viele Schützen in Wertung!\",\" \")","v":"Es sind zu viele Schützen in Wertung!"}]
[8,{"$f":"'Wettkampf 1'!B9","v":"Sögel"},null,{"$f":"U76","v":{"v":0,"d":"0.0"}},{"$f":"IF(V76>4,\"Es sind zu viele Schützen in Wertung!\",\" \")","v":"Es sind zu viele Schützen in Wertung!"}]
[9,{"$f":"'Wettkampf 1'!B10","v":"Verein IX"},null,{"$f":"W76","v":{"v":0,"d":"0.0"}},{"$f":"IF(X76>4,\"Es sind zu viele Schützen in Wertung!\",\" \")","v":"Es sind zu viele Schützen in Wertung!"}]
[10,{"$f":"'Wettkampf 1'!B11","v":"Verein X"},null,{"$f":"Y76","v":{"v":0,"d":"0.0"}},{"$f":"IF(Z76>4,\"Es sind zu viele Schützen in Wertung!\",\" \")","v":"Es sind zu viele Schützen in Wertung!"}]
[11,{"$f":"'Wettkampf 1'!B12","v":"Verein XI"},null,{"$f":"AA76","v":{"v":0,"d":"0.0"}},{"$f":"IF(AB76>4,\"Es sind zu viele Schützen in Wertung!\",\" \")","v":"Es sind zu viele Schützen in Wertung!"}]
[12,{"$f":"'Wettkampf 1'!B13","v":"Verein XII"},null,{"$f":"AC76","v":{"v":0,"d":"0.0"}},{"$f":"IF(AD76>4,\"Es sind zu viele Schützen in Wertung!\",\" \")","v":"Es sind zu viele Schützen in Wertung!"}]
[]
[null,"Einzelergebnisse:","Verein / Gruppe","Ergebnisse (mindestens 0 eintragen)","AW? Dann x eintippen",null,"Verein 1",null,"Verein 2",null,"Verein 3",null,"Verein 4",null,"Verein 5",null,"Verein 6",null,"Verein 7",null,"Verein 8",null,"Verein 9",null,"Verein 10",null,"Verein 11",null,"Verein 12",{"$nulls":3},"Proberechnung bei Streifen:"]
[1,{"$f":"'Wettkampf 1'!B16","v":"Gedecksnis Stefan"},{"$f":"'Wettkampf 1'!C16","v":"Esterwegen"},279.9,null,{"$f":"IF(E16=\"x\",\"0\",D16)","v":279.9},{"$f":"IF(C16=$B$2,F16,0)","v":279.9},{"$f":"(IF(AND($E16=\"\",$C16=$B$2),1,0))","v":1},{"$f":"IF($C16=$B$3,$F16,0)","v":0},{"$f":"(IF(AND($E16=\"\",$C16=$B$3),1,0))","v":0},{"$f":"IF($C16=$B$4,F16,0)","v":0},{"$f":"(IF(AND($E16=\"\",$C16=$B$4),1,0))","v":0},{"$f":"IF($C16=$B$5,F16,0)","v":0},{"$f":"(IF(AND($E16=\"\",$C16=$B$5),1,0))","v":0},{"$f":"IF($C16=$B$6,F16,0)","v":0},{"$f":"(IF(AND($E16=\"\",$C16=$B$6),1,0))","v":0},{"$f":"IF($C16=$B$7,F16,0)","v":0},{"$f":"(IF(AND($E16=\"\",$C16=$B$7),1,0))","v":0},{"$f":"IF($C16=$B$8,$F16,0)","v":0},{"$f":"(IF(AND($E16=\"\",$C16=$B$8),1,0))","v":0},{"$f":"IF($C16=$B$9,$F16,0)","v":0},{"$f":"(IF(AND($E16=\"\",$C16=$B$9),1,0))","v":0},{"$f":"IF($C16=$B$10,$F16,0)","v":0},{"$f":"(IF(AND($E16=\"\",$C16=$B$10),1,0))","v":0},{"$f":"IF($C16=$B$11,$F16,0)","v":0},{"$f":"(IF(AND($E16=\"\",$C16=$B$11),1,0))","v":0},{"$f":"IF($C16=$B$12,$F16,0)","v":0},{"$f":"(IF(AND($E16=\"\",$C16=$B$12),1,0))","v":0},{"$f":"IF($C16=$B$13,$F16,0)","v":0},{"$f":"(IF(AND($E16=\"\",$C16=$B$13),1,0))","v":0},{"$nulls":5},{"$f":"SUM(AG16:AI16)","v":{"v":0,"d":"0.0"}},{"$f":"IF(AJ16=D16,1,0)","v":0},{"$f":"IF(AJ16=0,0,1)","v":0},{"$f":"IF(AK16+AL16=2,\"Korrekt\",\"\")","v":""}]
[2,{"$f":"'Wettkampf 1'!B17","v":"Wübben Jasper"},{"$f":"'Wettkampf 1'!C17","v":"Esterwegen"},null,null,{"$f":"IF(E17=\"x\",\"0\",D17)","v":{"v":0,"d":"0.0"}},{"$f":"IF(C17=$B$2,F17,0)","v":0},{"$f":"(IF(AND($E17=\"\",$C17=$B$2),1,0))","v":1},{"$f":"IF($C17=$B$3,F17,0)","v":0},{"$f":"(IF(AND($E17=\"\",$C17=$B$3),1,0))","v":0},{"$f":"IF($C17=$B$4,F17,0)","v":0},{"$f":"(IF(AND($E17=\"\",$C17=$B$4),1,0))","v":0},{"$f":"IF($C17=$B$5,F17,0)","v":0},{"$f":"(IF(AND($E17=\"\",$C17=$B$5),1,0))","v":0},{"$f":"IF($C17=$B$6,F17,0)","v":0},{"$f":"(IF(AND($E17=\"\",$C17=$B$6),1,0))","v":0},{"$f":"IF($C17=$B$7,F17,0)","v":0},{"$f":"(IF(AND($E17=\"\",$C17=$B$7),1,0))","v":0},{"$f":"IF($C17=$B$8,$F17,0)","v":0},{"$f":"(IF(AND($E17=\"\",$C17=$B$8),1,0))","v":0},{"$f":"IF($C17=$B$9,$F17,0)","v":0},{"$f":"(IF(AND($E17=\"\",$C17=$B$9),1,0))","v":0},{"$f":"IF($C17=$B$10,$F17,0)","v":0},{"$f":"(IF(AND($E17=\"\",$C17=$B$10),1,0))","v":0},{"$f":"IF($C17=$B$11,$F17,0)","v":0},{"$f":"(IF(AND($E17=\"\",$C17=$B$11),1,0))","v":0},{"$f":"IF($C17=$B$12,$F17,0)","v":0},{"$f":"(IF(AND($E17=\"\",$C17=$B$12),1,0))","v":0},{"$f":"IF($C17=$B$13,$F17,0)","v":0},{"$f":"(IF(AND($E17=\"\",$C17=$B$13),1,0))","v":0},{"$nulls":5},{"$f":"SUM(AG17:AI17)","v":{"v":0,"d":"0.0"}},{"$f":"IF(AJ17=D17,1,0)","v":1},{"$f":"IF(AJ17=0,0,1)","v":0},{"$f":"IF(AK17+AL17=2,\"Korrekt\",\"\")","v":""}]
[3,{"$f":"'Wettkampf 1'!B18","v":"Engbers Julian"},{"$f":"'Wettkampf 1'!C18","v":"Esterwegen"},null,null,{"v":0,"d":"0.0"},0,1,0,0,0,0,0,0,0,0,0,0,0,0,0,0,0,0,0,0,0,0,0,0,{"$nulls":5},{"v":0,"d":"0.0"},1,0,""]
[4,{"$f":"'Wettkampf 1'!B19","v":"Meyer Johan"},{"$f":"'Wettkampf 1'!C19","v":"Esterwegen"},null,null,{"v":0,"d":"0.0"},0,1,0,0,0,0,0,0,0,0,0,0,0,0,0,0,0,0,0,0,0,0,0,0,{"$nulls":5},{"v":0,"d":"0.0"},1,0,""]
[5,{"$f":"'Wettkampf 1'!B20","v":"Schütze 5"},{"$f":"'Wettkampf 1'!C20","v":"Esterwegen"},null,null,{"v":0,"d":"0.0"},0,1,0,0,0,0,0,0,0,0,0,0,0,0,0,0,0,0,0,0,0,0,0,0,{"$nulls":5},{"v":0,"d":"0.0"},1,0,""]
[6,{"$f":"'Wettkampf 1'!B21","v":"Strüwing Inja"},{"$f":"'Wettkampf 1'!C21","v":"Lähden Jugend I"},389.3,null,389.3,0,0,389.3,1,0,0,0,0,0,0,0,0,0,0,0,0,0,0,0,0,0,0,0,0,{"$nulls":5},{"v":0,"d":"0.0"},0,0,""]
[7,{"$f":"'Wettkampf 1'!B22","v":"Bruns Hendrik"},{"$f":"'Wettkampf 1'!C22","v":"Lähden Jugend I"},382.2,null,382.2,0,0,382.2,1,0,0,0,0,0,0,0,0,0,0,0,0,0,0,0,0,0,0,0,0,{"$nulls":5},{"v":0,"d":"0.0"},0,0,""]
[8,{"$f":"'Wettkampf 1'!B23","v":"Feldhaus Vanessa"},{"$f":"'Wettkampf 1'!C23","v":"Lähden Jugend I"},345.2,"x","0",0,0,"0",0,0,0,0,0,0,0,0,0,0,0,0,0,0,0,0,0,0,0,0,0,{"$nulls":5},{"v":0,"d":"0.0"},0,0,""]
[9,{"$f":"'Wettkampf 1'!B24","v":"Feldhaus Celien "},{"$f":"'Wettkampf 1'!C24","v":"Lähden Jugend I"},349.9,null,349.9,0,0,349.9,1,0,0,0,0,0,0,0,0,0,0,0,0,0,0,0,0,0,0,0,0,{"$nulls":5},{"v":0,"d":"0.0"},0,0,""]
[10,{"$f":"'Wettkampf 1'!B25","v":"Stümpler Jan-Luca"},{"$f":"'Wettkampf 1'!C25","v":"Lähden Jugend I"},386.9,null,386.9,0,0,386.9,1,0,0,0,0,0,0,0,0,0,0,0,0,0,0,0,0,0,0,0,0,{"$nulls":5},{"v":0,"d":"0.0"},0,0,""]
[11,{"$f":"'Wettkampf 1'!B26","v":"Hanneken Maren"},{"$f":"'Wettkampf 1'!C26","v":"Börgerwald"},null,null,{"v":0,"d":"0.0"},0,0,0,0,0,1,0,0,0,0,0,0,0,0,0,0,0,0,0,0,0,0,0,0,{"$nulls":5},{"v":0,"d":"0.0"},1,0,""]
[12,{"$f":"'Wettkampf 1'!B27","v":"Köstering Nele"},{"$f":"'Wettkampf 1'!C27","v":"Börgerwald"},null,null,{"v":0,"d":"0.0"},0,0,0,0,0,1,0,0,0,0,0,0,0,0,0,0,0,0,0,0,0,0,0,0,{"$nulls":5},{"v":0,"d":"0.0"},1,0,""]
[13,{"$f":"'Wettkampf 1'!B28","v":"Lohmann Amy"},{"$f":"'Wettkampf 1'!C28","v":"Börgerwald"},null,null,{"v":0,"d":"0.0"},0,0,0,0,0,1,0,0,0,0,0,0,0,0,0,0,0,0,0,0,0,0,0,0,{"$nulls":5},{"v":0,"d":"0.0"},1,0,""]
[14,{"$f":"'Wettkampf 1'!B29","v":"Schütze 14"},{"$f":"'Wettkampf 1'!C29","v":"Börgerwald"},null,null,{"v":0,"d":"0.0"},0,0,0,0,0,1,0,0,0,0,0,0,0,0,0,0,0,0,0,0,0,0,0,0,{"$nulls":5},{"v":0,"d":"0.0"},1,0,""]
[15,{"$f":"'Wettkampf 1'!B30","v":"Schütze 15"},{"$f":"'Wettkampf 1'!C30","v":"Börgerwald"},null,null,{"v":0,"d":"0.0"},0,0,0,0,0,1,0,0,0,0,0,0,0,0,0,0,0,0,0,0,0,0,0,0,{"$nulls":5},{"v":0,"d":"0.0"},1,0,""]
[16,{"$f":"'Wettkampf 1'!B31","v":"Brandt Mira"},{"$f":"'Wettkampf 1'!C31","v":"Börgermoor"},356.5,null,356.5,0,0,0,0,0,0,356.5,1,0,0,0,0,0,0,0,0,0,0,0,0,0,0,0,0,{"$nulls":5},{"v":0,"d":"0.0"},0,0,""]
[17,{"$f":"'Wettkampf 1'!B32","v":"Eichhorn Luca"},{"$f":"'Wettkampf 1'!C32","v":"Börgermoor"},335.3,null,335.3,0,0,0,0,0,0,335.3,1,0,0,0,0,0,0,0,0,0,0,0,0,0,0,0,0,{"$nulls":5},{"v":0,"d":"0.0"},0,0,""]
[18,{"$f":"'Wettkampf 1'!B33","v":"Kohnen Saskia"},{"$f":"'Wettkampf 1'!C33","v":"Börgermoor"},326.8,null,326.8,0,0,0,0,0,0,326.8,1,0,0,0,0,0,0,0,0,0,0,0,0,0,0,0,0,{"$nulls":5},{"v":0,"d":"0.0"},0,0,""]
[19,{"$f":"'Wettkampf 1'!B34","v":"Schütze 19"},{"$f":"'Wettkampf 1'!C34","v":"Börgermoor"},null,null,{"v":0,"d":"0.0"},0,0,0,0,0,0,0,1,0,0,0,0,0,0,0,0,0,0,0,0,0,0,0,0,{"$nulls":5},{"v":0,"d":"0.0"},1,0,""]
[20,{"$f":"'Wettkampf 1'!B35","v":"Schütze 20"},{"$f":"'Wettkampf 1'!C35","v":"Börgermoor"},null,null,{"v":0,"d":"0.0"},0,0,0,0,0,0,0,1,0,0,0,0,0,0,0,0,0,0,0,0,0,0,0,0,{"$nulls":5},{"v":0,"d":"0.0"},1,0,""]
[21,{"$f":"'Wettkampf 1'!B36","v":"Runde Marcel"},{"$f":"'Wettkampf 1'!C36","v":"Spahnharrenstätte"},319.5,null,319.5,0,0,0,0,0,0,0,0,319.5,1,0,0,0,0,0,0,0,0,0,0,0,0,0,0,{"$nulls":5},{"v":0,"d":"0.0"},0,0,""]
[22,{"$f":"'Wettkampf 1'!B37","v":"Leis Fynn Lucas "},{"$f":"'Wettkampf 1'!C37","v":"Spahnharrenstätte"},null,null,{"v":0,"d":"0.0"},0,0,0,0,0,0,0,0,0,1,0,0,0,0,0,0,0,0,0,0,0,0,0,0,{"$nulls":5},{"v":0,"d":"0.0"},1,0,""]
[23,{"$f":"'Wettkampf 1'!B38","v":"Jansen Lars"},{"$f":"'Wettkampf 1'!C38","v":"Spahnharrenstätte"},null,null,{"v":0,"d":"0.0"},0,0,0,0,0,0,0,0,0,1,0,0,0,0,0,0,0,0,0,0,0,0,0,0,{"$nulls":5},{"v":0,"d":"0.0"},1,0,""]
[24,{"$f":"'Wettkampf 1'!B39","v":"Köster Thilo"},{"$f":"'Wettkampf 1'!C39","v":"Spahnharrenstätte"},null,null,{"v":0,"d":"0.0"},0,0,0,0,0,0,0,0,0,1,0,0,0,0,0,0,0,0,0,0,0,0,0,0,{"$nulls":5},{"v":0,"d":"0.0"},1,0,""]
[25,{"$f":"'Wettkampf 1'!B40","v":"Schütze 25"},{"$f":"'Wettkampf 1'!C40","v":"Spahnharrenstätte"},null,null,{"v":0,"d":"0.0"},0,0,0,0,0,0,0,0,0,1,0,0,0,0,0,0,0,0,0,0,0,0,0,0,{"$nulls":5},{"v":0,"d":"0.0"},1,0,""]
[26,{"$f":"'Wettkampf 1'!B41","v":"Dolling Leon"},{"$f":"'Wettkampf 1'!C41","v":"Lorup"},null,null,{"v":0,"d":"0.0"},0,0,0,0,0,0,0,0,0,0,0,1,0,0,0,0,0,0,0,0,0,0,0,0,{"$nulls":5},{"v":0,"d":"0.0"},1,0,""]
[27,{"$f":"'Wettkampf 1'!B42","v":"Schütze 27"},{"$f":"'Wettkampf 1'!C42","v":"Lorup"},null,null,{"v":0,"d":"0.0"},0,0,0,0,0,0,0,0,0,0,0,1,0,0,0,0,0,0,0,0,0,0,0,0,{"$nulls":5},{"v":0,"d":"0.0"},1,0,""]
[28,{"$f":"'Wettkampf 1'!B43","v":"Schütze 28"},{"$f":"'Wettkampf 1'!C43","v":"Lorup"},null,null,{"v":0,"d":"0.0"},0,0,0,0,0,0,0,0,0,0,0,1,0,0,0,0,0,0,0,0,0,0,0,0,{"$nulls":5},{"v":0,"d":"0.0"},1,0,""]
[29,{"$f":"'Wettkampf 1'!B44","v":"Schütze 29"},{"$f":"'Wettkampf 1'!C44","v":"Lorup"},null,null,{"v":0,"d":"0.0"},0,0,0,0,0,0,0,0,0,0,0,1,0,0,0,0,0,0,0,0,0,0,0,0,{"$nulls":5},{"v":0,"d":"0.0"},1,0,""]
[30,{"$f":"'Wettkampf 1'!B45","v":"Schütze 30"},{"$f":"'Wettkampf 1'!C45","v":"Lorup"},null,null,{"v":0,"d":"0.0"},0,0,0,0,0,0,0,0,0,0,0,1,0,0,0,0,0,0,0,0,0,0,0,0,{"$nulls":5},{"v":0,"d":"0.0"},1,0,""]
[31,{"$f":"'Wettkampf 1'!B46","v":"Wilken Noah"},{"$f":"'Wettkampf 1'!C46","v":"Lahn"},290.3,null,290.3,0,0,0,0,0,0,0,0,0,0,0,0,290.3,1,0,0,0,0,0,0,0,0,0,0,{"$nulls":5},{"v":0,"d":"0.0"},0,0,""]
[32,{"$f":"'Wettkampf 1'!B47","v":"Schulz Mika"},{"$f":"'Wettkampf 1'!C47","v":"Lahn"},174.6,null,174.6,0,0,0,0,0,0,0,0,0,0,0,0,174.6,1,0,0,0,0,0,0,0,0,0,0,{"$nulls":5},{"v":0,"d":"0.0"},0,0,""]
[33,{"$f":"'Wettkampf 1'!B48","v":"Schütze 33"},{"$f":"'Wettkampf 1'!C48","v":"Lahn"},null,null,{"v":0,"d":"0.0"},0,0,0,0,0,0,0,0,0,0,0,0,0,1,0,0,0,0,0,0,0,0,0,0,{"$nulls":5},{"v":0,"d":"0.0"},1,0,""]
[34,{"$f":"'Wettkampf 1'!B49","v":"Schütze 34"},{"$f":"'Wettkampf 1'!C49","v":"Lahn"},null,null,{"v":0,"d":"0.0"},0,0,0,0,0,0,0,0,0,0,0,0,0,1,0,0,0,0,0,0,0,0,0,0,{"$nulls":5},{"v":0,"d":"0.0"},1,0,""]
[35,{"$f":"'Wettkampf 1'!B50","v":"Schütze 35"},{"$f":"'Wettkampf 1'!C50","v":"Lahn"},null,null,{"v":0,"d":"0.0"},0,0,0,0,0,0,0,0,0,0,0,0,0,1,0,0,0,0,0,0,0,0,0,0,{"$nulls":5},{"v":0,"d":"0.0"},1,0,""]
[36,{"$f":"'Wettkampf 1'!B51","v":"Tharner Kim"},{"$f":"'Wettkampf 1'!C51","v":"Sögel"},null,null,{"v":0,"d":"0.0"},0,0,0,0,0,0,0,0,0,0,0,0,0,0,0,1,0,0,0,0,0,0,0,0,{"$nulls":5},{"v":0,"d":"0.0"},1,0,""]
[37,{"$f":"'Wettkampf 1'!B52","v":"Schütze 37"},{"$f":"'Wettkampf 1'!C52","v":"Sögel"},null,null,{"v":0,"d":"0.0"},0,0,0,0,0,0,0,0,0,0,0,0,0,0,0,1,0,0,0,0,0,0,0,0,{"$nulls":5},{"v":0,"d":"0.0"}]
[38,{"$f":"'Wettkampf 1'!B53","v":"Schütze 38"},{"$f":"'Wettkampf 1'!C53","v":"Sögel"},null,null,{"v":0,"d":"0.0"},0,0,0,0,0,0,0,0,0,0,0,0,0,0,0,1,0,0,0,0,0,0,0,0,{"$nulls":5},{"v":0,"d":"0.0"}]
[39,{"$f":"'Wettkampf 1'!B54","v":"Schütze 39"},{"$f":"'Wettkampf 1'!C54","v":"Sögel"},null,null,{"v":0,"d":"0.0"},0,0,0,0,0,0,0,0,0,0,0,0,{"$f":"IF($C54=$B$8,$F54,0)","v":0},{"$f":"(IF(AND($E54=\"\",$C54=$B$8),1,0))","v":0},{"$f":"IF($C54=$B$9,$F54,0)","v":0},{"$f":"(IF(AND($E54=\"\",$C54=$B$9),1,0))","v":1},{"$f":"IF($C54=$B$10,$F54,0)","v":0},{"$f":"(IF(AND($E54=\"\",$C54=$B$10),1,0))","v":0},{"$f":"IF($C54=$B$11,$F54,0)","v":0},{"$f":"(IF(AND($E54=\"\",$C54=$B$11),1,0))","v":0},{"$f":"IF($C54=$B$12,$F54,0)","v":0},{"$f":"(IF(AND($E54=\"\",$C54=$B$12),1,0))","v":0},{"$f":"IF($C54=$B$13,$F54,0)","v":0},{"$f":"(IF(AND($E54=\"\",$C54=$B$13),1,0))","v":0},{"$nulls":5},{"v":0,"d":"0.0"}]
[40,{"$f":"'Wettkampf 1'!B55","v":"Schütze 40"},{"$f":"'Wettkampf 1'!C55","v":"Sögel"},null,null,{"v":0,"d":"0.0"},0,0,0,0,0,0,0,0,0,0,0,0,0,0,0,1,0,0,0,0,0,0,0,0,{"$nulls":5},{"v":0,"d":"0.0"}]
[41,{"$f":"'Wettkampf 1'!B56","v":"Schütze 41"},{"$f":"'Wettkampf 1'!C56","v":"Verein IX"},null,null,{"v":0,"d":"0.0"},0,0,0,0,0,0,0,0,0,0,0,0,0,0,0,0,0,1,0,0,0,0,0,0,{"$nulls":5},{"v":0,"d":"0.0"}]
[42,{"$f":"'Wettkampf 1'!B57","v":"Schütze 42"},{"$f":"'Wettkampf 1'!C57","v":"Verein IX"},null,null,{"v":0,"d":"0.0"},0,0,0,0,0,0,0,0,0,0,0,0,0,0,0,0,0,1,0,0,0,0,0,0,{"$nulls":5},{"v":0,"d":"0.0"}]
[43,{"$f":"'Wettkampf 1'!B58","v":"Schütze 43"},{"$f":"'Wettkampf 1'!C58","v":"Verein IX"},null,null,{"v":0,"d":"0.0"},0,0,0,0,0,0,0,0,0,0,0,0,0,0,0,0,0,1,0,0,0,0,0,0,{"$nulls":5},{"v":0,"d":"0.0"}]
[44,{"$f":"'Wettkampf 1'!B59","v":"Schütze 44"},{"$f":"'Wettkampf 1'!C59","v":"Verein IX"},null,null,{"v":0,"d":"0.0"},0,0,0,0,0,0,0,0,0,0,0,0,0,0,0,0,0,1,0,0,0,0,0,0,{"$nulls":5},{"v":0,"d":"0.0"}]
[45,{"$f":"'Wettkampf 1'!B60","v":"Schütze 45"},{"$f":"'Wettkampf 1'!C60","v":"Verein IX"},null,null,{"v":0,"d":"0.0"},0,0,0,0,0,0,0,0,0,0,0,0,0,0,0,0,0,1,0,0,0,0,0,0,{"$nulls":5},{"v":0,"d":"0.0"}]
[46,{"$f":"'Wettkampf 1'!B61","v":"Schütze 46"},{"$f":"'Wettkampf 1'!C61","v":"Verein X"},null,null,{"v":0,"d":"0.0"},0,0,0,0,0,0,0,0,0,0,0,0,0,0,0,0,0,0,0,1,0,0,0,0,{"$nulls":5},{"v":0,"d":"0.0"}]
[47,{"$f":"'Wettkampf 1'!B62","v":"Schütze 47"},{"$f":"'Wettkampf 1'!C62","v":"Verein X"},null,null,{"v":0,"d":"0.0"},0,0,0,0,0,0,0,0,0,0,0,0,0,0,0,0,0,0,0,1,0,0,0,0,{"$nulls":5},{"v":0,"d":"0.0"}]
[48,{"$f":"'Wettkampf 1'!B63","v":"Schütze 48"},{"$f":"'Wettkampf 1'!C63","v":"Verein X"},null,null,{"v":0,"d":"0.0"},0,0,0,0,0,0,0,0,0,0,0,0,0,0,0,0,0,0,0,1,0,0,0,0,{"$nulls":5},{"v":0,"d":"0.0"}]
[49,{"$f":"'Wettkampf 1'!B64","v":"Schütze 49"},{"$f":"'Wettkampf 1'!C64","v":"Verein X"},null,null,{"v":0,"d":"0.0"},0,0,0,0,0,0,0,0,0,0,0,0,0,0,0,0,0,0,0,1,0,0,0,0,{"$nulls":5},{"v":0,"d":"0.0"}]
[50,{"$f":"'Wettkampf 1'!B65","v":"Schütze 50"},{"$f":"'Wettkampf 1'!C65","v":"Verein X"},null,null,{"v":0,"d":"0.0"},0,0,0,0,0,0,0,0,0,0,0,0,0,0,0,0,0,0,0,1,0,0,0,0,{"$nulls":5},{"v":0,"d":"0.0"}]
[51,{"$f":"'Wettkampf 1'!B66","v":"Schütze 51"},{"$f":"'Wettkampf 1'!C66","v":"Verein XI"},null,null,{"v":0,"d":"0.0"},0,0,0,0,0,0,0,0,0,0,0,0,0,0,0,0,0,0,0,0,0,1,0,0,{"$nulls":5},{"v":0,"d":"0.0"}]
[52,{"$f":"'Wettkampf 1'!B67","v":"Schütze 52"},{"$f":"'Wettkampf 1'!C67","v":"Verein XI"},null,null,{"v":0,"d":"0.0"},0,0,0,0,0,0,0,0,0,0,0,0,0,0,0,0,0,0,0,0,0,1,0,0,{"$nulls":5},{"v":0,"d":"0.0"}]
[53,{"$f":"'Wettkampf 1'!B68","v":"Schütze 53"},{"$f":"'Wettkampf 1'!C68","v":"Verein XI"},null,null,{"v":0,"d":"0.0"},0,0,0,0,0,0,0,0,0,0,0,0,0,0,0,0,0,0,0,0,0,1,0,0,{"$nulls":5},{"v":0,"d":"0.0"}]
[54,{"$f":"'Wettkampf 1'!B69","v":"Schütze 54"},{"$f":"'Wettkampf 1'!C69","v":"Verein XI"},null,null,{"v":0,"d":"0.0"},0,0,0,0,0,0,0,0,0,0,0,0,0,0,0,0,0,0,0,0,0,1,0,0,{"$nulls":5},{"v":0,"d":"0.0"}]
[55,{"$f":"'Wettkampf 1'!B70","v":"Schütze 55"},{"$f":"'Wettkampf 1'!C70","v":"Verein XI"},null,null,{"v":0,"d":"0.0"},0,0,0,0,0,0,0,0,0,0,0,0,0,0,0,0,0,0,0,0,0,1,0,0,{"$nulls":5},{"v":0,"d":"0.0"}]
[56,{"$f":"'Wettkampf 1'!B71","v":"Schütze 56"},{"$f":"'Wettkampf 1'!C71","v":"Verein XII"},null,null,{"v":0,"d":"0.0"},0,0,0,0,0,0,0,0,0,0,0,0,0,0,0,0,0,0,0,0,0,0,0,1,{"$nulls":5},{"v":0,"d":"0.0"}]
[57,{"$f":"'Wettkampf 1'!B72","v":"Schütze 57"},{"$f":"'Wettkampf 1'!C72","v":"Verein XII"},null,null,{"v":0,"d":"0.0"},0,0,0,0,0,0,0,0,0,0,0,0,0,0,0,0,0,0,0,0,0,0,0,1,{"$nulls":5},{"v":0,"d":"0.0"}]
[58,{"$f":"'Wettkampf 1'!B73","v":"Schütze 58"},{"$f":"'Wettkampf 1'!C73","v":"Verein XII"},null,null,{"v":0,"d":"0.0"},0,0,0,0,0,0,0,0,0,0,0,0,0,0,0,0,0,0,0,0,0,0,0,1,{"$nulls":5},{"v":0,"d":"0.0"}]
[59,{"$f":"'Wettkampf 1'!B74","v":"Schütze 59"},{"$f":"'Wettkampf 1'!C74","v":"Verein XII"},null,null,{"v":0,"d":"0.0"},0,0,0,0,0,0,0,0,0,0,0,0,0,0,0,0,0,0,0,0,0,0,0,1,{"$nulls":5},{"v":0,"d":"0.0"}]
[60,{"$f":"'Wettkampf 1'!B75","v":"Schütze 60"},{"$f":"'Wettkampf 1'!C75","v":"Verein XII"},null,null,{"v":0,"d":"0.0"},0,0,0,0,0,0,0,0,0,0,0,0,0,0,0,0,0,0,0,0,0,0,0,1,{"$nulls":5},{"v":0,"d":"0.0"}]
[{"$nulls":6},{"$f":"LARGE(G16:G75,1)+LARGE(G16:G75,2)+LARGE(G16:G75,3)","v":279.9},{"$f":"SUM(H16:H75)","v":5},{"$f":"LARGE(I16:I75,1)+LARGE(I16:I75,2)+LARGE(I16:I75,3)","v":1158.4},{"$f":"SUM(J16:J75)","v":4},{"$f":"LARGE(K16:K75,1)+LARGE(K16:K75,2)+LARGE(K16:K75,3)","v":0},{"$f":"SUM(L16:L75)","v":5},{"$f":"LARGE(M16:M75,1)+LARGE(M16:M75,2)+LARGE(M16:M75,3)","v":1018.5999999999999},{"$f":"SUM(N16:N75)","v":5},{"$f":"LARGE(O16:O75,1)+LARGE(O16:O75,2)+LARGE(O16:O75,3)","v":319.5},{"$f":"SUM(P16:P75)","v":5},{"$f":"LARGE(Q16:Q75,1)+LARGE(Q16:Q75,2)+LARGE(Q16:Q75,3)","v":0},{"$f":"SUM(R16:R75)","v":5},{"$f":"LARGE(S16:S75,1)+LARGE(S16:S75,2)+LARGE(S16:S75,3)","v":464.9},{"$f":"SUM(T16:T75)","v":5},{"$f":"LARGE(U16:U75,1)+LARGE(U16:U75,2)+LARGE(U16:U75,3)","v":0},{"$f":"SUM(V16:V75)","v":5},{"$f":"LARGE(W16:W75,1)+LARGE(W16:W75,2)+LARGE(W16:W75,3)","v":0},{"$f":"SUM(X16:X75)","v":5},{"$f":"LARGE(Y16:Y75,1)+LARGE(Y16:Y75,2)+LARGE(Y16:Y75,3)","v":0},{"$f":"SUM(Z16:Z75)","v":5},{"$f":"LARGE(AA16:AA75,1)+LARGE(AA16:AA75,2)+LARGE(AA16:AA75,3)","v":0},{"$f":"SUM(AB16:AB75)","v":5},{"$f":"LARGE(AC16:AC75,1)+LARGE(AC16:AC75,2)+LARGE(AC16:AC75,3)","v":0},{"$f":"SUM(AD16:AD75)","v":5}]
[null,null,"per Email an: sk-huemmling@gmx.de"]

{"sheet":"8","index":8,"n_rows":77,"n_cols":39,"rows_kept":77,"merged":[[0,34,0,35],[1,34,1,35],[4,34,4,35],[5,34,5,35],[6,34,6,35],[14,32,14,35]]}
[null,"Verein / Gruppe",null,"Ergebnisse",{"$nulls":29},"Austragungsort:",{"$f":"Übersicht!M4","v":"Lähden"}]
[1,{"$f":"'Wettkampf 1'!B2","v":"Esterwegen"},null,{"$f":"G76","v":{"v":0,"d":"0.0"}},{"$f":"IF(H76>4,\"Es sind zu viele Schützen in Wertung!\",\" \")","v":"Es sind zu viele Schützen in Wertung!"},{"$nulls":28},"Wettkampftag:",{"$f":"Übersicht!M3","v":"01.02."}]
[2,{"$f":"'Wettkampf 1'!B3","v":"Lähden Jugend I"},null,{"$f":"I76","v":{"v":1134.1999999999998,"d":"1134.2"}},{"$f":"IF(J76>4,\"Es sind zu viele Schützen in Wertung!\",\" \")","v":"Es sind zu viele Schützen in Wertung!"}]
[3,{"$f":"'Wettkampf 1'!B4","v":"Börgerwald"},null,{"$f":"K76","v":{"v":0,"d":"0.0"}},{"$f":"IF(L76>4,\"Es sind zu viele Schützen in Wertung!\",\" \")","v":"Es sind zu viele Schützen in Wertung!"},{"$nulls":30},"Ansprechpartner für Rückfragen:"]
[4,{"$f":"'Wettkampf 1'!B5","v":"Börgermoor"},null,{"$f":"M76","v":{"v":1010,"d":"1010.0"}},{"$f":"IF(N76>4,\"Es sind zu viele Schützen in Wertung!\",\" \")","v":"Es sind zu viele Schützen in Wertung!"},{"$nulls":28},"Name:"]
[5,{"$f":"'Wettkampf 1'!B6","v":"Spahnharrenstätte"},null,{"$f":"O76","v":336.5},{"$f":"IF(P76>4,\"Es sind zu viele Schützen in Wertung!\",\" \")","v":"Es sind zu viele Schützen in Wertung!"},{"$nulls":28},"Tel:"]
[6,{"$f":"'Wettkampf 1'!B7","v":"Lorup"},null,{"$f":"Q76","v":{"v":0,"d":"0.0"}},{"$f":"IF(R76>4,\"Es sind zu viele Schützen in Wertung!\",\" \")","v":"Es sind zu viele Schützen in Wertung!"},{"$nulls":28},"Standaufsicht:","eintragen"]
[7,{"$f":"'Wettkampf 1'!B8","v":"Lahn"},null,{"$f":"S76","v":{"v":491,"d":"491.0"}},{"$f":"IF(T76>4,\"Es sind zu viele Schützen in Wertung!\",\" \")","v":"Es sind zu viele Schützen in Wertung!"}]
[8,{"$f":"'Wettkampf 1'!B9","v":"Sögel"},null,{"$f":"U76","v":{"v":0,"d":"0.0"}},{"$f":"IF(V76>4,\"Es sind zu viele Schützen in Wertung!\",\" \")","v":"Es sind zu viele Schützen in Wertung!"}]
[9,{"$f":"'Wettkampf 1'!B10","v":"Verein IX"},null,{"$f":"W76","v":{"v":0,"d":"0.0"}},{"$f":"IF(X76>4,\"Es sind zu viele Schützen in Wertung!\",\" \")","v":"Es sind zu viele Schützen in Wertung!"}]
[10,{"$f":"'Wettkampf 1'!B11","v":"Verein X"},null,{"$f":"Y76","v":{"v":0,"d":"0.0"}},{"$f":"IF(Z76>4,\"Es sind zu viele Schützen in Wertung!\",\" \")","v":"Es sind zu viele Schützen in Wertung!"}]
[11,{"$f":"'Wettkampf 1'!B12","v":"Verein XI"},null,{"$f":"AA76","v":{"v":0,"d":"0.0"}},{"$f":"IF(AB76>4,\"Es sind zu viele Schützen in Wertung!\",\" \")","v":"Es sind zu viele Schützen in Wertung!"}]
[12,{"$f":"'Wettkampf 1'!B13","v":"Verein XII"},null,{"$f":"AC76","v":{"v":0,"d":"0.0"}},{"$f":"IF(AD76>4,\"Es sind zu viele Schützen in Wertung!\",\" \")","v":"Es sind zu viele Schützen in Wertung!"}]
[]
[null,"Einzelergebnisse:","Verein / Gruppe","Ergebnisse (mindestens 0 eintragen)","AW? Dann x eintippen",null,"Verein 1",null,"Verein 2",null,"Verein 3",null,"Verein 4",null,"Verein 5",null,"Verein 6",null,"Verein 7",null,"Verein 8",null,"Verein 9",null,"Verein 10",null,"Verein 11",null,"Verein 12",{"$nulls":3},"Proberechnung bei Streifen:"]
[1,{"$f":"'Wettkampf 1'!B16","v":"Gedecksnis Stefan"},{"$f":"'Wettkampf 1'!C16","v":"Esterwegen"},null,null,{"$f":"IF(E16=\"x\",\"0\",D16)","v":{"v":0,"d":"0.0"}},{"$f":"IF(C16=$B$2,F16,0)","v":0},{"$f":"(IF(AND($E16=\"\",$C16=$B$2),1,0))","v":1},{"$f":"IF($C16=$B$3,$F16,0)","v":0},{"$f":"(IF(AND($E16=\"\",$C16=$B$3),1,0))","v":0},{"$f":"IF($C16=$B$4,F16,0)","v":0},{"$f":"(IF(AND($E16=\"\",$C16=$B$4),1,0))","v":0},{"$f":"IF($C16=$B$5,F16,0)","v":0},{"$f":"(IF(AND($E16=\"\",$C16=$B$5),1,0))","v":0},{"$f":"IF($C16=$B$6,F16,0)","v":0},{"$f":"(IF(AND($E16=\"\",$C16=$B$6),1,0))","v":0},{"$f":"IF($C16=$B$7,F16,0)","v":0},{"$f":"(IF(AND($E16=\"\",$C16=$B$7),1,0))","v":0},{"$f":"IF($C16=$B$8,$F16,0)","v":0},{"$f":"(IF(AND($E16=\"\",$C16=$B$8),1,0))","v":0},{"$f":"IF($C16=$B$9,$F16,0)","v":0},{"$f":"(IF(AND($E16=\"\",$C16=$B$9),1,0))","v":0},{"$f":"IF($C16=$B$10,$F16,0)","v":0},{"$f":"(IF(AND($E16=\"\",$C16=$B$10),1,0))","v":0},{"$f":"IF($C16=$B$11,$F16,0)","v":0},{"$f":"(IF(AND($E16=\"\",$C16=$B$11),1,0))","v":0},{"$f":"IF($C16=$B$12,$F16,0)","v":0},{"$f":"(IF(AND($E16=\"\",$C16=$B$12),1,0))","v":0},{"$f":"IF($C16=$B$13,$F16,0)","v":0},{"$f":"(IF(AND($E16=\"\",$C16=$B$13),1,0))","v":0},{"$nulls":5},{"$f":"SUM(AG16:AI16)","v":{"v":0,"d":"0.0"}},{"$f":"IF(AJ16=D16,1,0)","v":1},{"$f":"IF(AJ16=0,0,1)","v":0},{"$f":"IF(AK16+AL16=2,\"Korrekt\",\"\")","v":""}]
[2,{"$f":"'Wettkampf 1'!B17","v":"Wübben Jasper"},{"$f":"'Wettkampf 1'!C17","v":"Esterwegen"},null,null,{"$f":"IF(E17=\"x\",\"0\",D17)","v":{"v":0,"d":"0.0"}},{"$f":"IF(C17=$B$2,F17,0)","v":0},{"$f":"(IF(AND($E17=\"\",$C17=$B$2),1,0))","v":1},{"$f":"IF($C17=$B$3,F17,0)","v":0},{"$f":"(IF(AND($E17=\"\",$C17=$B$3),1,0))","v":0},{"$f":"IF($C17=$B$4,F17,0)","v":0},{"$f":"(IF(AND($E17=\"\",$C17=$B$4),1,0))","v":0},{"$f":"IF($C17=$B$5,F17,0)","v":0},{"$f":"(IF(AND($E17=\"\",$C17=$B$5),1,0))","v":0},{"$f":"IF($C17=$B$6,F17,0)","v":0},{"$f":"(IF(AND($E17=\"\",$C17=$B$6),1,0))","v":0},{"$f":"IF($C17=$B$7,F17,0)","v":0},{"$f":"(IF(AND($E17=\"\",$C17=$B$7),1,0))","v":0},{"$f":"IF($C17=$B$8,$F17,0)","v":0},{"$f":"(IF(AND($E17=\"\",$C17=$B$8),1,0))","v":0},{"$f":"IF($C17=$B$9,$F17,0)","v":0},{"$f":"(IF(AND($E17=\"\",$C17=$B$9),1,0))","v":0},{"$f":"IF($C17=$B$10,$F17,0)","v":0},{"$f":"(IF(AND($E17=\"\",$C17=$B$10),1,0))","v":0},{"$f":"IF($C17=$B$11,$F17,0)","v":0},{"$f":"(IF(AND($E17=\"\",$C17=$B$11),1,0))","v":0},{"$f":"IF($C17=$B$12,$F17,0)","v":0},{"$f":"(IF(AND($E17=\"\",$C17=$B$12),1,0))","v":0},{"$f":"IF($C17=$B$13,$F17,0)","v":0},{"$f":"(IF(AND($E17=\"\",$C17=$B$13),1,0))","v":0},{"$nulls":5},{"$f":"SUM(AG17:AI17)","v":{"v":0,"d":"0.0"}},{"$f":"IF(AJ17=D17,1,0)","v":1},{"$f":"IF(AJ17=0,0,1)","v":0},{"$f":"IF(AK17+AL17=2,\"Korrekt\",\"\")","v":""}]
[3,{"$f":"'Wettkampf 1'!B18","v":"Engbers Julian"},{"$f":"'Wettkampf 1'!C18","v":"Esterwegen"},null,null,{"v":0,"d":"0.0"},0,1,0,0,0,0,0,0,0,0,0,0,0,0,0,0,0,0,0,0,0,0,0,0,{"$nulls":5},{"v":0,"d":"0.0"},1,0,""]
[4,{"$f":"'Wettkampf 1'!B19","v":"Meyer Johan"},{"$f":"'Wettkampf 1'!C19","v":"Esterwegen"},null,null,{"v":0,"d":"0.0"},0,1,0,0,0,0,0,0,0,0,0,0,0,0,0,0,0,0,0,0,0,0,0,0,{"$nulls":5},{"v":0,"d":"0.0"},1,0,""]
[5,{"$f":"'Wettkampf 1'!B20","v":"Schütze 5"},{"$f":"'Wettkampf 1'!C20","v":"Esterwegen"},null,null,{"v":0,"d":"0.0"},0,1,0,0,0,0,0,0,0,0,0,0,0,0,0,0,0,0,0,0,0,0,0,0,{"$nulls":5},{"v":0,"d":"0.0"},1,0,""]
[6,{"$f":"'Wettkampf 1'!B21","v":"Strüwing Inja"},{"$f":"'Wettkampf 1'!C21","v":"Lähden Jugend I"},385.2,null,385.2,0,0,385.2,1,0,0,0,0,0,0,0,0,0,0,0,0,0,0,0,0,0,0,0,0,{"$nulls":5},{"v":0,"d":"0.0"},0,0,""]
[7,{"$f":"'Wettkampf 1'!B22","v":"Bruns Hendrik"},{"$f":"'Wettkampf 1'!C22","v":"Lähden Jugend I"},369.6,null,369.6,0,0,369.6,1,0,0,0,0,0,0,0,0,0,0,0,0,0,0,0,0,0,0,0,0,{"$nulls":5},{"v":0,"d":"0.0"},0,0,""]
[8,{"$f":"'Wettkampf 1'!B23","v":"Feldhaus Vanessa"},{"$f":"'Wettkampf 1'!C23","v":"Lähden Jugend I"},318.7,null,318.7,0,0,318.7,1,0,0,0,0,0,0,0,0,0,0,0,0,0,0,0,0,0,0,0,0,{"$nulls":5},{"v":0,"d":"0.0"},0,0,""]
[9,{"$f":"'Wettkampf 1'!B24","v":"Feldhaus Celien "},{"$f":"'Wettkampf 1'!C24","v":"Lähden Jugend I"},361.2,null,361.2,0,0,361.2,1,0,0,0,0,0,0,0,0,0,0,0,0,0,0,0,0,0,0,0,0,{"$nulls":5},{"v":0,"d":"0.0"},0,0,""]
[10,{"$f":"'Wettkampf 1'!B25","v":"Stümpler Jan-Luca"},{"$f":"'Wettkampf 1'!C25","v":"Lähden Jugend I"},379.4,null,379.4,0,0,379.4,1,0,0,0,0,0,0,0,0,0,0,0,0,0,0,0,0,0,0,0,0,{"$nulls":5},{"v":0,"d":"0.0"},0,0,""]
[11,{"$f":"'Wettkampf 1'!B26","v":"Hanneken Maren"},{"$f":"'Wettkampf 1'!C26","v":"Börgerwald"},null,null,{"v":0,"d":"0.0"},0,0,0,0,0,1,0,0,0,0,0,0,0,0,0,0,0,0,0,0,0,0,0,0,{"$nulls":5},{"v":0,"d":"0.0"},1,0,""]
[12,{"$f":"'Wettkampf 1'!B27","v":"Köstering Nele"},{"$f":"'Wettkampf 1'!C27","v":"Börgerwald"},null,null,{"v":0,"d":"0.0"},0,0,0,0,0,1,0,0,0,0,0,0,0,0,0,0,0,0,0,0,0,0,0,0,{"$nulls":5},{"v":0,"d":"0.0"},1,0,""]
[13,{"$f":"'Wettkampf 1'!B28","v":"Lohmann Amy"},{"$f":"'Wettkampf 1'!C28","v":"Börgerwald"},null,null,{"v":0,"d":"0.0"},0,0,0,0,0,1,0,0,0,0,0,0,0,0,0,0,0,0,0,0,0,0,0,0,{"$nulls":5},{"v":0,"d":"0.0"},1,0,""]
[14,{"$f":"'Wettkampf 1'!B29","v":"Schütze 14"},{"$f":"'Wettkampf 1'!C29","v":"Börgerwald"},null,null,{"v":0,"d":"0.0"},0,0,0,0,0,1,0,0,0,0,0,0,0,0,0,0,0,0,0,0,0,0,0,0,{"$nulls":5},{"v":0,"d":"0.0"},1,0,""]
[15,{"$f":"'Wettkampf 1'!B30","v":"Schütze 15"},{"$f":"'Wettkampf 1'!C30","v":"Börgerwald"},null,null,{"v":0,"d":"0.0"},0,0,0,0,0,1,0,0,0,0,0,0,0,0,0,0,0,0,0,0,0,0,0,0,{"$nulls":5},{"v":0,"d":"0.0"},1,0,""]
[16,{"$f":"'Wettkampf 1'!B31","v":"Brandt Mira"},{"$f":"'Wettkampf 1'!C31","v":"Börgermoor"},349.7,null,349.7,0,0,0,0,0,0,349.7,1,0,0,0,0,0,0,0,0,0,0,0,0,0,0,0,0,{"$nulls":5},{"v":0,"d":"0.0"},0,0,""]
[17,{"$f":"'Wettkampf 1'!B32","v":"Eichhorn Luca"},{"$f":"'Wettkampf 1'!C32","v":"Börgermoor"},333.1,null,333.1,0,0,0,0,0,0,333.1,1,0,0,0,0,0,0,0,0,0,0,0,0,0,0,0,0,{"$nulls":5},{"v":0,"d":"0.0"},0,0,""]
[18,{"$f":"'Wettkampf 1'!B33","v":"Kohnen Saskia"},{"$f":"'Wettkampf 1'!C33","v":"Börgermoor"},327.2,null,327.2,0,0,0,0,0,0,327.2,1,0,0,0,0,0,0,0,0,0,0,0,0,0,0,0,0,{"$nulls":5},{"v":0,"d":"0.0"},0,0,""]
[19,{"$f":"'Wettkampf 1'!B34","v":"Schütze 19"},{"$f":"'Wettkampf 1'!C34","v":"Börgermoor"},null,null,{"v":0,"d":"0.0"},0,0,0,0,0,0,0,1,0,0,0,0,0,0,0,0,0,0,0,0,0,0,0,0,{"$nulls":5},{"v":0,"d":"0.0"},1,0,""]
[20,{"$f":"'Wettkampf 1'!B35","v":"Schütze 20"},{"$f":"'Wettkampf 1'!C35","v":"Börgermoor"},null,null,{"v":0,"d":"0.0"},0,0,0,0,0,0,0,1,0,0,0,0,0,0,0,0,0,0,0,0,0,0,0,0,{"$nulls":5},{"v":0,"d":"0.0"},1,0,""]
[21,{"$f":"'Wettkampf 1'!B36","v":"Runde Marcel"},{"$f":"'Wettkampf 1'!C36","v":"Spahnharrenstätte"},336.5,null,336.5,0,0,0,0,0,0,0,0,336.5,1,0,0,0,0,0,0,0,0,0,0,0,0,0,0,{"$nulls":5},{"v":0,"d":"0.0"},0,0,""]
[22,{"$f":"'Wettkampf 1'!B37","v":"Leis Fynn Lucas "},{"$f":"'Wettkampf 1'!C37","v":"Spahnharrenstätte"},null,null,{"v":0,"d":"0.0"},0,0,0,0,0,0,0,0,0,1,0,0,0,0,0,0,0,0,0,0,0,0,0,0,{"$nulls":5},{"v":0,"d":"0.0"},1,0,""]
[23,{"$f":"'Wettkampf 1'!B38","v":"Jansen Lars"},{"$f":"'Wettkampf 1'!C38","v":"Spahnharrenstätte"},null,null,{"v":0,"d":"0.0"},0,0,0,0,0,0,0,0,0,1,0,0,0,0,0,0,0,0,0,0,0,0,0,0,{"$nulls":5},{"v":0,"d":"0.0"},1,0,""]
[24,{"$f":"'Wettkampf 1'!B39","v":"Köster Thilo"},{"$f":"'Wettkampf 1'!C39","v":"Spahnharrenstätte"},null,null,{"v":0,"d":"0.0"},0,0,0,0,0,0,0,0,0,1,0,0,0,0,0,0,0,0,0,0,0,0,0,0,{"$nulls":5},{"v":0,"d":"0.0"},1,0,""]
[25,{"$f":"'Wettkampf 1'!B40","v":"Schütze 25"},{"$f":"'Wettkampf 1'!C40","v":"Spahnharrenstätte"},null,null,{"v":0,"d":"0.0"},0,0,0,0,0,0,0,0,0,1,0,0,0,0,0,0,0,0,0,0,0,0,0,0,{"$nulls":5},{"v":0,"d":"0.0"},1,0,""]
[26,{"$f":"'Wettkampf 1'!B41","v":"Dolling Leon"},{"$f":"'Wettkampf 1'!C41","v":"Lorup"},null,null,{"v":0,"d":"0.0"},0,0,0,0,0,0,0,0,0,0,0,1,0,0,0,0,0,0,0,0,0,0,0,0,{"$nulls":5},{"v":0,"d":"0.0"},1,0,""]
[27,{"$f":"'Wettkampf 1'!B42","v":"Schütze 27"},{"$f":"'Wettkampf 1'!C42","v":"Lorup"},null,null,{"v":0,"d":"0.0"},0,0,0,0,0,0,0,0,0,0,0,1,0,0,0,0,0,0,0,0,0,0,0,0,{"$nulls":5},{"v":0,"d":"0.0"},1,0,""]
[28,{"$f":"'Wettkampf 1'!B43","v":"Schütze 28"},{"$f":"'Wettkampf 1'!C43","v":"Lorup"},null,null,{"v":0,"d":"0.0"},0,0,0,0,0,0,0,0,0,0,0,1,0,0,0,0,0,0,0,0,0,0,0,0,{"$nulls":5},{"v":0,"d":"0.0"},1,0,""]
[29,{"$f":"'Wettkampf 1'!B44","v":"Schütze 29"},{"$f":"'Wettkampf 1'!C44","v":"Lorup"},null,null,{"v":0,"d":"0.0"},0,0,0,0,0,0,0,0,0,0,0,1,0,0,0,0,0,0,0,0,0,0,0,0,{"$nulls":5},{"v":0,"d":"0.0"},1,0,""]
[30,{"$f":"'Wettkampf 1'!B45","v":"Schütze 30"},{"$f":"'Wettkampf 1'!C45","v":"Lorup"},null,null,{"v":0,"d":"0.0"},0,0,0,0,0,0,0,0,0,0,0,1,0,0,0,0,0,0,0,0,0,0,0,0,{"$nulls":5},{"v":0,"d":"0.0"},1,0,""]
[31,{"$f":"'Wettkampf 1'!B46","v":"Wilken Noah"},{"$f":"'Wettkampf 1'!C46","v":"Lahn"},287.6,null,287.6,0,0,0,0,0,0,0,0,0,0,0,0,287.6,1,0,0,0,0,0,0,0,0,0,0,{"$nulls":5},{"v":0,"d":"0.0"},0,0,""]
[32,{"$f":"'Wettkampf 1'!B47","v":"Schulz Mika"},{"$f":"'Wettkampf 1'!C47","v":"Lahn"},203.4,null,203.4,0,0,0,0,0,0,0,0,0,0,0,0,203.4,1,0,0,0,0,0,0,0,0,0,0,{"$nulls":5},{"v":0,"d":"0.0"},0,0,""]
[33,{"$f":"'Wettkampf 1'!B48","v":"Schütze 33"},{"$f":"'Wettkampf 1'!C48","v":"Lahn"},null,null,{"v":0,"d":"0.0"},0,0,0,0,0,0,0,0,0,0,0,0,0,1,0,0,0,0,0,0,0,0,0,0,{"$nulls":5},{"v":0,"d":"0.0"},1,0,""]
[34,{"$f":"'Wettkampf 1'!B49","v":"Schütze 34"},{"$f":"'Wettkampf 1'!C49","v":"Lahn"},null,null,{"v":0,"d":"0.0"},0,0,0,0,0,0,0,0,0,0,0,0,0,1,0,0,0,0,0,0,0,0,0,0,{"$nulls":5},{"v":0,"d":"0.0"},1,0,""]
[35,{"$f":"'Wettkampf 1'!B50","v":"Schütze 35"},{"$f":"'Wettkampf 1'!C50","v":"Lahn"},null,null,{"v":0,"d":"0.0"},0,0,0,0,0,0,0,0,0,0,0,0,0,1,0,0,0,0,0,0,0,0,0,0,{"$nulls":5},{"v":0,"d":"0.0"},1,0,""]
[36,{"$f":"'Wettkampf 1'!B51","v":"Tharner Kim"},{"$f":"'Wettkampf 1'!C51","v":"Sögel"},null,null,{"v":0,"d":"0.0"},0,0,0,0,0,0,0,0,0,0,0,0,0,0,0,1,0,0,0,0,0,0,0,0,{"$nulls":5},{"v":0,"d":"0.0"},1,0,""]
[37,{"$f":"'Wettkampf 1'!B52","v":"Schütze 37"},{"$f":"'Wettkampf 1'!C52","v":"Sögel"},null,null,{"v":0,"d":"0.0"},0,0,0,0,0,0,0,0,0,0,0,0,0,0,0,1,0,0,0,0,0,0,0,0,{"$nulls":5},{"v":0,"d":"0.0"}]
[38,{"$f":"'Wettkampf 1'!B53","v":"Schütze 38"},{"$f":"'Wettkampf 1'!C53","v":"Sögel"},null,null,{"v":0,"d":"0.0"},0,0,0,0,0,0,0,0,0,0,0,0,0,0,0,1,0,0,0,0,0,0,0,0,{"$nulls":5},{"v":0,"d":"0.0"}]
[39,{"$f":"'Wettkampf 1'!B54","v":"Schütze 39"},{"$f":"'Wettkampf 1'!C54","v":"Sögel"},null,null,{"v":0,"d":"0.0"},0,0,0,0,0,0,0,0,0,0,0,0,{"$f":"IF($C54=$B$8,$F54,0)","v":0},{"$f":"(IF(AND($E54=\"\",$C54=$B$8),1,0))","v":0},{"$f":"IF($C54=$B$9,$F54,0)","v":0},{"$f":"(IF(AND($E54=\"\",$C54=$B$9),1,0))","v":1},{"$f":"IF($C54=$B$10,$F54,0)","v":0},{"$f":"(IF(AND($E54=\"\",$C54=$B$10),1,0))","v":0},{"$f":"IF($C54=$B$11,$F54,0)","v":0},{"$f":"(IF(AND($E54=\"\",$C54=$B$11),1,0))","v":0},{"$f":"IF($C54=$B$12,$F54,0)","v":0},{"$f":"(IF(AND($E54=\"\",$C54=$B$12),1,0))","v":0},{"$f":"IF($C54=$B$13,$F54,0)","v":0},{"$f":"(IF(AND($E54=\"\",$C54=$B$13),1,0))","v":0},{"$nulls":5},{"v":0,"d":"0.0"}]
[40,{"$f":"'Wettkampf 1'!B55","v":"Schütze 40"},{"$f":"'Wettkampf 1'!C55","v":"Sögel"},null,null,{"v":0,"d":"0.0"},0,0,0,0,0,0,0,0,0,0,0,0,0,0,0,1,0,0,0,0,0,0,0,0,{"$nulls":5},{"v":0,"d":"0.0"}]
[41,{"$f":"'Wettkampf 1'!B56","v":"Schütze 41"},{"$f":"'Wettkampf 1'!C56","v":"Verein IX"},null,null,{"v":0,"d":"0.0"},0,0,0,0,0,0,0,0,0,0,0,0,0,0,0,0,0,1,0,0,0,0,0,0,{"$nulls":5},{"v":0,"d":"0.0"}]
[42,{"$f":"'Wettkampf 1'!B57","v":"Schütze 42"},{"$f":"'Wettkampf 1'!C57","v":"Verein IX"},null,null,{"v":0,"d":"0.0"},0,0,0,0,0,0,0,0,0,0,0,0,0,0,0,0,0,1,0,0,0,0,0,0,{"$nulls":5},{"v":0,"d":"0.0"}]
[43,{"$f":"'Wettkampf 1'!B58","v":"Schütze 43"},{"$f":"'Wettkampf 1'!C58","v":"Verein IX"},null,null,{"v":0,"d":"0.0"},0,0,0,0,0,0,0,0,0,0,0,0,0,0,0,0,0,1,0,0,0,0,0,0,{"$nulls":5},{"v":0,"d":"0.0"}]
[44,{"$f":"'Wettkampf 1'!B59","v":"Schütze 44"},{"$f":"'Wettkampf 1'!C59","v":"Verein IX"},null,null,{"v":0,"d":"0.0"},0,0,0,0,0,0,0,0,0,0,0,0,0,0,0,0,0,1,0,0,0,0,0,0,{"$nulls":5},{"v":0,"d":"0.0"}]
[45,{"$f":"'Wettkampf 1'!B60","v":"Schütze 45"},{"$f":"'Wettkampf 1'!C60","v":"Verein IX"},null,null,{"v":0,"d":"0.0"},0,0,0,0,0,0,0,0,0,0,0,0,0,0,0,0,0,1,0,0,0,0,0,0,{"$nulls":5},{"v":0,"d":"0.0"}]
[46,{"$f":"'Wettkampf 1'!B61","v":"Schütze 46"},{"$f":"'Wettkampf 1'!C61","v":"Verein X"},null,null,{"v":0,"d":"0.0"},0,0,0,0,0,0,0,0,0,0,0,0,0,0,0,0,0,0,0,1,0,0,0,0,{"$nulls":5},{"v":0,"d":"0.0"}]
[47,{"$f":"'Wettkampf 1'!B62","v":"Schütze 47"},{"$f":"'Wettkampf 1'!C62","v":"Verein X"},null,null,{"v":0,"d":"0.0"},0,0,0,0,0,0,0,0,0,0,0,0,0,0,0,0,0,0,0,1,0,0,0,0,{"$nulls":5},{"v":0,"d":"0.0"}]
[48,{"$f":"'Wettkampf 1'!B63","v":"Schütze 48"},{"$f":"'Wettkampf 1'!C63","v":"Verein X"},null,null,{"v":0,"d":"0.0"},0,0,0,0,0,0,0,0,0,0,0,0,0,0,0,0,0,0,0,1,0,0,0,0,{"$nulls":5},{"v":0,"d":"0.0"}]
[49,{"$f":"'Wettkampf 1'!B64","v":"Schütze 49"},{"$f":"'Wettkampf 1'!C64","v":"Verein X"},null,null,{"v":0,"d":"0.0"},0,0,0,0,0,0,0,0,0,0,0,0,0,0,0,0,0,0,0,1,0,0,0,0,{"$nulls":5},{"v":0,"d":"0.0"}]
[50,{"$f":"'Wettkampf 1'!B65","v":"Schütze 50"},{"$f":"'Wettkampf 1'!C65","v":"Verein X"},null,null,{"v":0,"d":"0.0"},0,0,0,0,0,0,0,0,0,0,0,0,0,0,0,0,0,0,0,1,0,0,0,0,{"$nulls":5},{"v":0,"d":"0.0"}]
[51,{"$f":"'Wettkampf 1'!B66","v":"Schütze 51"},{"$f":"'Wettkampf 1'!C66","v":"Verein XI"},null,null,{"v":0,"d":"0.0"},0,0,0,0,0,0,0,0,0,0,0,0,0,0,0,0,0,0,0,0,0,1,0,0,{"$nulls":5},{"v":0,"d":"0.0"}]
[52,{"$f":"'Wettkampf 1'!B67","v":"Schütze 52"},{"$f":"'Wettkampf 1'!C67","v":"Verein XI"},null,null,{"v":0,"d":"0.0"},0,0,0,0,0,0,0,0,0,0,0,0,0,0,0,0,0,0,0,0,0,1,0,0,{"$nulls":5},{"v":0,"d":"0.0"}]
[53,{"$f":"'Wettkampf 1'!B68","v":"Schütze 53"},{"$f":"'Wettkampf 1'!C68","v":"Verein XI"},null,null,{"v":0,"d":"0.0"},0,0,0,0,0,0,0,0,0,0,0,0,0,0,0,0,0,0,0,0,0,1,0,0,{"$nulls":5},{"v":0,"d":"0.0"}]
[54,{"$f":"'Wettkampf 1'!B69","v":"Schütze 54"},{"$f":"'Wettkampf 1'!C69","v":"Verein XI"},null,null,{"v":0,"d":"0.0"},0,0,0,0,0,0,0,0,0,0,0,0,0,0,0,0,0,0,0,0,0,1,0,0,{"$nulls":5},{"v":0,"d":"0.0"}]
[55,{"$f":"'Wettkampf 1'!B70","v":"Schütze 55"},{"$f":"'Wettkampf 1'!C70","v":"Verein XI"},null,null,{"v":0,"d":"0.0"},0,0,0,0,0,0,0,0,0,0,0,0,0,0,0,0,0,0,0,0,0,1,0,0,{"$nulls":5},{"v":0,"d":"0.0"}]
[56,{"$f":"'Wettkampf 1'!B71","v":"Schütze 56"},{"$f":"'Wettkampf 1'!C71","v":"Verein XII"},null,null,{"v":0,"d":"0.0"},0,0,0,0,0,0,0,0,0,0,0,0,0,0,0,0,0,0,0,0,0,0,0,1,{"$nulls":5},{"v":0,"d":"0.0"}]
[57,{"$f":"'Wettkampf 1'!B72","v":"Schütze 57"},{"$f":"'Wettkampf 1'!C72","v":"Verein XII"},null,null,{"v":0,"d":"0.0"},0,0,0,0,0,0,0,0,0,0,0,0,0,0,0,0,0,0,0,0,0,0,0,1,{"$nulls":5},{"v":0,"d":"0.0"}]
[58,{"$f":"'Wettkampf 1'!B73","v":"Schütze 58"},{"$f":"'Wettkampf 1'!C73","v":"Verein XII"},null,null,{"v":0,"d":"0.0"},0,0,0,0,0,0,0,0,0,0,0,0,0,0,0,0,0,0,0,0,0,0,0,1,{"$nulls":5},{"v":0,"d":"0.0"}]
[59,{"$f":"'Wettkampf 1'!B74","v":"Schütze 59"},{"$f":"'Wettkampf 1'!C74","v":"Verein XII"},null,null,{"v":0,"d":"0.0"},0,0,0,0,0,0,0,0,0,0,0,0,0,0,0,0,0,0,0,0,0,0,0,1,{"$nulls":5},{"v":0,"d":"0.0"}]
[60,{"$f":"'Wettkampf 1'!B75","v":"Schütze 60"},{"$f":"'Wettkampf 1'!C75","v":"Verein XII"},null,null,{"v":0,"d":"0.0"},0,0,0,0,0,0,0,0,0,0,0,0,0,0,0,0,0,0,0,0,0,0,0,1,{"$nulls":5},{"v":0,"d":"0.0"}]
[{"$nulls":6},{"$f":"LARGE(G16:G75,1)+LARGE(G16:G75,2)+LARGE(G16:G75,3)","v":0},{"$f":"SUM(H16:H75)","v":5},{"$f":"LARGE(I16:I75,1)+LARGE(I16:I75,2)+LARGE(I16:I75,3)","v":1134.1999999999998},{"$f":"SUM(J16:J75)","v":5},{"$f":"LARGE(K16:K75,1)+LARGE(K16:K75,2)+LARGE(K16:K75,3)","v":0},{"$f":"SUM(L16:L75)","v":5},{"$f":"LARGE(M16:M75,1)+LARGE(M16:M75,2)+LARGE(M16:M75,3)","v":1010},{"$f":"SUM(N16:N75)","v":5},{"$f":"LARGE(O16:O75,1)+LARGE(O16:O75,2)+LARGE(O16:O75,3)","v":336.5},{"$f":"SUM(P16:P75)","v":5},{"$f":"LARGE(Q16:Q75,1)+LARGE(Q16:Q75,2)+LARGE(Q16:Q75,3)","v":0},{"$f":"SUM(R16:R75)","v":5},{"$f":"LARGE(S16:S75,1)+LARGE(S16:S75,2)+LARGE(S16:S75,3)","v":491},{"$f":"SUM(T16:T75)","v":5},{"$f":"LARGE(U16:U75,1)+LARGE(U16:U75,2)+LARGE(U16:U75,3)","v":0},{"$f":"SUM(V16:V75)","v":5},{"$f":"LARGE(W16:W75,1)+LARGE(W16:W75,2)+LARGE(W16:W75,3)","v":0},{"$f":"SUM(X16:X75)","v":5},{"$f":"LARGE(Y16:Y75,1)+LARGE(Y16:Y75,2)+LARGE(Y16:Y75,3)","v":0},{"$f":"SUM(Z16:Z75)","v":5},{"$f":"LARGE(AA16:AA75,1)+LARGE(AA16:AA75,2)+LARGE(AA16:AA75,3)","v":0},{"$f":"SUM(AB16:AB75)","v":5},{"$f":"LARGE(AC16:AC75,1)+LARGE(AC16:AC75,2)+LARGE(AC16:AC75,3)","v":0},{"$f":"SUM(AD16:AD75)","v":5}]
[null,null,"per Email an: sk-huemmling@gmx.de"]

{"sheet":"9","index":9,"n_rows":77,"n_cols":39,"rows_kept":77,"merged":[[0,34,0,35],[1,34,1,35],[4,34,4,35],[5,34,5,35],[6,34,6,35],[14,32,14,35]]}
[null,"Verein / Gruppe",null,"Ergebnisse",{"$nulls":29},"Austragungsort:",{"$f":"Übersicht!N4","v":"Esterwegen"}]
[1,{"$f":"'Wettkampf 1'!B2","v":"Esterwegen"},null,{"$f":"G76","v":{"v":0,"d":"0.0"}},{"$f":"IF(H76>4,\"Es sind zu viele Schützen in Wertung!\",\" \")","v":"Es sind zu viele Schützen in Wertung!"},{"$nulls":28},"Wettkampftag:",{"$f":"Übersicht!N3","v":"22.02."}]
[2,{"$f":"'Wettkampf 1'!B3","v":"Lähden Jugend I"},null,{"$f":"I76","v":{"v":0,"d":"0.0"}},{"$f":"IF(J76>4,\"Es sind zu viele Schützen in Wertung!\",\" \")","v":"Es sind zu viele Schützen in Wertung!"}]
[3,{"$f":"'Wettkampf 1'!B4","v":"Börgerwald"},null,{"$f":"K76","v":{"v":0,"d":"0.0"}},{"$f":"IF(L76>4,\"Es sind zu viele Schützen in Wertung!\",\" \")","v":"Es sind zu viele Schützen in Wertung!"},{"$nulls":30},"Ansprechpartner für Rückfragen:"]
[4,{"$f":"'Wettkampf 1'!B5","v":"Börgermoor"},null,{"$f":"M76","v":{"v":0,"d":"0.0"}},{"$f":"IF(N76>4,\"Es sind zu viele Schützen in Wertung!\",\" \")","v":"Es sind zu viele Schützen in Wertung!"},{"$nulls":28},"Name:"]
[5,{"$f":"'Wettkampf 1'!B6","v":"Spahnharrenstätte"},null,{"$f":"O76","v":{"v":0,"d":"0.0"}},{"$f":"IF(P76>4,\"Es sind zu viele Schützen in Wertung!\",\" \")","v":"Es sind zu viele Schützen in Wertung!"},{"$nulls":28},"Tel:"]
[6,{"$f":"'Wettkampf 1'!B7","v":"Lorup"},null,{"$f":"Q76","v":{"v":0,"d":"0.0"}},{"$f":"IF(R76>4,\"Es sind zu viele Schützen in Wertung!\",\" \")","v":"Es sind zu viele Schützen in Wertung!"},{"$nulls":28},"Standaufsicht:","eintragen"]
[7,{"$f":"'Wettkampf 1'!B8","v":"Lahn"},null,{"$f":"S76","v":{"v":0,"d":"0.0"}},{"$f":"IF(T76>4,\"Es sind zu viele Schützen in Wertung!\",\" \")","v":"Es sind zu viele Schützen in Wertung!"}]
[8,{"$f":"'Wettkampf 1'!B9","v":"Sögel"},null,{"$f":"U76","v":{"v":0,"d":"0.0"}},{"$f":"IF(V76>4,\"Es sind zu viele Schützen in Wertung!\",\" \")","v":"Es sind zu viele Schützen in Wertung!"}]
[9,{"$f":"'Wettkampf 1'!B10","v":"Verein IX"},null,{"$f":"W76","v":{"v":0,"d":"0.0"}},{"$f":"IF(X76>4,\"Es sind zu viele Schützen in Wertung!\",\" \")","v":"Es sind zu viele Schützen in Wertung!"}]
[10,{"$f":"'Wettkampf 1'!B11","v":"Verein X"},null,{"$f":"Y76","v":{"v":0,"d":"0.0"}},{"$f":"IF(Z76>4,\"Es sind zu viele Schützen in Wertung!\",\" \")","v":"Es sind zu viele Schützen in Wertung!"}]
[11,{"$f":"'Wettkampf 1'!B12","v":"Verein XI"},null,{"$f":"AA76","v":{"v":0,"d":"0.0"}},{"$f":"IF(AB76>4,\"Es sind zu viele Schützen in Wertung!\",\" \")","v":"Es sind zu viele Schützen in Wertung!"}]
[12,{"$f":"'Wettkampf 1'!B13","v":"Verein XII"},null,{"$f":"AC76","v":{"v":0,"d":"0.0"}},{"$f":"IF(AD76>4,\"Es sind zu viele Schützen in Wertung!\",\" \")","v":"Es sind zu viele Schützen in Wertung!"}]
[]
[null,"Einzelergebnisse:","Verein / Gruppe","Ergebnisse (mindestens 0 eintragen)","AW? Dann x eintippen",null,"Verein 1",null,"Verein 2",null,"Verein 3",null,"Verein 4",null,"Verein 5",null,"Verein 6",null,"Verein 7",null,"Verein 8",null,"Verein 9",null,"Verein 10",null,"Verein 11",null,"Verein 12",{"$nulls":3},"Proberechnung bei Streifen:"]
[1,{"$f":"'Wettkampf 1'!B16","v":"Gedecksnis Stefan"},{"$f":"'Wettkampf 1'!C16","v":"Esterwegen"},null,null,{"$f":"IF(E16=\"x\",\"0\",D16)","v":{"v":0,"d":"0.0"}},{"$f":"IF(C16=$B$2,F16,0)","v":0},{"$f":"(IF(AND($E16=\"\",$C16=$B$2),1,0))","v":1},{"$f":"IF($C16=$B$3,$F16,0)","v":0},{"$f":"(IF(AND($E16=\"\",$C16=$B$3),1,0))","v":0},{"$f":"IF($C16=$B$4,F16,0)","v":0},{"$f":"(IF(AND($E16=\"\",$C16=$B$4),1,0))","v":0},{"$f":"IF($C16=$B$5,F16,0)","v":0},{"$f":"(IF(AND($E16=\"\",$C16=$B$5),1,0))","v":0},{"$f":"IF($C16=$B$6,F16,0)","v":0},{"$f":"(IF(AND($E16=\"\",$C16=$B$6),1,0))","v":0},{"$f":"IF($C16=$B$7,F16,0)","v":0},{"$f":"(IF(AND($E16=\"\",$C16=$B$7),1,0))","v":0},{"$f":"IF($C16=$B$8,$F16,0)","v":0},{"$f":"(IF(AND($E16=\"\",$C16=$B$8),1,0))","v":0},{"$f":"IF($C16=$B$9,$F16,0)","v":0},{"$f":"(IF(AND($E16=\"\",$C16=$B$9),1,0))","v":0},{"$f":"IF($C16=$B$10,$F16,0)","v":0},{"$f":"(IF(AND($E16=\"\",$C16=$B$10),1,0))","v":0},{"$f":"IF($C16=$B$11,$F16,0)","v":0},{"$f":"(IF(AND($E16=\"\",$C16=$B$11),1,0))","v":0},{"$f":"IF($C16=$B$12,$F16,0)","v":0},{"$f":"(IF(AND($E16=\"\",$C16=$B$12),1,0))","v":0},{"$f":"IF($C16=$B$13,$F16,0)","v":0},{"$f":"(IF(AND($E16=\"\",$C16=$B$13),1,0))","v":0},{"$nulls":5},{"$f":"SUM(AG16:AI16)","v":{"v":0,"d":"0.0"}},{"$f":"IF(AJ16=D16,1,0)","v":1},{"$f":"IF(AJ16=0,0,1)","v":0},{"$f":"IF(AK16+AL16=2,\"Korrekt\",\"\")","v":""}]
[2,{"$f":"'Wettkampf 1'!B17","v":"Wübben Jasper"},{"$f":"'Wettkampf 1'!C17","v":"Esterwegen"},null,null,{"$f":"IF(E17=\"x\",\"0\",D17)","v":{"v":0,"d":"0.0"}},{"$f":"IF(C17=$B$2,F17,0)","v":0},{"$f":"(IF(AND($E17=\"\",$C17=$B$2),1,0))","v":1},{"$f":"IF($C17=$B$3,F17,0)","v":0},{"$f":"(IF(AND($E17=\"\",$C17=$B$3),1,0))","v":0},{"$f":"IF($C17=$B$4,F17,0)","v":0},{"$f":"(IF(AND($E17=\"\",$C17=$B$4),1,0))","v":0},{"$f":"IF($C17=$B$5,F17,0)","v":0},{"$f":"(IF(AND($E17=\"\",$C17=$B$5),1,0))","v":0},{"$f":"IF($C17=$B$6,F17,0)","v":0},{"$f":"(IF(AND($E17=\"\",$C17=$B$6),1,0))","v":0},{"$f":"IF($C17=$B$7,F17,0)","v":0},{"$f":"(IF(AND($E17=\"\",$C17=$B$7),1,0))","v":0},{"$f":"IF($C17=$B$8,$F17,0)","v":0},{"$f":"(IF(AND($E17=\"\",$C17=$B$8),1,0))","v":0},{"$f":"IF($C17=$B$9,$F17,0)","v":0},{"$f":"(IF(AND($E17=\"\",$C17=$B$9),1,0))","v":0},{"$f":"IF($C17=$B$10,$F17,0)","v":0},{"$f":"(IF(AND($E17=\"\",$C17=$B$10),1,0))","v":0},{"$f":"IF($C17=$B$11,$F17,0)","v":0},{"$f":"(IF(AND($E17=\"\",$C17=$B$11),1,0))","v":0},{"$f":"IF($C17=$B$12,$F17,0)","v":0},{"$f":"(IF(AND($E17=\"\",$C17=$B$12),1,0))","v":0},{"$f":"IF($C17=$B$13,$F17,0)","v":0},{"$f":"(IF(AND($E17=\"\",$C17=$B$13),1,0))","v":0},{"$nulls":5},{"$f":"SUM(AG17:AI17)","v":{"v":0,"d":"0.0"}},{"$f":"IF(AJ17=D17,1,0)","v":1},{"$f":"IF(AJ17=0,0,1)","v":0},{"$f":"IF(AK17+AL17=2,\"Korrekt\",\"\")","v":""}]
[3,{"$f":"'Wettkampf 1'!B18","v":"Engbers Julian"},{"$f":"'Wettkampf 1'!C18","v":"Esterwegen"},null,null,{"v":0,"d":"0.0"},0,1,0,0,0,0,0,0,0,0,0,0,0,0,0,0,0,0,0,0,0,0,0,0,{"$nulls":5},{"v":0,"d":"0.0"},1,0,""]
[4,{"$f":"'Wettkampf 1'!B19","v":"Meyer Johan"},{"$f":"'Wettkampf 1'!C19","v":"Esterwegen"},null,null,{"v":0,"d":"0.0"},0,1,0,0,0,0,0,0,0,0,0,0,0,0,0,0,0,0,0,0,0,0,0,0,{"$nulls":5},{"v":0,"d":"0.0"},1,0,""]
[5,{"$f":"'Wettkampf 1'!B20","v":"Schütze 5"},{"$f":"'Wettkampf 1'!C20","v":"Esterwegen"},null,null,{"v":0,"d":"0.0"},0,1,0,0,0,0,0,0,0,0,0,0,0,0,0,0,0,0,0,0,0,0,0,0,{"$nulls":5},{"v":0,"d":"0.0"},1,0,""]
[6,{"$f":"'Wettkampf 1'!B21","v":"Strüwing Inja"},{"$f":"'Wettkampf 1'!C21","v":"Lähden Jugend I"},null,null,{"v":0,"d":"0.0"},0,0,0,1,0,0,0,0,0,0,0,0,0,0,0,0,0,0,0,0,0,0,0,0,{"$nulls":5},{"v":0,"d":"0.0"},1,0,""]
[7,{"$f":"'Wettkampf 1'!B22","v":"Bruns Hendrik"},{"$f":"'Wettkampf 1'!C22","v":"Lähden Jugend I"},null,null,{"v":0,"d":"0.0"},0,0,0,1,0,0,0,0,0,0,0,0,0,0,0,0,0,0,0,0,0,0,0,0,{"$nulls":5},{"v":0,"d":"0.0"},1,0,""]
[8,{"$f":"'Wettkampf 1'!B23","v":"Feldhaus Vanessa"},{"$f":"'Wettkampf 1'!C23","v":"Lähden Jugend I"},null,null,{"v":0,"d":"0.0"},0,0,0,1,0,0,0,0,0,0,0,0,0,0,0,0,0,0,0,0,0,0,0,0,{"$nulls":5},{"v":0,"d":"0.0"},1,0,""]
[9,{"$f":"'Wettkampf 1'!B24","v":"Feldhaus Celien "},{"$f":"'Wettkampf 1'!C24","v":"Lähden Jugend I"},null,null,{"v":0,"d":"0.0"},0,0,0,1,0,0,0,0,0,0,0,0,0,0,0,0,0,0,0,0,0,0,0,0,{"$nulls":5},{"v":0,"d":"0.0"},1,0,""]
[10,{"$f":"'Wettkampf 1'!B25","v":"Stümpler Jan-Luca"},{"$f":"'Wettkampf 1'!C25","v":"Lähden Jugend I"},null,null,{"v":0,"d":"0.0"},0,0,0,1,0,0,0,0,0,0,0,0,0,0,0,0,0,0,0,0,0,0,0,0,{"$nulls":5},{"v":0,"d":"0.0"},1,0,""]
[11,{"$f":"'Wettkampf 1'!B26","v":"Hanneken Maren"},{"$f":"'Wettkampf 1'!C26","v":"Börgerwald"},null,null,{"v":0,"d":"0.0"},0,0,0,0,0,1,0,0,0,0,0,0,0,0,0,0,0,0,0,0,0,0,0,0,{"$nulls":5},{"v":0,"d":"0.0"},1,0,""]
[12,{"$f":"'Wettkampf 1'!B27","v":"Köstering Nele"},{"$f":"'Wettkampf 1'!C27","v":"Börgerwald"},null,null,{"v":0,"d":"0.0"},0,0,0,0,0,1,0,0,0,0,0,0,0,0,0,0,0,0,0,0,0,0,0,0,{"$nulls":5},{"v":0,"d":"0.0"},1,0,""]
[13,{"$f":"'Wettkampf 1'!B28","v":"Lohmann Amy"},{"$f":"'Wettkampf 1'!C28","v":"Börgerwald"},null,null,{"v":0,"d":"0.0"},0,0,0,0,0,1,0,0,0,0,0,0,0,0,0,0,0,0,0,0,0,0,0,0,{"$nulls":5},{"v":0,"d":"0.0"},1,0,""]
[14,{"$f":"'Wettkampf 1'!B29","v":"Schütze 14"},{"$f":"'Wettkampf 1'!C29","v":"Börgerwald"},null,null,{"v":0,"d":"0.0"},0,0,0,0,0,1,0,0,0,0,0,0,0,0,0,0,0,0,0,0,0,0,0,0,{"$nulls":5},{"v":0,"d":"0.0"},1,0,""]
[15,{"$f":"'Wettkampf 1'!B30","v":"Schütze 15"},{"$f":"'Wettkampf 1'!C30","v":"Börgerwald"},null,null,{"v":0,"d":"0.0"},0,0,0,0,0,1,0,0,0,0,0,0,0,0,0,0,0,0,0,0,0,0,0,0,{"$nulls":5},{"v":0,"d":"0.0"},1,0,""]
[16,{"$f":"'Wettkampf 1'!B31","v":"Brandt Mira"},{"$f":"'Wettkampf 1'!C31","v":"Börgermoor"},null,null,{"v":0,"d":"0.0"},0,0,0,0,0,0,0,1,0,0,0,0,0,0,0,0,0,0,0,0,0,0,0,0,{"$nulls":5},{"v":0,"d":"0.0"},1,0,""]
[17,{"$f":"'Wettkampf 1'!B32","v":"Eichhorn Luca"},{"$f":"'Wettkampf 1'!C32","v":"Börgermoor"},null,null,{"v":0,"d":"0.0"},0,0,0,0,0,0,0,1,0,0,0,0,0,0,0,0,0,0,0,0,0,0,0,0,{"$nulls":5},{"v":0,"d":"0.0"},1,0,""]
[18,{"$f":"'Wettkampf 1'!B33","v":"Kohnen Saskia"},{"$f":"'Wettkampf 1'!C33","v":"Börgermoor"},null,null,{"v":0,"d":"0.0"},0,0,0,0,0,0,0,1,0,0,0,0,0,0,0,0,0,0,0,0,0,0,0,0,{"$nulls":5},{"v":0,"d":"0.0"},1,0,""]
[19,{"$f":"'Wettkampf 1'!B34","v":"Schütze 19"},{"$f":"'Wettkampf 1'!C34","v":"Börgermoor"},null,null,{"v":0,"d":"0.0"},0,0,0,0,0,0,0,1,0,0,0,0,0,0,0,0,0,0,0,0,0,0,0,0,{"$nulls":5},{"v":0,"d":"0.0"},1,0,""]
[20,{"$f":"'Wettkampf 1'!B35","v":"Schütze 20"},{"$f":"'Wettkampf 1'!C35","v":"Börgermoor"},null,null,{"v":0,"d":"0.0"},0,0,0,0,0,0,0,1,0,0,0,0,0,0,0,0,0,0,0,0,0,0,0,0,{"$nulls":5},{"v":0,"d":"0.0"},1,0,""]
[21,{"$f":"'Wettkampf 1'!B36","v":"Runde Marcel"},{"$f":"'Wettkampf 1'!C36","v":"Spahnharrenstätte"},null,null,{"v":0,"d":"0.0"},0,0,0,0,0,0,0,0,0,1,0,0,0,0,0,0,0,0,0,0,0,0,0,0,{"$nulls":5},{"v":0,"d":"0.0"},1,0,""]
[22,{"$f":"'Wettkampf 1'!B37","v":"Leis Fynn Lucas "},{"$f":"'Wettkampf 1'!C37","v":"Spahnharrenstätte"},null,null,{"v":0,"d":"0.0"},0,0,0,0,0,0,0,0,0,1,0,0,0,0,0,0,0,0,0,0,0,0,0,0,{"$nulls":5},{"v":0,"d":"0.0"},1,0,""]
[23,{"$f":"'Wettkampf 1'!B38","v":"Jansen Lars"},{"$f":"'Wettkampf 1'!C38","v":"Spahnharrenstätte"},null,null,{"v":0,"d":"0.0"},0,0,0,0,0,0,0,0,0,1,0,0,0,0,0,0,0,0,0,0,0,0,0,0,{"$nulls":5},{"v":0,"d":"0.0"},1,0,""]
[24,{"$f":"'Wettkampf 1'!B39","v":"Köster Thilo"},{"$f":"'Wettkampf 1'!C39","v":"Spahnharrenstätte"},null,null,{"v":0,"d":"0.0"},0,0,0,0,0,0,0,0,0,1,0,0,0,0,0,0,0,0,0,0,0,0,0,0,{"$nulls":5},{"v":0,"d":"0.0"},1,0,""]
[25,{"$f":"'Wettkampf 1'!B40","v":"Schütze 25"},{"$f":"'Wettkampf 1'!C40","v":"Spahnharrenstätte"},null,null,{"v":0,"d":"0.0"},0,0,0,0,0,0,0,0,0,1,0,0,0,0,0,0,0,0,0,0,0,0,0,0,{"$nulls":5},{"v":0,"d":"0.0"},1,0,""]
[26,{"$f":"'Wettkampf 1'!B41","v":"Dolling Leon"},{"$f":"'Wettkampf 1'!C41","v":"Lorup"},null,null,{"v":0,"d":"0.0"},0,0,0,0,0,0,0,0,0,0,0,1,0,0,0,0,0,0,0,0,0,0,0,0,{"$nulls":5},{"v":0,"d":"0.0"},1,0,""]
[27,{"$f":"'Wettkampf 1'!B42","v":"Schütze 27"},{"$f":"'Wettkampf 1'!C42","v":"Lorup"},null,null,{"v":0,"d":"0.0"},0,0,0,0,0,0,0,0,0,0,0,1,0,0,0,0,0,0,0,0,0,0,0,0,{"$nulls":5},{"v":0,"d":"0.0"},1,0,""]
[28,{"$f":"'Wettkampf 1'!B43","v":"Schütze 28"},{"$f":"'Wettkampf 1'!C43","v":"Lorup"},null,null,{"v":0,"d":"0.0"},0,0,0,0,0,0,0,0,0,0,0,1,0,0,0,0,0,0,0,0,0,0,0,0,{"$nulls":5},{"v":0,"d":"0.0"},1,0,""]
[29,{"$f":"'Wettkampf 1'!B44","v":"Schütze 29"},{"$f":"'Wettkampf 1'!C44","v":"Lorup"},null,null,{"v":0,"d":"0.0"},0,0,0,0,0,0,0,0,0,0,0,1,0,0,0,0,0,0,0,0,0,0,0,0,{"$nulls":5},{"v":0,"d":"0.0"},1,0,""]
[30,{"$f":"'Wettkampf 1'!B45","v":"Schütze 30"},{"$f":"'Wettkampf 1'!C45","v":"Lorup"},null,null,{"v":0,"d":"0.0"},0,0,0,0,0,0,0,0,0,0,0,1,0,0,0,0,0,0,0,0,0,0,0,0,{"$nulls":5},{"v":0,"d":"0.0"},1,0,""]
[31,{"$f":"'Wettkampf 1'!B46","v":"Wilken Noah"},{"$f":"'Wettkampf 1'!C46","v":"Lahn"},null,null,{"v":0,"d":"0.0"},0,0,0,0,0,0,0,0,0,0,0,0,0,1,0,0,0,0,0,0,0,0,0,0,{"$nulls":5},{"v":0,"d":"0.0"},1,0,""]
[32,{"$f":"'Wettkampf 1'!B47","v":"Schulz Mika"},{"$f":"'Wettkampf 1'!C47","v":"Lahn"},null,null,{"v":0,"d":"0.0"},0,0,0,0,0,0,0,0,0,0,0,0,0,1,0,0,0,0,0,0,0,0,0,0,{"$nulls":5},{"v":0,"d":"0.0"},1,0,""]
[33,{"$f":"'Wettkampf 1'!B48","v":"Schütze 33"},{"$f":"'Wettkampf 1'!C48","v":"Lahn"},null,null,{"v":0,"d":"0.0"},0,0,0,0,0,0,0,0,0,0,0,0,0,1,0,0,0,0,0,0,0,0,0,0,{"$nulls":5},{"v":0,"d":"0.0"},1,0,""]
[34,{"$f":"'Wettkampf 1'!B49","v":"Schütze 34"},{"$f":"'Wettkampf 1'!C49","v":"Lahn"},null,null,{"v":0,"d":"0.0"},0,0,0,0,0,0,0,0,0,0,0,0,0,1,0,0,0,0,0,0,0,0,0,0,{"$nulls":5},{"v":0,"d":"0.0"},1,0,""]
[35,{"$f":"'Wettkampf 1'!B50","v":"Schütze 35"},{"$f":"'Wettkampf 1'!C50","v":"Lahn"},null,null,{"v":0,"d":"0.0"},0,0,0,0,0,0,0,0,0,0,0,0,0,1,0,0,0,0,0,0,0,0,0,0,{"$nulls":5},{"v":0,"d":"0.0"},1,0,""]
[36,{"$f":"'Wettkampf 1'!B51","v":"Tharner Kim"},{"$f":"'Wettkampf 1'!C51","v":"Sögel"},null,null,{"v":0,"d":"0.0"},0,0,0,0,0,0,0,0,0,0,0,0,0,0,0,1,0,0,0,0,0,0,0,0,{"$nulls":5},{"v":0,"d":"0.0"},1,0,""]
[37,{"$f":"'Wettkampf 1'!B52","v":"Schütze 37"},{"$f":"'Wettkampf 1'!C52","v":"Sögel"},null,null,{"v":0,"d":"0.0"},0,0,0,0,0,0,0,0,0,0,0,0,0,0,0,1,0,0,0,0,0,0,0,0,{"$nulls":5},{"v":0,"d":"0.0"}]
[38,{"$f":"'Wettkampf 1'!B53","v":"Schütze 38"},{"$f":"'Wettkampf 1'!C53","v":"Sögel"},null,null,{"v":0,"d":"0.0"},0,0,0,0,0,0,0,0,0,0,0,0,0,0,0,1,0,0,0,0,0,0,0,0,{"$nulls":5},{"v":0,"d":"0.0"}]
[39,{"$f":"'Wettkampf 1'!B54","v":"Schütze 39"},{"$f":"'Wettkampf 1'!C54","v":"Sögel"},null,null,{"v":0,"d":"0.0"},0,0,0,0,0,0,0,0,0,0,0,0,{"$f":"IF($C54=$B$8,$F54,0)","v":0},{"$f":"(IF(AND($E54=\"\",$C54=$B$8),1,0))","v":0},{"$f":"IF($C54=$B$9,$F54,0)","v":0},{"$f":"(IF(AND($E54=\"\",$C54=$B$9),1,0))","v":1},{"$f":"IF($C54=$B$10,$F54,0)","v":0},{"$f":"(IF(AND($E54=\"\",$C54=$B$10),1,0))","v":0},{"$f":"IF($C54=$B$11,$F54,0)","v":0},{"$f":"(IF(AND($E54=\"\",$C54=$B$11),1,0))","v":0},{"$f":"IF($C54=$B$12,$F54,0)","v":0},{"$f":"(IF(AND($E54=\"\",$C54=$B$12),1,0))","v":0},{"$f":"IF($C54=$B$13,$F54,0)","v":0},{"$f":"(IF(AND($E54=\"\",$C54=$B$13),1,0))","v":0},{"$nulls":5},{"v":0,"d":"0.0"}]
[40,{"$f":"'Wettkampf 1'!B55","v":"Schütze 40"},{"$f":"'Wettkampf 1'!C55","v":"Sögel"},null,null,{"v":0,"d":"0.0"},0,0,0,0,0,0,0,0,0,0,0,0,0,0,0,1,0,0,0,0,0,0,0,0,{"$nulls":5},{"v":0,"d":"0.0"}]
[41,{"$f":"'Wettkampf 1'!B56","v":"Schütze 41"},{"$f":"'Wettkampf 1'!C56","v":"Verein IX"},null,null,{"v":0,"d":"0.0"},0,0,0,0,0,0,0,0,0,0,0,0,0,0,0,0,0,1,0,0,0,0,0,0,{"$nulls":5},{"v":0,"d":"0.0"}]
[42,{"$f":"'Wettkampf 1'!B57","v":"Schütze 42"},{"$f":"'Wettkampf 1'!C57","v":"Verein IX"},null,null,{"v":0,"d":"0.0"},0,0,0,0,0,0,0,0,0,0,0,0,0,0,0,0,0,1,0,0,0,0,0,0,{"$nulls":5},{"v":0,"d":"0.0"}]
[43,{"$f":"'Wettkampf 1'!B58","v":"Schütze 43"},{"$f":"'Wettkampf 1'!C58","v":"Verein IX"},null,null,{"v":0,"d":"0.0"},0,0,0,0,0,0,0,0,0,0,0,0,0,0,0,0,0,1,0,0,0,0,0,0,{"$nulls":5},{"v":0,"d":"0.0"}]
[44,{"$f":"'Wettkampf 1'!B59","v":"Schütze 44"},{"$f":"'Wettkampf 1'!C59","v":"Verein IX"},null,null,{"v":0,"d":"0.0"},0,0,0,0,0,0,0,0,0,0,0,0,0,0,0,0,0,1,0,0,0,0,0,0,{"$nulls":5},{"v":0,"d":"0.0"}]
[45,{"$f":"'Wettkampf 1'!B60","v":"Schütze 45"},{"$f":"'Wettkampf 1'!C60","v":"Verein IX"},null,null,{"v":0,"d":"0.0"},0,0,0,0,0,0,0,0,0,0,0,0,0,0,0,0,0,1,0,0,0,0,0,0,{"$nulls":5},{"v":0,"d":"0.0"}]
[46,{"$f":"'Wettkampf 1'!B61","v":"Schütze 46"},{"$f":"'Wettkampf 1'!C61","v":"Verein X"},null,null,{"v":0,"d":"0.0"},0,0,0,0,0,0,0,0,0,0,0,0,0,0,0,0,0,0,0,1,0,0,0,0,{"$nulls":5},{"v":0,"d":"0.0"}]
[47,{"$f":"'Wettkampf 1'!B62","v":"Schütze 47"},{"$f":"'Wettkampf 1'!C62","v":"Verein X"},null,null,{"v":0,"d":"0.0"},0,0,0,0,0,0,0,0,0,0,0,0,0,0,0,0,0,0,0,1,0,0,0,0,{"$nulls":5},{"v":0,"d":"0.0"}]
[48,{"$f":"'Wettkampf 1'!B63","v":"Schütze 48"},{"$f":"'Wettkampf 1'!C63","v":"Verein X"},null,null,{"v":0,"d":"0.0"},0,0,0,0,0,0,0,0,0,0,0,0,0,0,0,0,0,0,0,1,0,0,0,0,{"$nulls":5},{"v":0,"d":"0.0"}]
[49,{"$f":"'Wettkampf 1'!B64","v":"Schütze 49"},{"$f":"'Wettkampf 1'!C64","v":"Verein X"},null,null,{"v":0,"d":"0.0"},0,0,0,0,0,0,0,0,0,0,0,0,0,0,0,0,0,0,0,1,0,0,0,0,{"$nulls":5},{"v":0,"d":"0.0"}]
[50,{"$f":"'Wettkampf 1'!B65","v":"Schütze 50"},{"$f":"'Wettkampf 1'!C65","v":"Verein X"},null,null,{"v":0,"d":"0.0"},0,0,0,0,0,0,0,0,0,0,0,0,0,0,0,0,0,0,0,1,0,0,0,0,{"$nulls":5},{"v":0,"d":"0.0"}]
[51,{"$f":"'Wettkampf 1'!B66","v":"Schütze 51"},{"$f":"'Wettkampf 1'!C66","v":"Verein XI"},null,null,{"v":0,"d":"0.0"},0,0,0,0,0,0,0,0,0,0,0,0,0,0,0,0,0,0,0,0,0,1,0,0,{"$nulls":5},{"v":0,"d":"0.0"}]
[52,{"$f":"'Wettkampf 1'!B67","v":"Schütze 52"},{"$f":"'Wettkampf 1'!C67","v":"Verein XI"},null,null,{"v":0,"d":"0.0"},0,0,0,0,0,0,0,0,0,0,0,0,0,0,0,0,0,0,0,0,0,1,0,0,{"$nulls":5},{"v":0,"d":"0.0"}]
[53,{"$f":"'Wettkampf 1'!B68","v":"Schütze 53"},{"$f":"'Wettkampf 1'!C68","v":"Verein XI"},null,null,{"v":0,"d":"0.0"},0,0,0,0,0,0,0,0,0,0,0,0,0,0,0,0,0,0,0,0,0,1,0,0,{"$nulls":5},{"v":0,"d":"0.0"}]
[54,{"$f":"'Wettkampf 1'!B69","v":"Schütze 54"},{"$f":"'Wettkampf 1'!C69","v":"Verein XI"},null,null,{"v":0,"d":"0.0"},0,0,0,0,0,0,0,0,0,0,0,0,0,0,0,0,0,0,0,0,0,1,0,0,{"$nulls":5},{"v":0,"d":"0.0"}]
[55,{"$f":"'Wettkampf 1'!B70","v":"Schütze 55"},{"$f":"'Wettkampf 1'!C70","v":"Verein XI"},null,null,{"v":0,"d":"0.0"},0,0,0,0,0,0,0,0,0,0,0,0,0,0,0,0,0,0,0,0,0,1,0,0,{"$nulls":5},{"v":0,"d":"0.0"}]
[56,{"$f":"'Wettkampf 1'!B71","v":"Schütze 56"},{"$f":"'Wettkampf 1'!C71","v":"Verein XII"},null,null,{"v":0,"d":"0.0"},0,0,0,0,0,0,0,0,0,0,0,0,0,0,0,0,0,0,0,0,0,0,0,1,{"$nulls":5},{"v":0,"d":"0.0"}]
[57,{"$f":"'Wettkampf 1'!B72","v":"Schütze 57"},{"$f":"'Wettkampf 1'!C72","v":"Verein XII"},null,null,{"v":0,"d":"0.0"},0,0,0,0,0,0,0,0,0,0,0,0,0,0,0,0,0,0,0,0,0,0,0,1,{"$nulls":5},{"v":0,"d":"0.0"}]
[58,{"$f":"'Wettkampf 1'!B73","v":"Schütze 58"},{"$f":"'Wettkampf 1'!C73","v":"Verein XII"},null,null,{"v":0,"d":"0.0"},0,0,0,0,0,0,0,0,0,0,0,0,0,0,0,0,0,0,0,0,0,0,0,1,{"$nulls":5},{"v":0,"d":"0.0"}]
[59,{"$f":"'Wettkampf 1'!B74","v":"Schütze 59"},{"$f":"'Wettkampf 1'!C74","v":"Verein XII"},null,null,{"v":0,"d":"0.0"},0,0,0,0,0,0,0,0,0,0,0,0,0,0,0,0,0,0,0,0,0,0,0,1,{"$nulls":5},{"v":0,"d":"0.0"}]
[60,{"$f":"'Wettkampf 1'!B75","v":"Schütze 60"},{"$f":"'Wettkampf 1'!C75","v":"Verein XII"},null,null,{"v":0,"d":"0.0"},0,0,0,0,0,0,0,0,0,0,0,0,0,0,0,0,0,0,0,0,0,0,0,1,{"$nulls":5},{"v":0,"d":"0.0"}]
[{"$nulls":6},{"$f":"LARGE(G16:G75,1)+LARGE(G16:G75,2)+LARGE(G16:G75,3)","v":0},{"$f":"SUM(H16:H75)","v":5},{"$f":"LARGE(I16:I75,1)+LARGE(I16:I75,2)+LARGE(I16:I75,3)","v":0},{"$f":"SUM(J16:J75)","v":5},{"$f":"LARGE(K16:K75,1)+LARGE(K16:K75,2)+LARGE(K16:K75,3)","v":0},{"$f":"SUM(L16:L75)","v":5},{"$f":"LARGE(M16:M75,1)+LARGE(M16:M75,2)+LARGE(M16:M75,3)","v":0},{"$f":"SUM(N16:N75)","v":5},{"$f":"LARGE(O16:O75,1)+LARGE(O16:O75,2)+LARGE(O16:O75,3)","v":0},{"$f":"SUM(P16:P75)","v":5},{"$f":"LARGE(Q16:Q75,1)+LARGE(Q16:Q75,2)+LARGE(Q16:Q75,3)","v":0},{"$f":"SUM(R16:R75)","v":5},{"$f":"LARGE(S16:S75,1)+LARGE(S16:S75,2)+LARGE(S16:S75,3)","v":0},{"$f":"SUM(T16:T75)","v":5},{"$f":"LARGE(U16:U75,1)+LARGE(U16:U75,2)+LARGE(U16:U75,3)","v":0},{"$f":"SUM(V16:V75)","v":5},{"$f":"LARGE(W16:W75,1)+LARGE(W16:W75,2)+LARGE(W16:W75,3)","v":0},{"$f":"SUM(X16:X75)","v":5},{"$f":"LARGE(Y16:Y75,1)+LARGE(Y16:Y75,2)+LARGE(Y16:Y75,3)","v":0},{"$f":"SUM(Z16:Z75)","v":5},{"$f":"LARGE(AA16:AA75,1)+LARGE(AA16:AA75,2)+LARGE(AA16:AA75,3)","v":0},{"$f":"SUM(AB16:AB75)","v":5},{"$f":"LARGE(AC16:AC75,1)+LARGE(AC16:AC75,2)+LARGE(AC16:AC75,3)","v":0},{"$f":"SUM(AD16:AD75)","v":5}]
[null,null,"per Email an: sk-huemmling@gmx.de"]

{"sheet":"10","index":10,"n_rows":77,"n_cols":39,"rows_kept":77,"merged":[[0,34,0,35],[1,34,1,35],[4,34,4,35],[5,34,5,35],[6,34,6,35],[14,32,14,35]]}
[null,"Verein / Gruppe",null,"Ergebnisse",{"$nulls":29},"Austragungsort:",{"$f":"Übersicht!O4","v":"Lahn"}]
[1,{"$f":"'Wettkampf 1'!B2","v":"Esterwegen"},null,{"$f":"G76","v":{"v":0,"d":"0.0"}},{"$f":"IF(H76>4,\"Es sind zu viele Schützen in Wertung!\",\" \")","v":"Es sind zu viele Schützen in Wertung!"},{"$nulls":28},"Wettkampftag:",{"$f":"Übersicht!O3","v":"15.03."}]
[2,{"$f":"'Wettkampf 1'!B3","v":"Lähden Jugend I"},null,{"$f":"I76","v":{"v":0,"d":"0.0"}},{"$f":"IF(J76>4,\"Es sind zu viele Schützen in Wertung!\",\" \")","v":"Es sind zu viele Schützen in Wertung!"}]
[3,{"$f":"'Wettkampf 1'!B4","v":"Börgerwald"},null,{"$f":"K76","v":{"v":0,"d":"0.0"}},{"$f":"IF(L76>4,\"Es sind zu viele Schützen in Wertung!\",\" \")","v":"Es sind zu viele Schützen in Wertung!"},{"$nulls":30},"Ansprechpartner für Rückfragen:"]
[4,{"$f":"'Wettkampf 1'!B5","v":"Börgermoor"},null,{"$f":"M76","v":{"v":0,"d":"0.0"}},{"$f":"IF(N76>4,\"Es sind zu viele Schützen in Wertung!\",\" \")","v":"Es sind zu viele Schützen in Wertung!"},{"$nulls":28},"Name:"]
[5,{"$f":"'Wettkampf 1'!B6","v":"Spahnharrenstätte"},null,{"$f":"O76","v":{"v":0,"d":"0.0"}},{"$f":"IF(P76>4,\"Es sind zu viele Schützen in Wertung!\",\" \")","v":"Es sind zu viele Schützen in Wertung!"},{"$nulls":28},"Tel:"]
[6,{"$f":"'Wettkampf 1'!B7","v":"Lorup"},null,{"$f":"Q76","v":{"v":0,"d":"0.0"}},{"$f":"IF(R76>4,\"Es sind zu viele Schützen in Wertung!\",\" \")","v":"Es sind zu viele Schützen in Wertung!"},{"$nulls":28},"Standaufsicht:","eintragen"]
[7,{"$f":"'Wettkampf 1'!B8","v":"Lahn"},null,{"$f":"S76","v":{"v":0,"d":"0.0"}},{"$f":"IF(T76>4,\"Es sind zu viele Schützen in Wertung!\",\" \")","v":"Es sind zu viele Schützen in Wertung!"}]
[8,{"$f":"'Wettkampf 1'!B9","v":"Sögel"},null,{"$f":"U76","v":{"v":0,"d":"0.0"}},{"$f":"IF(V76>4,\"Es sind zu viele Schützen in Wertung!\",\" \")","v":"Es sind zu viele Schützen in Wertung!"}]
[9,{"$f":"'Wettkampf 1'!B10","v":"Verein IX"},null,{"$f":"W76","v":{"v":0,"d":"0.0"}},{"$f":"IF(X76>4,\"Es sind zu viele Schützen in Wertung!\",\" \")","v":"Es sind zu viele Schützen in Wertung!"}]
[10,{"$f":"'Wettkampf 1'!B11","v":"Verein X"},null,{"$f":"Y76","v":{"v":0,"d":"0.0"}},{"$f":"IF(Z76>4,\"Es sind zu viele Schützen in Wertung!\",\" \")","v":"Es sind zu viele Schützen in Wertung!"}]
[11,{"$f":"'Wettkampf 1'!B12","v":"Verein XI"},null,{"$f":"AA76","v":{"v":0,"d":"0.0"}},{"$f":"IF(AB76>4,\"Es sind zu viele Schützen in Wertung!\",\" \")","v":"Es sind zu viele Schützen in Wertung!"}]
[12,{"$f":"'Wettkampf 1'!B13","v":"Verein XII"},null,{"$f":"AC76","v":{"v":0,"d":"0.0"}},{"$f":"IF(AD76>4,\"Es sind zu viele Schützen in Wertung!\",\" \")","v":"Es sind zu viele Schützen in Wertung!"}]
[]
[null,"Einzelergebnisse:","Verein / Gruppe","Ergebnisse (mindestens 0 eintragen)","AW? Dann x eintippen",null,"Verein 1",null,"Verein 2",null,"Verein 3",null,"Verein 4",null,"Verein 5",null,"Verein 6",null,"Verein 7",null,"Verein 8",null,"Verein 9",null,"Verein 10",null,"Verein 11",null,"Verein 12",{"$nulls":3},"Proberechnung bei Streifen:"]
[1,{"$f":"'Wettkampf 1'!B16","v":"Gedecksnis Stefan"},{"$f":"'Wettkampf 1'!C16","v":"Esterwegen"},null,null,{"$f":"IF(E16=\"x\",\"0\",D16)","v":{"v":0,"d":"0.0"}},{"$f":"IF(C16=$B$2,F16,0)","v":0},{"$f":"(IF(AND($E16=\"\",$C16=$B$2),1,0))","v":1},{"$f":"IF($C16=$B$3,$F16,0)","v":0},{"$f":"(IF(AND($E16=\"\",$C16=$B$3),1,0))","v":0},{"$f":"IF($C16=$B$4,F16,0)","v":0},{"$f":"(IF(AND($E16=\"\",$C16=$B$4),1,0))","v":0},{"$f":"IF($C16=$B$5,F16,0)","v":0},{"$f":"(IF(AND($E16=\"\",$C16=$B$5),1,0))","v":0},{"$f":"IF($C16=$B$6,F16,0)","v":0},{"$f":"(IF(AND($E16=\"\",$C16=$B$6),1,0))","v":0},{"$f":"IF($C16=$B$7,F16,0)","v":0},{"$f":"(IF(AND($E16=\"\",$C16=$B$7),1,0))","v":0},{"$f":"IF($C16=$B$8,$F16,0)","v":0},{"$f":"(IF(AND($E16=\"\",$C16=$B$8),1,0))","v":0},{"$f":"IF($C16=$B$9,$F16,0)","v":0},{"$f":"(IF(AND($E16=\"\",$C16=$B$9),1,0))","v":0},{"$f":"IF($C16=$B$10,$F16,0)","v":0},{"$f":"(IF(AND($E16=\"\",$C16=$B$10),1,0))","v":0},{"$f":"IF($C16=$B$11,$F16,0)","v":0},{"$f":"(IF(AND($E16=\"\",$C16=$B$11),1,0))","v":0},{"$f":"IF($C16=$B$12,$F16,0)","v":0},{"$f":"(IF(AND($E16=\"\",$C16=$B$12),1,0))","v":0},{"$f":"IF($C16=$B$13,$F16,0)","v":0},{"$f":"(IF(AND($E16=\"\",$C16=$B$13),1,0))","v":0},{"$nulls":5},{"$f":"SUM(AG16:AI16)","v":{"v":0,"d":"0.0"}},{"$f":"IF(AJ16=D16,1,0)","v":1},{"$f":"IF(AJ16=0,0,1)","v":0},{"$f":"IF(AK16+AL16=2,\"Korrekt\",\"\")","v":""}]
[2,{"$f":"'Wettkampf 1'!B17","v":"Wübben Jasper"},{"$f":"'Wettkampf 1'!C17","v":"Esterwegen"},null,null,{"$f":"IF(E17=\"x\",\"0\",D17)","v":{"v":0,"d":"0.0"}},{"$f":"IF(C17=$B$2,F17,0)","v":0},{"$f":"(IF(AND($E17=\"\",$C17=$B$2),1,0))","v":1},{"$f":"IF($C17=$B$3,F17,0)","v":0},{"$f":"(IF(AND($E17=\"\",$C17=$B$3),1,0))","v":0},{"$f":"IF($C17=$B$4,F17,0)","v":0},{"$f":"(IF(AND($E17=\"\",$C17=$B$4),1,0))","v":0},{"$f":"IF($C17=$B$5,F17,0)","v":0},{"$f":"(IF(AND($E17=\"\",$C17=$B$5),1,0))","v":0},{"$f":"IF($C17=$B$6,F17,0)","v":0},{"$f":"(IF(AND($E17=\"\",$C17=$B$6),1,0))","v":0},{"$f":"IF($C17=$B$7,F17,0)","v":0},{"$f":"(IF(AND($E17=\"\",$C17=$B$7),1,0))","v":0},{"$f":"IF($C17=$B$8,$F17,0)","v":0},{"$f":"(IF(AND($E17=\"\",$C17=$B$8),1,0))","v":0},{"$f":"IF($C17=$B$9,$F17,0)","v":0},{"$f":"(IF(AND($E17=\"\",$C17=$B$9),1,0))","v":0},{"$f":"IF($C17=$B$10,$F17,0)","v":0},{"$f":"(IF(AND($E17=\"\",$C17=$B$10),1,0))","v":0},{"$f":"IF($C17=$B$11,$F17,0)","v":0},{"$f":"(IF(AND($E17=\"\",$C17=$B$11),1,0))","v":0},{"$f":"IF($C17=$B$12,$F17,0)","v":0},{"$f":"(IF(AND($E17=\"\",$C17=$B$12),1,0))","v":0},{"$f":"IF($C17=$B$13,$F17,0)","v":0},{"$f":"(IF(AND($E17=\"\",$C17=$B$13),1,0))","v":0},{"$nulls":5},{"$f":"SUM(AG17:AI17)","v":{"v":0,"d":"0.0"}},{"$f":"IF(AJ17=D17,1,0)","v":1},{"$f":"IF(AJ17=0,0,1)","v":0},{"$f":"IF(AK17+AL17=2,\"Korrekt\",\"\")","v":""}]
[3,{"$f":"'Wettkampf 1'!B18","v":"Engbers Julian"},{"$f":"'Wettkampf 1'!C18","v":"Esterwegen"},null,null,{"v":0,"d":"0.0"},0,1,0,0,0,0,0,0,0,0,0,0,0,0,0,0,0,0,0,0,0,0,0,0,{"$nulls":5},{"v":0,"d":"0.0"},1,0,""]
[4,{"$f":"'Wettkampf 1'!B19","v":"Meyer Johan"},{"$f":"'Wettkampf 1'!C19","v":"Esterwegen"},null,null,{"v":0,"d":"0.0"},0,1,0,0,0,0,0,0,0,0,0,0,0,0,0,0,0,0,0,0,0,0,0,0,{"$nulls":5},{"v":0,"d":"0.0"},1,0,""]
[5,{"$f":"'Wettkampf 1'!B20","v":"Schütze 5"},{"$f":"'Wettkampf 1'!C20","v":"Esterwegen"},null,null,{"v":0,"d":"0.0"},0,1,0,0,0,0,0,0,0,0,0,0,0,0,0,0,0,0,0,0,0,0,0,0,{"$nulls":5},{"v":0,"d":"0.0"},1,0,""]
[6,{"$f":"'Wettkampf 1'!B21","v":"Strüwing Inja"},{"$f":"'Wettkampf 1'!C21","v":"Lähden Jugend I"},null,null,{"v":0,"d":"0.0"},0,0,0,1,0,0,0,0,0,0,0,0,0,0,0,0,0,0,0,0,0,0,0,0,{"$nulls":5},{"v":0,"d":"0.0"},1,0,""]
[7,{"$f":"'Wettkampf 1'!B22","v":"Bruns Hendrik"},{"$f":"'Wettkampf 1'!C22","v":"Lähden Jugend I"},null,null,{"v":0,"d":"0.0"},0,0,0,1,0,0,0,0,0,0,0,0,0,0,0,0,0,0,0,0,0,0,0,0,{"$nulls":5},{"v":0,"d":"0.0"},1,0,""]
[8,{"$f":"'Wettkampf 1'!B23","v":"Feldhaus Vanessa"},{"$f":"'Wettkampf 1'!C23","v":"Lähden Jugend I"},null,null,{"v":0,"d":"0.0"},0,0,0,1,0,0,0,0,0,0,0,0,0,0,0,0,0,0,0,0,0,0,0,0,{"$nulls":5},{"v":0,"d":"0.0"},1,0,""]
[9,{"$f":"'Wettkampf 1'!B24","v":"Feldhaus Celien "},{"$f":"'Wettkampf 1'!C24","v":"Lähden Jugend I"},null,null,{"v":0,"d":"0.0"},0,0,0,1,0,0,0,0,0,0,0,0,0,0,0,0,0,0,0,0,0,0,0,0,{"$nulls":5},{"v":0,"d":"0.0"},1,0,""]
[10,{"$f":"'Wettkampf 1'!B25","v":"Stümpler Jan-Luca"},{"$f":"'Wettkampf 1'!C25","v":"Lähden Jugend I"},null,null,{"v":0,"d":"0.0"},0,0,0,1,0,0,0,0,0,0,0,0,0,0,0,0,0,0,0,0,0,0,0,0,{"$nulls":5},{"v":0,"d":"0.0"},1,0,""]
[11,{"$f":"'Wettkampf 1'!B26","v":"Hanneken Maren"},{"$f":"'Wettkampf 1'!C26","v":"Börgerwald"},null,null,{"v":0,"d":"0.0"},0,0,0,0,0,1,0,0,0,0,0,0,0,0,0,0,0,0,0,0,0,0,0,0,{"$nulls":5},{"v":0,"d":"0.0"},1,0,""]
[12,{"$f":"'Wettkampf 1'!B27","v":"Köstering Nele"},{"$f":"'Wettkampf 1'!C27","v":"Börgerwald"},null,null,{"v":0,"d":"0.0"},0,0,0,0,0,1,0,0,0,0,0,0,0,0,0,0,0,0,0,0,0,0,0,0,{"$nulls":5},{"v":0,"d":"0.0"},1,0,""]
[13,{"$f":"'Wettkampf 1'!B28","v":"Lohmann Amy"},{"$f":"'Wettkampf 1'!C28","v":"Börgerwald"},null,null,{"v":0,"d":"0.0"},0,0,0,0,0,1,0,0,0,0,0,0,0,0,0,0,0,0,0,0,0,0,0,0,{"$nulls":5},{"v":0,"d":"0.0"},1,0,""]
[14,{"$f":"'Wettkampf 1'!B29","v":"Schütze 14"},{"$f":"'Wettkampf 1'!C29","v":"Börgerwald"},null,null,{"v":0,"d":"0.0"},0,0,0,0,0,1,0,0,0,0,0,0,0,0,0,0,0,0,0,0,0,0,0,0,{"$nulls":5},{"v":0,"d":"0.0"},1,0,""]
[15,{"$f":"'Wettkampf 1'!B30","v":"Schütze 15"},{"$f":"'Wettkampf 1'!C30","v":"Börgerwald"},null,null,{"v":0,"d":"0.0"},0,0,0,0,0,1,0,0,0,0,0,0,0,0,0,0,0,0,0,0,0,0,0,0,{"$nulls":5},{"v":0,"d":"0.0"},1,0,""]
[16,{"$f":"'Wettkampf 1'!B31","v":"Brandt Mira"},{"$f":"'Wettkampf 1'!C31","v":"Börgermoor"},null,null,{"v":0,"d":"0.0"},0,0,0,0,0,0,0,1,0,0,0,0,0,0,0,0,0,0,0,0,0,0,0,0,{"$nulls":5},{"v":0,"d":"0.0"},1,0,""]
[17,{"$f":"'Wettkampf 1'!B32","v":"Eichhorn Luca"},{"$f":"'Wettkampf 1'!C32","v":"Börgermoor"},null,null,{"v":0,"d":"0.0"},0,0,0,0,0,0,0,1,0,0,0,0,0,0,0,0,0,0,0,0,0,0,0,0,{"$nulls":5},{"v":0,"d":"0.0"},1,0,""]
[18,{"$f":"'Wettkampf 1'!B33","v":"Kohnen Saskia"},{"$f":"'Wettkampf 1'!C33","v":"Börgermoor"},null,null,{"v":0,"d":"0.0"},0,0,0,0,0,0,0,1,0,0,0,0,0,0,0,0,0,0,0,0,0,0,0,0,{"$nulls":5},{"v":0,"d":"0.0"},1,0,""]
[19,{"$f":"'Wettkampf 1'!B34","v":"Schütze 19"},{"$f":"'Wettkampf 1'!C34","v":"Börgermoor"},null,null,{"v":0,"d":"0.0"},0,0,0,0,0,0,0,1,0,0,0,0,0,0,0,0,0,0,0,0,0,0,0,0,{"$nulls":5},{"v":0,"d":"0.0"},1,0,""]
[20,{"$f":"'Wettkampf 1'!B35","v":"Schütze 20"},{"$f":"'Wettkampf 1'!C35","v":"Börgermoor"},null,null,{"v":0,"d":"0.0"},0,0,0,0,0,0,0,1,0,0,0,0,0,0,0,0,0,0,0,0,0,0,0,0,{"$nulls":5},{"v":0,"d":"0.0"},1,0,""]
[21,{"$f":"'Wettkampf 1'!B36","v":"Runde Marcel"},{"$f":"'Wettkampf 1'!C36","v":"Spahnharrenstätte"},null,null,{"v":0,"d":"0.0"},0,0,0,0,0,0,0,0,0,1,0,0,0,0,0,0,0,0,0,0,0,0,0,0,{"$nulls":5},{"v":0,"d":"0.0"},1,0,""]
[22,{"$f":"'Wettkampf 1'!B37","v":"Leis Fynn Lucas "},{"$f":"'Wettkampf 1'!C37","v":"Spahnharrenstätte"},null,null,{"v":0,"d":"0.0"},0,0,0,0,0,0,0,0,0,1,0,0,0,0,0,0,0,0,0,0,0,0,0,0,{"$nulls":5},{"v":0,"d":"0.0"},1,0,""]
[23,{"$f":"'Wettkampf 1'!B38","v":"Jansen Lars"},{"$f":"'Wettkampf 1'!C38","v":"Spahnharrenstätte"},null,null,{"v":0,"d":"0.0"},0,0,0,0,0,0,0,0,0,1,0,0,0,0,0,0,0,0,0,0,0,0,0,0,{"$nulls":5},{"v":0,"d":"0.0"},1,0,""]
[24,{"$f":"'Wettkampf 1'!B39","v":"Köster Thilo"},{"$f":"'Wettkampf 1'!C39","v":"Spahnharrenstätte"},null,null,{"v":0,"d":"0.0"},0,0,0,0,0,0,0,0,0,1,0,0,0,0,0,0,0,0,0,0,0,0,0,0,{"$nulls":5},{"v":0,"d":"0.0"},1,0,""]
[25,{"$f":"'Wettkampf 1'!B40","v":"Schütze 25"},{"$f":"'Wettkampf 1'!C40","v":"Spahnharrenstätte"},null,null,{"v":0,"d":"0.0"},0,0,0,0,0,0,0,0,0,1,0,0,0,0,0,0,0,0,0,0,0,0,0,0,{"$nulls":5},{"v":0,"d":"0.0"},1,0,""]
[26,{"$f":"'Wettkampf 1'!B41","v":"Dolling Leon"},{"$f":"'Wettkampf 1'!C41","v":"Lorup"},null,null,{"v":0,"d":"0.0"},0,0,0,0,0,0,0,0,0,0,0,1,0,0,0,0,0,0,0,0,0,0,0,0,{"$nulls":5},{"v":0,"d":"0.0"},1,0,""]
[27,{"$f":"'Wettkampf 1'!B42","v":"Schütze 27"},{"$f":"'Wettkampf 1'!C42","v":"Lorup"},null,null,{"v":0,"d":"0.0"},0,0,0,0,0,0,0,0,0,0,0,1,0,0,0,0,0,0,0,0,0,0,0,0,{"$nulls":5},{"v":0,"d":"0.0"},1,0,""]
[28,{"$f":"'Wettkampf 1'!B43","v":"Schütze 28"},{"$f":"'Wettkampf 1'!C43","v":"Lorup"},null,null,{"v":0,"d":"0.0"},0,0,0,0,0,0,0,0,0,0,0,1,0,0,0,0,0,0,0,0,0,0,0,0,{"$nulls":5},{"v":0,"d":"0.0"},1,0,""]
[29,{"$f":"'Wettkampf 1'!B44","v":"Schütze 29"},{"$f":"'Wettkampf 1'!C44","v":"Lorup"},null,null,{"v":0,"d":"0.0"},0,0,0,0,0,0,0,0,0,0,0,1,0,0,0,0,0,0,0,0,0,0,0,0,{"$nulls":5},{"v":0,"d":"0.0"},1,0,""]
[30,{"$f":"'Wettkampf 1'!B45","v":"Schütze 30"},{"$f":"'Wettkampf 1'!C45","v":"Lorup"},null,null,{"v":0,"d":"0.0"},0,0,0,0,0,0,0,0,0,0,0,1,0,0,0,0,0,0,0,0,0,0,0,0,{"$nulls":5},{"v":0,"d":"0.0"},1,0,""]
[31,{"$f":"'Wettkampf 1'!B46","v":"Wilken Noah"},{"$f":"'Wettkampf 1'!C46","v":"Lahn"},null,null,{"v":0,"d":"0.0"},0,0,0,0,0,0,0,0,0,0,0,0,0,1,0,0,0,0,0,0,0,0,0,0,{"$nulls":5},{"v":0,"d":"0.0"},1,0,""]
[32,{"$f":"'Wettkampf 1'!B47","v":"Schulz Mika"},{"$f":"'Wettkampf 1'!C47","v":"Lahn"},null,null,{"v":0,"d":"0.0"},0,0,0,0,0,0,0,0,0,0,0,0,0,1,0,0,0,0,0,0,0,0,0,0,{"$nulls":5},{"v":0,"d":"0.0"},1,0,""]
[33,{"$f":"'Wettkampf 1'!B48","v":"Schütze 33"},{"$f":"'Wettkampf 1'!C48","v":"Lahn"},null,null,{"v":0,"d":"0.0"},0,0,0,0,0,0,0,0,0,0,0,0,0,1,0,0,0,0,0,0,0,0,0,0,{"$nulls":5},{"v":0,"d":"0.0"},1,0,""]
[34,{"$f":"'Wettkampf 1'!B49","v":"Schütze 34"},{"$f":"'Wettkampf 1'!C49","v":"Lahn"},null,null,{"v":0,"d":"0.0"},0,0,0,0,0,0,0,0,0,0,0,0,0,1,0,0,0,0,0,0,0,0,0,0,{"$nulls":5},{"v":0,"d":"0.0"},1,0,""]
[35,{"$f":"'Wettkampf 1'!B50","v":"Schütze 35"},{"$f":"'Wettkampf 1'!C50","v":"Lahn"},null,null,{"v":0,"d":"0.0"},0,0,0,0,0,0,0,0,0,0,0,0,0,1,0,0,0,0,0,0,0,0,0,0,{"$nulls":5},{"v":0,"d":"0.0"},1,0,""]
[36,{"$f":"'Wettkampf 1'!B51","v":"Tharner Kim"},{"$f":"'Wettkampf 1'!C51","v":"Sögel"},null,null,{"v":0,"d":"0.0"},0,0,0,0,0,0,0,0,0,0,0,0,0,0,0,1,0,0,0,0,0,0,0,0,{"$nulls":5},{"v":0,"d":"0.0"},1,0,""]
[37,{"$f":"'Wettkampf 1'!B52","v":"Schütze 37"},{"$f":"'Wettkampf 1'!C52","v":"Sögel"},null,null,{"v":0,"d":"0.0"},0,0,0,0,0,0,0,0,0,0,0,0,0,0,0,1,0,0,0,0,0,0,0,0,{"$nulls":5},{"v":0,"d":"0.0"}]
[38,{"$f":"'Wettkampf 1'!B53","v":"Schütze 38"},{"$f":"'Wettkampf 1'!C53","v":"Sögel"},null,null,{"v":0,"d":"0.0"},0,0,0,0,0,0,0,0,0,0,0,0,0,0,0,1,0,0,0,0,0,0,0,0,{"$nulls":5},{"v":0,"d":"0.0"}]
[39,{"$f":"'Wettkampf 1'!B54","v":"Schütze 39"},{"$f":"'Wettkampf 1'!C54","v":"Sögel"},null,null,{"v":0,"d":"0.0"},0,0,0,0,0,0,0,0,0,0,0,0,{"$f":"IF($C54=$B$8,$F54,0)","v":0},{"$f":"(IF(AND($E54=\"\",$C54=$B$8),1,0))","v":0},{"$f":"IF($C54=$B$9,$F54,0)","v":0},{"$f":"(IF(AND($E54=\"\",$C54=$B$9),1,0))","v":1},{"$f":"IF($C54=$B$10,$F54,0)","v":0},{"$f":"(IF(AND($E54=\"\",$C54=$B$10),1,0))","v":0},{"$f":"IF($C54=$B$11,$F54,0)","v":0},{"$f":"(IF(AND($E54=\"\",$C54=$B$11),1,0))","v":0},{"$f":"IF($C54=$B$12,$F54,0)","v":0},{"$f":"(IF(AND($E54=\"\",$C54=$B$12),1,0))","v":0},{"$f":"IF($C54=$B$13,$F54,0)","v":0},{"$f":"(IF(AND($E54=\"\",$C54=$B$13),1,0))","v":0},{"$nulls":5},{"v":0,"d":"0.0"}]
[40,{"$f":"'Wettkampf 1'!B55","v":"Schütze 40"},{"$f":"'Wettkampf 1'!C55","v":"Sögel"},null,null,{"v":0,"d":"0.0"},0,0,0,0,0,0,0,0,0,0,0,0,0,0,0,1,0,0,0,0,0,0,0,0,{"$nulls":5},{"v":0,"d":"0.0"}]
[41,{"$f":"'Wettkampf 1'!B56","v":"Schütze 41"},{"$f":"'Wettkampf 1'!C56","v":"Verein IX"},null,null,{"v":0,"d":"0.0"},0,0,0,0,0,0,0,0,0,0,0,0,0,0,0,0,0,1,0,0,0,0,0,0,{"$nulls":5},{"v":0,"d":"0.0"}]
[42,{"$f":"'Wettkampf 1'!B57","v":"Schütze 42"},{"$f":"'Wettkampf 1'!C57","v":"Verein IX"},null,null,{"v":0,"d":"0.0"},0,0,0,0,0,0,0,0,0,0,0,0,0,0,0,0,0,1,0,0,0,0,0,0,{"$nulls":5},{"v":0,"d":"0.0"}]
[43,{"$f":"'Wettkampf 1'!B58","v":"Schütze 43"},{"$f":"'Wettkampf 1'!C58","v":"Verein IX"},null,null,{"v":0,"d":"0.0"},0,0,0,0,0,0,0,0,0,0,0,0,0,0,0,0,0,1,0,0,0,0,0,0,{"$nulls":5},{"v":0,"d":"0.0"}]
[44,{"$f":"'Wettkampf 1'!B59","v":"Schütze 44"},{"$f":"'Wettkampf 1'!C59","v":"Verein IX"},null,null,{"v":0,"d":"0.0"},0,0,0,0,0,0,0,0,0,0,0,0,0,0,0,0,0,1,0,0,0,0,0,0,{"$nulls":5},{"v":0,"d":"0.0"}]
[45,{"$f":"'Wettkampf 1'!B60","v":"Schütze 45"},{"$f":"'Wettkampf 1'!C60","v":"Verein IX"},null,null,{"v":0,"d":"0.0"},0,0,0,0,0,0,0,0,0,0,0,0,0,0,0,0,0,1,0,0,0,0,0,0,{"$nulls":5},{"v":0,"d":"0.0"}]
[46,{"$f":"'Wettkampf 1'!B61","v":"Schütze 46"},{"$f":"'Wettkampf 1'!C61","v":"Verein X"},null,null,{"v":0,"d":"0.0"},0,0,0,0,0,0,0,0,0,0,0,0,0,0,0,0,0,0,0,1,0,0,0,0,{"$nulls":5},{"v":0,"d":"0.0"}]
[47,{"$f":"'Wettkampf 1'!B62","v":"Schütze 47"},{"$f":"'Wettkampf 1'!C62","v":"Verein X"},null,null,{"v":0,"d":"0.0"},0,0,0,0,0,0,0,0,0,0,0,0,0,0,0,0,0,0,0,1,0,0,0,0,{"$nulls":5},{"v":0,"d":"0.0"}]
[48,{"$f":"'Wettkampf 1'!B63","v":"Schütze 48"},{"$f":"'Wettkampf 1'!C63","v":"Verein X"},null,null,{"v":0,"d":"0.0"},0,0,0,0,0,0,0,0,0,0,0,0,0,0,0,0,0,0,0,1,0,0,0,0,{"$nulls":5},{"v":0,"d":"0.0"}]
[49,{"$f":"'Wettkampf 1'!B64","v":"Schütze 49"},{"$f":"'Wettkampf 1'!C64","v":"Verein X"},null,null,{"v":0,"d":"0.0"},0,0,0,0,0,0,0,0,0,0,0,0,0,0,0,0,0,0,0,1,0,0,0,0,{"$nulls":5},{"v":0,"d":"0.0"}]
[50,{"$f":"'Wettkampf 1'!B65","v":"Schütze 50"},{"$f":"'Wettkampf 1'!C65","v":"Verein X"},null,null,{"v":0,"d":"0.0"},0,0,0,0,0,0,0,0,0,0,0,0,0,0,0,0,0,0,0,1,0,0,0,0,{"$nulls":5},{"v":0,"d":"0.0"}]
[51,{"$f":"'Wettkampf 1'!B66","v":"Schütze 51"},{"$f":"'Wettkampf 1'!C66","v":"Verein XI"},null,null,{"v":0,"d":"0.0"},0,0,0,0,0,0,0,0,0,0,0,0,0,0,0,0,0,0,0,0,0,1,0,0,{"$nulls":5},{"v":0,"d":"0.0"}]
[52,{"$f":"'Wettkampf 1'!B67","v":"Schütze 52"},{"$f":"'Wettkampf 1'!C67","v":"Verein XI"},null,null,{"v":0,"d":"0.0"},0,0,0,0,0,0,0,0,0,0,0,0,0,0,0,0,0,0,0,0,0,1,0,0,{"$nulls":5},{"v":0,"d":"0.0"}]
[53,{"$f":"'Wettkampf 1'!B68","v":"Schütze 53"},{"$f":"'Wettkampf 1'!C68","v":"Verein XI"},null,null,{"v":0,"d":"0.0"},0,0,0,0,0,0,0,0,0,0,0,0,0,0,0,0,0,0,0,0,0,1,0,0,{"$nulls":5},{"v":0,"d":"0.0"}]
[54,{"$f":"'Wettkampf 1'!B69","v":"Schütze 54"},{"$f":"'Wettkampf 1'!C69","v":"Verein XI"},null,null,{"v":0,"d":"0.0"},0,0,0,0,0,0,0,0,0,0,0,0,0,0,0,0,0,0,0,0,0,1,0,0,{"$nulls":5},{"v":0,"d":"0.0"}]
[55,{"$f":"'Wettkampf 1'!B70","v":"Schütze 55"},{"$f":"'Wettkampf 1'!C70","v":"Verein XI"},null,null,{"v":0,"d":"0.0"},0,0,0,0,0,0,0,0,0,0,0,0,0,0,0,0,0,0,0,0,0,1,0,0,{"$nulls":5},{"v":0,"d":"0.0"}]
[56,{"$f":"'Wettkampf 1'!B71","v":"Schütze 56"},{"$f":"'Wettkampf 1'!C71","v":"Verein XII"},null,null,{"v":0,"d":"0.0"},0,0,0,0,0,0,0,0,0,0,0,0,0,0,0,0,0,0,0,0,0,0,0,1,{"$nulls":5},{"v":0,"d":"0.0"}]
[57,{"$f":"'Wettkampf 1'!B72","v":"Schütze 57"},{"$f":"'Wettkampf 1'!C72","v":"Verein XII"},null,null,{"v":0,"d":"0.0"},0,0,0,0,0,0,0,0,0,0,0,0,0,0,0,0,0,0,0,0,0,0,0,1,{"$nulls":5},{"v":0,"d":"0.0"}]
[58,{"$f":"'Wettkampf 1'!B73","v":"Schütze 58"},{"$f":"'Wettkampf 1'!C73","v":"Verein XII"},null,null,{"v":0,"d":"0.0"},0,0,0,0,0,0,0,0,0,0,0,0,0,0,0,0,0,0,0,0,0,0,0,1,{"$nulls":5},{"v":0,"d":"0.0"}]
[59,{"$f":"'Wettkampf 1'!B74","v":"Schütze 59"},{"$f":"'Wettkampf 1'!C74","v":"Verein XII"},null,null,{"v":0,"d":"0.0"},0,0,0,0,0,0,0,0,0,0,0,0,0,0,0,0,0,0,0,0,0,0,0,1,{"$nulls":5},{"v":0,"d":"0.0"}]
[60,{"$f":"'Wettkampf 1'!B75","v":"Schütze 60"},{"$f":"'Wettkampf 1'!C75","v":"Verein XII"},null,null,{"v":0,"d":"0.0"},0,0,0,0,0,0,0,0,0,0,0,0,0,0,0,0,0,0,0,0,0,0,0,1,{"$nulls":5},{"v":0,"d":"0.0"}]
[{"$nulls":6},{"$f":"LARGE(G16:G75,1)+LARGE(G16:G75,2)+LARGE(G16:G75,3)","v":0},{"$f":"SUM(H16:H75)","v":5},{"$f":"LARGE(I16:I75,1)+LARGE(I16:I75,2)+LARGE(I16:I75,3)","v":0},{"$f":"SUM(J16:J75)","v":5},{"$f":"LARGE(K16:K75,1)+LARGE(K16:K75,2)+LARGE(K16:K75,3)","v":0},{"$f":"SUM(L16:L75)","v":5},{"$f":"LARGE(M16:M75,1)+LARGE(M16:M75,2)+LARGE(M16:M75,3)","v":0},{"$f":"SUM(N16:N75)","v":5},{"$f":"LARGE(O16:O75,1)+LARGE(O16:O75,2)+LARGE(O16:O75,3)","v":0},{"$f":"SUM(P16:P75)","v":5},{"$f":"LARGE(Q16:Q75,1)+LARGE(Q16:Q75,2)+LARGE(Q16:Q75,3)","v":0},{"$f":"SUM(R16:R75)","v":5},{"$f":"LARGE(S16:S75,1)+LARGE(S16:S75,2)+LARGE(S16:S75,3)","v":0},{"$f":"SUM(T16:T75)","v":5},{"$f":"LARGE(U16:U75,1)+LARGE(U16:U75,2)+LARGE(U16:U75,3)","v":0},{"$f":"SUM(V16:V75)","v":5},{"$f":"LARGE(W16:W75,1)+LARGE(W16:W75,2)+LARGE(W16:W75,3)","v":0},{"$f":"SUM(X16:X75)","v":5},{"$f":"LARGE(Y16:Y75,1)+LARGE(Y16:Y75,2)+LARGE(Y16:Y75,3)","v":0},{"$f":"SUM(Z16:Z75)","v":5},{"$f":"LARGE(AA16:AA75,1)+LARGE(AA16:AA75,2)+LARGE(AA16:AA75,3)","v":0},{"$f":"SUM(AB16:AB75)","v":5},{"$f":"LARGE(AC16:AC75,1)+LARGE(AC16:AC75,2)+LARGE(AC16:AC75,3)","v":0},{"$f":"SUM(AD16:AD75)","v":5}]
[null,null,"per Email an: sk-huemmling@gmx.de"]

{"sheet":"11","index":11,"n_rows":77,"n_cols":39,"rows_kept":77,"merged":[[0,34,0,35],[1,34,1,35],[4,34,4,35],[5,34,5,35],[6,34,6,35],[14,32,14,35]]}
[null,"Verein / Gruppe",null,"Ergebnisse",{"$nulls":29},"Austragungsort:",{"$f":"Übersicht!P4","v":0}]
[1,{"$f":"'Wettkampf 1'!B2","v":"Esterwegen"},null,{"$f":"G76","v":{"v":0,"d":"0.0"}},{"$f":"IF(H76>4,\"Es sind zu viele Schützen in Wertung!\",\" \")","v":"Es sind zu viele Schützen in Wertung!"},{"$nulls":28},"Wettkampftag:",{"$f":"Übersicht!P3","v":0}]
[2,{"$f":"'Wettkampf 1'!B3","v":"Lähden Jugend I"},null,{"$f":"I76","v":{"v":0,"d":"0.0"}},{"$f":"IF(J76>4,\"Es sind zu viele Schützen in Wertung!\",\" \")","v":"Es sind zu viele Schützen in Wertung!"}]
[3,{"$f":"'Wettkampf 1'!B4","v":"Börgerwald"},null,{"$f":"K76","v":{"v":0,"d":"0.0"}},{"$f":"IF(L76>4,\"Es sind zu viele Schützen in Wertung!\",\" \")","v":"Es sind zu viele Schützen in Wertung!"},{"$nulls":30},"Ansprechpartner für Rückfragen:"]
[4,{"$f":"'Wettkampf 1'!B5","v":"Börgermoor"},null,{"$f":"M76","v":{"v":0,"d":"0.0"}},{"$f":"IF(N76>4,\"Es sind zu viele Schützen in Wertung!\",\" \")","v":"Es sind zu viele Schützen in Wertung!"},{"$nulls":28},"Name:"]
[5,{"$f":"'Wettkampf 1'!B6","v":"Spahnharrenstätte"},null,{"$f":"O76","v":{"v":0,"d":"0.0"}},{"$f":"IF(P76>4,\"Es sind zu viele Schützen in Wertung!\",\" \")","v":"Es sind zu viele Schützen in Wertung!"},{"$nulls":28},"Tel:"]
[6,{"$f":"'Wettkampf 1'!B7","v":"Lorup"},null,{"$f":"Q76","v":{"v":0,"d":"0.0"}},{"$f":"IF(R76>4,\"Es sind zu viele Schützen in Wertung!\",\" \")","v":"Es sind zu viele Schützen in Wertung!"},{"$nulls":28},"Standaufsicht:","eintragen"]
[7,{"$f":"'Wettkampf 1'!B8","v":"Lahn"},null,{"$f":"S76","v":{"v":0,"d":"0.0"}},{"$f":"IF(T76>4,\"Es sind zu viele Schützen in Wertung!\",\" \")","v":"Es sind zu viele Schützen in Wertung!"}]
[8,{"$f":"'Wettkampf 1'!B9","v":"Sögel"},null,{"$f":"U76","v":{"v":0,"d":"0.0"}},{"$f":"IF(V76>4,\"Es sind zu viele Schützen in Wertung!\",\" \")","v":"Es sind zu viele Schützen in Wertung!"}]
[9,{"$f":"'Wettkampf 1'!B10","v":"Verein IX"},null,{"$f":"W76","v":{"v":0,"d":"0.0"}},{"$f":"IF(X76>4,\"Es sind zu viele Schützen in Wertung!\",\" \")","v":"Es sind zu viele Schützen in Wertung!"}]
[10,{"$f":"'Wettkampf 1'!B11","v":"Verein X"},null,{"$f":"Y76","v":{"v":0,"d":"0.0"}},{"$f":"IF(Z76>4,\"Es sind zu viele Schützen in Wertung!\",\" \")","v":"Es sind zu viele Schützen in Wertung!"}]
[11,{"$f":"'Wettkampf 1'!B12","v":"Verein XI"},null,{"$f":"AA76","v":{"v":0,"d":"0.0"}},{"$f":"IF(AB76>4,\"Es sind zu viele Schützen in Wertung!\",\" \")","v":"Es sind zu viele Schützen in Wertung!"}]
[12,{"$f":"'Wettkampf 1'!B13","v":"Verein XII"},null,{"$f":"AC76","v":{"v":0,"d":"0.0"}},{"$f":"IF(AD76>4,\"Es sind zu viele Schützen in Wertung!\",\" \")","v":"Es sind zu viele Schützen in Wertung!"}]
[]
[null,"Einzelergebnisse:","Verein / Gruppe","Ergebnisse (mindestens 0 eintragen)","AW? Dann x eintippen",null,"Verein 1",null,"Verein 2",null,"Verein 3",null,"Verein 4",null,"Verein 5",null,"Verein 6",null,"Verein 7",null,"Verein 8",null,"Verein 9",null,"Verein 10",null,"Verein 11",null,"Verein 12",{"$nulls":3},"Proberechnung bei Streifen:"]
[1,{"$f":"'Wettkampf 1'!B16","v":"Gedecksnis Stefan"},{"$f":"'Wettkampf 1'!C16","v":"Esterwegen"},null,null,{"$f":"IF(E16=\"x\",\"0\",D16)","v":{"v":0,"d":"0.0"}},{"$f":"IF(C16=$B$2,F16,0)","v":0},{"$f":"(IF(AND($E16=\"\",$C16=$B$2),1,0))","v":1},{"$f":"IF($C16=$B$3,$F16,0)","v":0},{"$f":"(IF(AND($E16=\"\",$C16=$B$3),1,0))","v":0},{"$f":"IF($C16=$B$4,F16,0)","v":0},{"$f":"(IF(AND($E16=\"\",$C16=$B$4),1,0))","v":0},{"$f":"IF($C16=$B$5,F16,0)","v":0},{"$f":"(IF(AND($E16=\"\",$C16=$B$5),1,0))","v":0},{"$f":"IF($C16=$B$6,F16,0)","v":0},{"$f":"(IF(AND($E16=\"\",$C16=$B$6),1,0))","v":0},{"$f":"IF($C16=$B$7,F16,0)","v":0},{"$f":"(IF(AND($E16=\"\",$C16=$B$7),1,0))","v":0},{"$f":"IF($C16=$B$8,$F16,0)","v":0},{"$f":"(IF(AND($E16=\"\",$C16=$B$8),1,0))","v":0},{"$f":"IF($C16=$B$9,$F16,0)","v":0},{"$f":"(IF(AND($E16=\"\",$C16=$B$9),1,0))","v":0},{"$f":"IF($C16=$B$10,$F16,0)","v":0},{"$f":"(IF(AND($E16=\"\",$C16=$B$10),1,0))","v":0},{"$f":"IF($C16=$B$11,$F16,0)","v":0},{"$f":"(IF(AND($E16=\"\",$C16=$B$11),1,0))","v":0},{"$f":"IF($C16=$B$12,$F16,0)","v":0},{"$f":"(IF(AND($E16=\"\",$C16=$B$12),1,0))","v":0},{"$f":"IF($C16=$B$13,$F16,0)","v":0},{"$f":"(IF(AND($E16=\"\",$C16=$B$13),1,0))","v":0},{"$nulls":5},{"$f":"SUM(AG16:AI16)","v":{"v":0,"d":"0.0"}},{"$f":"IF(AJ16=D16,1,0)","v":1},{"$f":"IF(AJ16=0,0,1)","v":0},{"$f":"IF(AK16+AL16=2,\"Korrekt\",\"\")","v":""}]
[2,{"$f":"'Wettkampf 1'!B17","v":"Wübben Jasper"},{"$f":"'Wettkampf 1'!C17","v":"Esterwegen"},null,null,{"$f":"IF(E17=\"x\",\"0\",D17)","v":{"v":0,"d":"0.0"}},{"$f":"IF(C17=$B$2,F17,0)","v":0},{"$f":"(IF(AND($E17=\"\",$C17=$B$2),1,0))","v":1},{"$f":"IF($C17=$B$3,F17,0)","v":0},{"$f":"(IF(AND($E17=\"\",$C17=$B$3),1,0))","v":0},{"$f":"IF($C17=$B$4,F17,0)","v":0},{"$f":"(IF(AND($E17=\"\",$C17=$B$4),1,0))","v":0},{"$f":"IF($C17=$B$5,F17,0)","v":0},{"$f":"(IF(AND($E17=\"\",$C17=$B$5),1,0))","v":0},{"$f":"IF($C17=$B$6,F17,0)","v":0},{"$f":"(IF(AND($E17=\"\",$C17=$B$6),1,0))","v":0},{"$f":"IF($C17=$B$7,F17,0)","v":0},{"$f":"(IF(AND($E17=\"\",$C17=$B$7),1,0))","v":0},{"$f":"IF($C17=$B$8,$F17,0)","v":0},{"$f":"(IF(AND($E17=\"\",$C17=$B$8),1,0))","v":0},{"$f":"IF($C17=$B$9,$F17,0)","v":0},{"$f":"(IF(AND($E17=\"\",$C17=$B$9),1,0))","v":0},{"$f":"IF($C17=$B$10,$F17,0)","v":0},{"$f":"(IF(AND($E17=\"\",$C17=$B$10),1,0))","v":0},{"$f":"IF($C17=$B$11,$F17,0)","v":0},{"$f":"(IF(AND($E17=\"\",$C17=$B$11),1,0))","v":0},{"$f":"IF($C17=$B$12,$F17,0)","v":0},{"$f":"(IF(AND($E17=\"\",$C17=$B$12),1,0))","v":0},{"$f":"IF($C17=$B$13,$F17,0)","v":0},{"$f":"(IF(AND($E17=\"\",$C17=$B$13),1,0))","v":0},{"$nulls":5},{"$f":"SUM(AG17:AI17)","v":{"v":0,"d":"0.0"}},{"$f":"IF(AJ17=D17,1,0)","v":1},{"$f":"IF(AJ17=0,0,1)","v":0},{"$f":"IF(AK17+AL17=2,\"Korrekt\",\"\")","v":""}]
[3,{"$f":"'Wettkampf 1'!B18","v":"Engbers Julian"},{"$f":"'Wettkampf 1'!C18","v":"Esterwegen"},null,null,{"v":0,"d":"0.0"},0,1,0,0,0,0,0,0,0,0,0,0,0,0,0,0,0,0,0,0,0,0,0,0,{"$nulls":5},{"v":0,"d":"0.0"},1,0,""]
[4,{"$f":"'Wettkampf 1'!B19","v":"Meyer Johan"},{"$f":"'Wettkampf 1'!C19","v":"Esterwegen"},null,null,{"v":0,"d":"0.0"},0,1,0,0,0,0,0,0,0,0,0,0,0,0,0,0,0,0,0,0,0,0,0,0,{"$nulls":5},{"v":0,"d":"0.0"},1,0,""]
[5,{"$f":"'Wettkampf 1'!B20","v":"Schütze 5"},{"$f":"'Wettkampf 1'!C20","v":"Esterwegen"},null,null,{"v":0,"d":"0.0"},0,1,0,0,0,0,0,0,0,0,0,0,0,0,0,0,0,0,0,0,0,0,0,0,{"$nulls":5},{"v":0,"d":"0.0"},1,0,""]
[6,{"$f":"'Wettkampf 1'!B21","v":"Strüwing Inja"},{"$f":"'Wettkampf 1'!C21","v":"Lähden Jugend I"},null,null,{"v":0,"d":"0.0"},0,0,0,1,0,0,0,0,0,0,0,0,0,0,0,0,0,0,0,0,0,0,0,0,{"$nulls":5},{"v":0,"d":"0.0"},1,0,""]
[7,{"$f":"'Wettkampf 1'!B22","v":"Bruns Hendrik"},{"$f":"'Wettkampf 1'!C22","v":"Lähden Jugend I"},null,null,{"v":0,"d":"0.0"},0,0,0,1,0,0,0,0,0,0,0,0,0,0,0,0,0,0,0,0,0,0,0,0,{"$nulls":5},{"v":0,"d":"0.0"},1,0,""]
[8,{"$f":"'Wettkampf 1'!B23","v":"Feldhaus Vanessa"},{"$f":"'Wettkampf 1'!C23","v":"Lähden Jugend I"},null,null,{"v":0,"d":"0.0"},0,0,0,1,0,0,0,0,0,0,0,0,0,0,0,0,0,0,0,0,0,0,0,0,{"$nulls":5},{"v":0,"d":"0.0"},1,0,""]
[9,{"$f":"'Wettkampf 1'!B24","v":"Feldhaus Celien "},{"$f":"'Wettkampf 1'!C24","v":"Lähden Jugend I"},null,null,{"v":0,"d":"0.0"},0,0,0,1,0,0,0,0,0,0,0,0,0,0,0,0,0,0,0,0,0,0,0,0,{"$nulls":5},{"v":0,"d":"0.0"},1,0,""]
[10,{"$f":"'Wettkampf 1'!B25","v":"Stümpler Jan-Luca"},{"$f":"'Wettkampf 1'!C25","v":"Lähden Jugend I"},null,null,{"v":0,"d":"0.0"},0,0,0,1,0,0,0,0,0,0,0,0,0,0,0,0,0,0,0,0,0,0,0,0,{"$nulls":5},{"v":0,"d":"0.0"},1,0,""]
[11,{"$f":"'Wettkampf 1'!B26","v":"Hanneken Maren"},{"$f":"'Wettkampf 1'!C26","v":"Börgerwald"},null,null,{"v":0,"d":"0.0"},0,0,0,0,0,1,0,0,0,0,0,0,0,0,0,0,0,0,0,0,0,0,0,0,{"$nulls":5},{"v":0,"d":"0.0"},1,0,""]
[12,{"$f":"'Wettkampf 1'!B27","v":"Köstering Nele"},{"$f":"'Wettkampf 1'!C27","v":"Börgerwald"},null,null,{"v":0,"d":"0.0"},0,0,0,0,0,1,0,0,0,0,0,0,0,0,0,0,0,0,0,0,0,0,0,0,{"$nulls":5},{"v":0,"d":"0.0"},1,0,""]
[13,{"$f":"'Wettkampf 1'!B28","v":"Lohmann Amy"},{"$f":"'Wettkampf 1'!C28","v":"Börgerwald"},null,null,{"v":0,"d":"0.0"},0,0,0,0,0,1,0,0,0,0,0,0,0,0,0,0,0,0,0,0,0,0,0,0,{"$nulls":5},{"v":0,"d":"0.0"},1,0,""]
[14,{"$f":"'Wettkampf 1'!B29","v":"Schütze 14"},{"$f":"'Wettkampf 1'!C29","v":"Börgerwald"},null,null,{"v":0,"d":"0.0"},0,0,0,0,0,1,0,0,0,0,0,0,0,0,0,0,0,0,0,0,0,0,0,0,{"$nulls":5},{"v":0,"d":"0.0"},1,0,""]
[15,{"$f":"'Wettkampf 1'!B30","v":"Schütze 15"},{"$f":"'Wettkampf 1'!C30","v":"Börgerwald"},null,null,{"v":0,"d":"0.0"},0,0,0,0,0,1,0,0,0,0,0,0,0,0,0,0,0,0,0,0,0,0,0,0,{"$nulls":5},{"v":0,"d":"0.0"},1,0,""]
[16,{"$f":"'Wettkampf 1'!B31","v":"Brandt Mira"},{"$f":"'Wettkampf 1'!C31","v":"Börgermoor"},null,null,{"v":0,"d":"0.0"},0,0,0,0,0,0,0,1,0,0,0,0,0,0,0,0,0,0,0,0,0,0,0,0,{"$nulls":5},{"v":0,"d":"0.0"},1,0,""]
[17,{"$f":"'Wettkampf 1'!B32","v":"Eichhorn Luca"},{"$f":"'Wettkampf 1'!C32","v":"Börgermoor"},null,null,{"v":0,"d":"0.0"},0,0,0,0,0,0,0,1,0,0,0,0,0,0,0,0,0,0,0,0,0,0,0,0,{"$nulls":5},{"v":0,"d":"0.0"},1,0,""]
[18,{"$f":"'Wettkampf 1'!B33","v":"Kohnen Saskia"},{"$f":"'Wettkampf 1'!C33","v":"Börgermoor"},null,null,{"v":0,"d":"0.0"},0,0,0,0,0,0,0,1,0,0,0,0,0,0,0,0,0,0,0,0,0,0,0,0,{"$nulls":5},{"v":0,"d":"0.0"},1,0,""]
[19,{"$f":"'Wettkampf 1'!B34","v":"Schütze 19"},{"$f":"'Wettkampf 1'!C34","v":"Börgermoor"},null,null,{"v":0,"d":"0.0"},0,0,0,0,0,0,0,1,0,0,0,0,0,0,0,0,0,0,0,0,0,0,0,0,{"$nulls":5},{"v":0,"d":"0.0"},1,0,""]
[20,{"$f":"'Wettkampf 1'!B35","v":"Schütze 20"},{"$f":"'Wettkampf 1'!C35","v":"Börgermoor"},null,null,{"v":0,"d":"0.0"},0,0,0,0,0,0,0,1,0,0,0,0,0,0,0,0,0,0,0,0,0,0,0,0,{"$nulls":5},{"v":0,"d":"0.0"},1,0,""]
[21,{"$f":"'Wettkampf 1'!B36","v":"Runde Marcel"},{"$f":"'Wettkampf 1'!C36","v":"Spahnharrenstätte"},null,null,{"v":0,"d":"0.0"},0,0,0,0,0,0,0,0,0,1,0,0,0,0,0,0,0,0,0,0,0,0,0,0,{"$nulls":5},{"v":0,"d":"0.0"},1,0,""]
[22,{"$f":"'Wettkampf 1'!B37","v":"Leis Fynn Lucas "},{"$f":"'Wettkampf 1'!C37","v":"Spahnharrenstätte"},null,null,{"v":0,"d":"0.0"},0,0,0,0,0,0,0,0,0,1,0,0,0,0,0,0,0,0,0,0,0,0,0,0,{"$nulls":5},{"v":0,"d":"0.0"},1,0,""]
[23,{"$f":"'Wettkampf 1'!B38","v":"Jansen Lars"},{"$f":"'Wettkampf 1'!C38","v":"Spahnharrenstätte"},null,null,{"v":0,"d":"0.0"},0,0,0,0,0,0,0,0,0,1,0,0,0,0,0,0,0,0,0,0,0,0,0,0,{"$nulls":5},{"v":0,"d":"0.0"},1,0,""]
[24,{"$f":"'Wettkampf 1'!B39","v":"Köster Thilo"},{"$f":"'Wettkampf 1'!C39","v":"Spahnharrenstätte"},null,null,{"v":0,"d":"0.0"},0,0,0,0,0,0,0,0,0,1,0,0,0,0,0,0,0,0,0,0,0,0,0,0,{"$nulls":5},{"v":0,"d":"0.0"},1,0,""]
[25,{"$f":"'Wettkampf 1'!B40","v":"Schütze 25"},{"$f":"'Wettkampf 1'!C40","v":"Spahnharrenstätte"},null,null,{"v":0,"d":"0.0"},0,0,0,0,0,0,0,0,0,1,0,0,0,0,0,0,0,0,0,0,0,0,0,0,{"$nulls":5},{"v":0,"d":"0.0"},1,0,""]
[26,{"$f":"'Wettkampf 1'!B41","v":"Dolling Leon"},{"$f":"'Wettkampf 1'!C41","v":"Lorup"},null,null,{"v":0,"d":"0.0"},0,0,0,0,0,0,0,0,0,0,0,1,0,0,0,0,0,0,0,0,0,0,0,0,{"$nulls":5},{"v":0,"d":"0.0"},1,0,""]
[27,{"$f":"'Wettkampf 1'!B42","v":"Schütze 27"},{"$f":"'Wettkampf 1'!C42","v":"Lorup"},null,null,{"v":0,"d":"0.0"},0,0,0,0,0,0,0,0,0,0,0,1,0,0,0,0,0,0,0,0,0,0,0,0,{"$nulls":5},{"v":0,"d":"0.0"},1,0,""]
[28,{"$f":"'Wettkampf 1'!B43","v":"Schütze 28"},{"$f":"'Wettkampf 1'!C43","v":"Lorup"},null,null,{"v":0,"d":"0.0"},0,0,0,0,0,0,0,0,0,0,0,1,0,0,0,0,0,0,0,0,0,0,0,0,{"$nulls":5},{"v":0,"d":"0.0"},1,0,""]
[29,{"$f":"'Wettkampf 1'!B44","v":"Schütze 29"},{"$f":"'Wettkampf 1'!C44","v":"Lorup"},null,null,{"v":0,"d":"0.0"},0,0,0,0,0,0,0,0,0,0,0,1,0,0,0,0,0,0,0,0,0,0,0,0,{"$nulls":5},{"v":0,"d":"0.0"},1,0,""]
[30,{"$f":"'Wettkampf 1'!B45","v":"Schütze 30"},{"$f":"'Wettkampf 1'!C45","v":"Lorup"},null,null,{"v":0,"d":"0.0"},0,0,0,0,0,0,0,0,0,0,0,1,0,0,0,0,0,0,0,0,0,0,0,0,{"$nulls":5},{"v":0,"d":"0.0"},1,0,""]
[31,{"$f":"'Wettkampf 1'!B46","v":"Wilken Noah"},{"$f":"'Wettkampf 1'!C46","v":"Lahn"},null,null,{"v":0,"d":"0.0"},0,0,0,0,0,0,0,0,0,0,0,0,0,1,0,0,0,0,0,0,0,0,0,0,{"$nulls":5},{"v":0,"d":"0.0"},1,0,""]
[32,{"$f":"'Wettkampf 1'!B47","v":"Schulz Mika"},{"$f":"'Wettkampf 1'!C47","v":"Lahn"},null,null,{"v":0,"d":"0.0"},0,0,0,0,0,0,0,0,0,0,0,0,0,1,0,0,0,0,0,0,0,0,0,0,{"$nulls":5},{"v":0,"d":"0.0"},1,0,""]
[33,{"$f":"'Wettkampf 1'!B48","v":"Schütze 33"},{"$f":"'Wettkampf 1'!C48","v":"Lahn"},null,null,{"v":0,"d":"0.0"},0,0,0,0,0,0,0,0,0,0,0,0,0,1,0,0,0,0,0,0,0,0,0,0,{"$nulls":5},{"v":0,"d":"0.0"},1,0,""]
[34,{"$f":"'Wettkampf 1'!B49","v":"Schütze 34"},{"$f":"'Wettkampf 1'!C49","v":"Lahn"},null,null,{"v":0,"d":"0.0"},0,0,0,0,0,0,0,0,0,0,0,0,0,1,0,0,0,0,0,0,0,0,0,0,{"$nulls":5},{"v":0,"d":"0.0"},1,0,""]
[35,{"$f":"'Wettkampf 1'!B50","v":"Schütze 35"},{"$f":"'Wettkampf 1'!C50","v":"Lahn"},null,null,{"v":0,"d":"0.0"},0,0,0,0,0,0,0,0,0,0,0,0,0,1,0,0,0,0,0,0,0,0,0,0,{"$nulls":5},{"v":0,"d":"0.0"},1,0,""]
[36,{"$f":"'Wettkampf 1'!B51","v":"Tharner Kim"},{"$f":"'Wettkampf 1'!C51","v":"Sögel"},null,null,{"v":0,"d":"0.0"},0,0,0,0,0,0,0,0,0,0,0,0,0,0,0,1,0,0,0,0,0,0,0,0,{"$nulls":5},{"v":0,"d":"0.0"},1,0,""]
[37,{"$f":"'Wettkampf 1'!B52","v":"Schütze 37"},{"$f":"'Wettkampf 1'!C52","v":"Sögel"},null,null,{"v":0,"d":"0.0"},0,0,0,0,0,0,0,0,0,0,0,0,0,0,0,1,0,0,0,0,0,0,0,0,{"$nulls":5},{"v":0,"d":"0.0"}]
[38,{"$f":"'Wettkampf 1'!B53","v":"Schütze 38"},{"$f":"'Wettkampf 1'!C53","v":"Sögel"},null,null,{"v":0,"d":"0.0"},0,0,0,0,0,0,0,0,0,0,0,0,0,0,0,1,0,0,0,0,0,0,0,0,{"$nulls":5},{"v":0,"d":"0.0"}]
[39,{"$f":"'Wettkampf 1'!B54","v":"Schütze 39"},{"$f":"'Wettkampf 1'!C54","v":"Sögel"},null,null,{"v":0,"d":"0.0"},0,0,0,0,0,0,0,0,0,0,0,0,{"$f":"IF($C54=$B$8,$F54,0)","v":0},{"$f":"(IF(AND($E54=\"\",$C54=$B$8),1,0))","v":0},{"$f":"IF($C54=$B$9,$F54,0)","v":0},{"$f":"(IF(AND($E54=\"\",$C54=$B$9),1,0))","v":1},{"$f":"IF($C54=$B$10,$F54,0)","v":0},{"$f":"(IF(AND($E54=\"\",$C54=$B$10),1,0))","v":0},{"$f":"IF($C54=$B$11,$F54,0)","v":0},{"$f":"(IF(AND($E54=\"\",$C54=$B$11),1,0))","v":0},{"$f":"IF($C54=$B$12,$F54,0)","v":0},{"$f":"(IF(AND($E54=\"\",$C54=$B$12),1,0))","v":0},{"$f":"IF($C54=$B$13,$F54,0)","v":0},{"$f":"(IF(AND($E54=\"\",$C54=$B$13),1,0))","v":0},{"$nulls":5},{"v":0,"d":"0.0"}]
[40,{"$f":"'Wettkampf 1'!B55","v":"Schütze 40"},{"$f":"'Wettkampf 1'!C55","v":"Sögel"},null,null,{"v":0,"d":"0.0"},0,0,0,0,0,0,0,0,0,0,0,0,0,0,0,1,0,0,0,0,0,0,0,0,{"$nulls":5},{"v":0,"d":"0.0"}]
[41,{"$f":"'Wettkampf 1'!B56","v":"Schütze 41"},{"$f":"'Wettkampf 1'!C56","v":"Verein IX"},null,null,{"v":0,"d":"0.0"},0,0,0,0,0,0,0,0,0,0,0,0,0,0,0,0,0,1,0,0,0,0,0,0,{"$nulls":5},{"v":0,"d":"0.0"}]
[42,{"$f":"'Wettkampf 1'!B57","v":"Schütze 42"},{"$f":"'Wettkampf 1'!C57","v":"Verein IX"},null,null,{"v":0,"d":"0.0"},0,0,0,0,0,0,0,0,0,0,0,0,0,0,0,0,0,1,0,0,0,0,0,0,{"$nulls":5},{"v":0,"d":"0.0"}]
[43,{"$f":"'Wettkampf 1'!B58","v":"Schütze 43"},{"$f":"'Wettkampf 1'!C58","v":"Verein IX"},null,null,{"v":0,"d":"0.0"},0,0,0,0,0,0,0,0,0,0,0,0,0,0,0,0,0,1,0,0,0,0,0,0,{"$nulls":5},{"v":0,"d":"0.0"}]
[44,{"$f":"'Wettkampf 1'!B59","v":"Schütze 44"},{"$f":"'Wettkampf 1'!C59","v":"Verein IX"},null,null,{"v":0,"d":"0.0"},0,0,0,0,0,0,0,0,0,0,0,0,0,0,0,0,0,1,0,0,0,0,0,0,{"$nulls":5},{"v":0,"d":"0.0"}]
[45,{"$f":"'Wettkampf 1'!B60","v":"Schütze 45"},{"$f":"'Wettkampf 1'!C60","v":"Verein IX"},null,null,{"v":0,"d":"0.0"},0,0,0,0,0,0,0,0,0,0,0,0,0,0,0,0,0,1,0,0,0,0,0,0,{"$nulls":5},{"v":0,"d":"0.0"}]
[46,{"$f":"'Wettkampf 1'!B61","v":"Schütze 46"},{"$f":"'Wettkampf 1'!C61","v":"Verein X"},null,null,{"v":0,"d":"0.0"},0,0,0,0,0,0,0,0,0,0,0,0,0,0,0,0,0,0,0,1,0,0,0,0,{"$nulls":5},{"v":0,"d":"0.0"}]
[47,{"$f":"'Wettkampf 1'!B62","v":"Schütze 47"},{"$f":"'Wettkampf 1'!C62","v":"Verein X"},null,null,{"v":0,"d":"0.0"},0,0,0,0,0,0,0,0,0,0,0,0,0,0,0,0,0,0,0,1,0,0,0,0,{"$nulls":5},{"v":0,"d":"0.0"}]
[48,{"$f":"'Wettkampf 1'!B63","v":"Schütze 48"},{"$f":"'Wettkampf 1'!C63","v":"Verein X"},null,null,{"v":0,"d":"0.0"},0,0,0,0,0,0,0,0,0,0,0,0,0,0,0,0,0,0,0,1,0,0,0,0,{"$nulls":5},{"v":0,"d":"0.0"}]
[49,{"$f":"'Wettkampf 1'!B64","v":"Schütze 49"},{"$f":"'Wettkampf 1'!C64","v":"Verein X"},null,null,{"v":0,"d":"0.0"},0,0,0,0,0,0,0,0,0,0,0,0,0,0,0,0,0,0,0,1,0,0,0,0,{"$nulls":5},{"v":0,"d":"0.0"}]
[50,{"$f":"'Wettkampf 1'!B65","v":"Schütze 50"},{"$f":"'Wettkampf 1'!C65","v":"Verein X"},null,null,{"v":0,"d":"0.0"},0,0,0,0,0,0,0,0,0,0,0,0,0,0,0,0,0,0,0,1,0,0,0,0,{"$nulls":5},{"v":0,"d":"0.0"}]
[51,{"$f":"'Wettkampf 1'!B66","v":"Schütze 51"},{"$f":"'Wettkampf 1'!C66","v":"Verein XI"},null,null,{"v":0,"d":"0.0"},0,0,0,0,0,0,0,0,0,0,0,0,0,0,0,0,0,0,0,0,0,1,0,0,{"$nulls":5},{"v":0,"d":"0.0"}]
[52,{"$f":"'Wettkampf 1'!B67","v":"Schütze 52"},{"$f":"'Wettkampf 1'!C67","v":"Verein XI"},null,null,{"v":0,"d":"0.0"},0,0,0,0,0,0,0,0,0,0,0,0,0,0,0,0,0,0,0,0,0,1,0,0,{"$nulls":5},{"v":0,"d":"0.0"}]
[53,{"$f":"'Wettkampf 1'!B68","v":"Schütze 53"},{"$f":"'Wettkampf 1'!C68","v":"Verein XI"},null,null,{"v":0,"d":"0.0"},0,0,0,0,0,0,0,0,0,0,0,0,0,0,0,0,0,0,0,0,0,1,0,0,{"$nulls":5},{"v":0,"d":"0.0"}]
[54,{"$f":"'Wettkampf 1'!B69","v":"Schütze 54"},{"$f":"'Wettkampf 1'!C69","v":"Verein XI"},null,null,{"v":0,"d":"0.0"},0,0,0,0,0,0,0,0,0,0,0,0,0,0,0,0,0,0,0,0,0,1,0,0,{"$nulls":5},{"v":0,"d":"0.0"}]
[55,{"$f":"'Wettkampf 1'!B70","v":"Schütze 55"},{"$f":"'Wettkampf 1'!C70","v":"Verein XI"},null,null,{"v":0,"d":"0.0"},0,0,0,0,0,0,0,0,0,0,0,0,0,0,0,0,0,0,0,0,0,1,0,0,{"$nulls":5},{"v":0,"d":"0.0"}]
[56,{"$f":"'Wettkampf 1'!B71","v":"Schütze 56"},{"$f":"'Wettkampf 1'!C71","v":"Verein XII"},null,null,{"v":0,"d":"0.0"},0,0,0,0,0,0,0,0,0,0,0,0,0,0,0,0,0,0,0,0,0,0,0,1,{"$nulls":5},{"v":0,"d":"0.0"}]
[57,{"$f":"'Wettkampf 1'!B72","v":"Schütze 57"},{"$f":"'Wettkampf 1'!C72","v":"Verein XII"},null,null,{"v":0,"d":"0.0"},0,0,0,0,0,0,0,0,0,0,0,0,0,0,0,0,0,0,0,0,0,0,0,1,{"$nulls":5},{"v":0,"d":"0.0"}]
[58,{"$f":"'Wettkampf 1'!B73","v":"Schütze 58"},{"$f":"'Wettkampf 1'!C73","v":"Verein XII"},null,null,{"v":0,"d":"0.0"},0,0,0,0,0,0,0,0,0,0,0,0,0,0,0,0,0,0,0,0,0,0,0,1,{"$nulls":5},{"v":0,"d":"0.0"}]
[59,{"$f":"'Wettkampf 1'!B74","v":"Schütze 59"},{"$f":"'Wettkampf 1'!C74","v":"Verein XII"},null,null,{"v":0,"d":"0.0"},0,0,0,0,0,0,0,0,0,0,0,0,0,0,0,0,0,0,0,0,0,0,0,1,{"$nulls":5},{"v":0,"d":"0.0"}]
[60,{"$f":"'Wettkampf 1'!B75","v":"Schütze 60"},{"$f":"'Wettkampf 1'!C75","v":"Verein XII"},null,null,{"v":0,"d":"0.0"},0,0,0,0,0,0,0,0,0,0,0,0,0,0,0,0,0,0,0,0,0,0,0,1,{"$nulls":5},{"v":0,"d":"0.0"}]
[{"$nulls":6},{"$f":"LARGE(G16:G75,1)+LARGE(G16:G75,2)+LARGE(G16:G75,3)","v":0},{"$f":"SUM(H16:H75)","v":5},{"$f":"LARGE(I16:I75,1)+LARGE(I16:I75,2)+LARGE(I16:I75,3)","v":0},{"$f":"SUM(J16:J75)","v":5},{"$f":"LARGE(K16:K75,1)+LARGE(K16:K75,2)+LARGE(K16:K75,3)","v":0},{"$f":"SUM(L16:L75)","v":5},{"$f":"LARGE(M16:M75,1)+LARGE(M16:M75,2)+LARGE(M16:M75,3)","v":0},{"$f":"SUM(N16:N75)","v":5},{"$f":"LARGE(O16:O75,1)+LARGE(O16:O75,2)+LARGE(O16:O75,3)","v":0},{"$f":"SUM(P16:P75)","v":5},{"$f":"LARGE(Q16:Q75,1)+LARGE(Q16:Q75,2)+LARGE(Q16:Q75,3)","v":0},{"$f":"SUM(R16:R75)","v":5},{"$f":"LARGE(S16:S75,1)+LARGE(S16:S75,2)+LARGE(S16:S75,3)","v":0},{"$f":"SUM(T16:T75)","v":5},{"$f":"LARGE(U16:U75,1)+LARGE(U16:U75,2)+LARGE(U16:U75,3)","v":0},{"$f":"SUM(V16:V75)","v":5},{"$f":"LARGE(W16:W75,1)+LARGE(W16:W75,2)+LARGE(W16:W75,3)","v":0},{"$f":"SUM(X16:X75)","v":5},{"$f":"LARGE(Y16:Y75,1)+LARGE(Y16:Y75,2)+LARGE(Y16:Y75,3)","v":0},{"$f":"SUM(Z16:Z75)","v":5},{"$f":"LARGE(AA16:AA75,1)+LARGE(AA16:AA75,2)+LARGE(AA16:AA75,3)","v":0},{"$f":"SUM(AB16:AB75)","v":5},{"$f":"LARGE(AC16:AC75,1)+LARGE(AC16:AC75,2)+LARGE(AC16:AC75,3)","v":0},{"$f":"SUM(AD16:AD75)","v":5}]
[null,null,"per Email an: sk-huemmling@gmx.de"]

{"sheet":"12","index":12,"n_rows":77,"n_cols":39,"rows_kept":77,"merged":[[0,34,0,35],[1,34,1,35],[4,34,4,35],[5,34,5,35],[6,34,6,35],[14,32,14,35]]}
[null,"Verein / Gruppe",null,"Ergebnisse",{"$nulls":29},"Austragungsort:",{"$f":"Übersicht!Q4","v":0}]
[1,{"$f":"'Wettkampf 1'!B2","v":"Esterwegen"},null,{"$f":"G76","v":{"v":0,"d":"0.0"}},{"$f":"IF(H76>4,\"Es sind zu viele Schützen in Wertung!\",\" \")","v":"Es sind zu viele Schützen in Wertung!"},{"$nulls":28},"Wettkampftag:",{"$f":"Übersicht!Q3","v":0}]
[2,{"$f":"'Wettkampf 1'!B3","v":"Lähden Jugend I"},null,{"$f":"I76","v":{"v":0,"d":"0.0"}},{"$f":"IF(J76>4,\"Es sind zu viele Schützen in Wertung!\",\" \")","v":"Es sind zu viele Schützen in Wertung!"}]
[3,{"$f":"'Wettkampf 1'!B4","v":"Börgerwald"},null,{"$f":"K76","v":{"v":0,"d":"0.0"}},{"$f":"IF(L76>4,\"Es sind zu viele Schützen in Wertung!\",\" \")","v":"Es sind zu viele Schützen in Wertung!"},{"$nulls":30},"Ansprechpartner für Rückfragen:"]
[4,{"$f":"'Wettkampf 1'!B5","v":"Börgermoor"},null,{"$f":"M76","v":{"v":0,"d":"0.0"}},{"$f":"IF(N76>4,\"Es sind zu viele Schützen in Wertung!\",\" \")","v":"Es sind zu viele Schützen in Wertung!"},{"$nulls":28},"Name:"]
[5,{"$f":"'Wettkampf 1'!B6","v":"Spahnharrenstätte"},null,{"$f":"O76","v":{"v":0,"d":"0.0"}},{"$f":"IF(P76>4,\"Es sind zu viele Schützen in Wertung!\",\" \")","v":"Es sind zu viele Schützen in Wertung!"},{"$nulls":28},"Tel:"]
[6,{"$f":"'Wettkampf 1'!B7","v":"Lorup"},null,{"$f":"Q76","v":{"v":0,"d":"0.0"}},{"$f":"IF(R76>4,\"Es sind zu viele Schützen in Wertung!\",\" \")","v":"Es sind zu viele Schützen in Wertung!"},{"$nulls":28},"Standaufsicht:","eintragen"]
[7,{"$f":"'Wettkampf 1'!B8","v":"Lahn"},null,{"$f":"S76","v":{"v":0,"d":"0.0"}},{"$f":"IF(T76>4,\"Es sind zu viele Schützen in Wertung!\",\" \")","v":"Es sind zu viele Schützen in Wertung!"}]
[8,{"$f":"'Wettkampf 1'!B9","v":"Sögel"},null,{"$f":"U76","v":{"v":0,"d":"0.0"}},{"$f":"IF(V76>4,\"Es sind zu viele Schützen in Wertung!\",\" \")","v":"Es sind zu viele Schützen in Wertung!"}]
[9,{"$f":"'Wettkampf 1'!B10","v":"Verein IX"},null,{"$f":"W76","v":{"v":0,"d":"0.0"}},{"$f":"IF(X76>4,\"Es sind zu viele Schützen in Wertung!\",\" \")","v":"Es sind zu viele Schützen in Wertung!"}]
[10,{"$f":"'Wettkampf 1'!B11","v":"Verein X"},null,{"$f":"Y76","v":{"v":0,"d":"0.0"}},{"$f":"IF(Z76>4,\"Es sind zu viele Schützen in Wertung!\",\" \")","v":"Es sind zu viele Schützen in Wertung!"}]
[11,{"$f":"'Wettkampf 1'!B12","v":"Verein XI"},null,{"$f":"AA76","v":{"v":0,"d":"0.0"}},{"$f":"IF(AB76>4,\"Es sind zu viele Schützen in Wertung!\",\" \")","v":"Es sind zu viele Schützen in Wertung!"}]
[12,{"$f":"'Wettkampf 1'!B13","v":"Verein XII"},null,{"$f":"AC76","v":{"v":0,"d":"0.0"}},{"$f":"IF(AD76>4,\"Es sind zu viele Schützen in Wertung!\",\" \")","v":"Es sind zu viele Schützen in Wertung!"}]
[]
[null,"Einzelergebnisse:","Verein / Gruppe","Ergebnisse (mindestens 0 eintragen)","AW? Dann x eintippen",null,"Verein 1",null,"Verein 2",null,"Verein 3",null,"Verein 4",null,"Verein 5",null,"Verein 6",null,"Verein 7",null,"Verein 8",null,"Verein 9",null,"Verein 10",null,"Verein 11",null,"Verein 12",{"$nulls":3},"Proberechnung bei Streifen:"]
[1,{"$f":"'Wettkampf 1'!B16","v":"Gedecksnis Stefan"},{"$f":"'Wettkampf 1'!C16","v":"Esterwegen"},null,null,{"$f":"IF(E16=\"x\",\"0\",D16)","v":{"v":0,"d":"0.0"}},{"$f":"IF(C16=$B$2,F16,0)","v":0},{"$f":"(IF(AND($E16=\"\",$C16=$B$2),1,0))","v":1},{"$f":"IF($C16=$B$3,$F16,0)","v":0},{"$f":"(IF(AND($E16=\"\",$C16=$B$3),1,0))","v":0},{"$f":"IF($C16=$B$4,F16,0)","v":0},{"$f":"(IF(AND($E16=\"\",$C16=$B$4),1,0))","v":0},{"$f":"IF($C16=$B$5,F16,0)","v":0},{"$f":"(IF(AND($E16=\"\",$C16=$B$5),1,0))","v":0},{"$f":"IF($C16=$B$6,F16,0)","v":0},{"$f":"(IF(AND($E16=\"\",$C16=$B$6),1,0))","v":0},{"$f":"IF($C16=$B$7,F16,0)","v":0},{"$f":"(IF(AND($E16=\"\",$C16=$B$7),1,0))","v":0},{"$f":"IF($C16=$B$8,$F16,0)","v":0},{"$f":"(IF(AND($E16=\"\",$C16=$B$8),1,0))","v":0},{"$f":"IF($C16=$B$9,$F16,0)","v":0},{"$f":"(IF(AND($E16=\"\",$C16=$B$9),1,0))","v":0},{"$f":"IF($C16=$B$10,$F16,0)","v":0},{"$f":"(IF(AND($E16=\"\",$C16=$B$10),1,0))","v":0},{"$f":"IF($C16=$B$11,$F16,0)","v":0},{"$f":"(IF(AND($E16=\"\",$C16=$B$11),1,0))","v":0},{"$f":"IF($C16=$B$12,$F16,0)","v":0},{"$f":"(IF(AND($E16=\"\",$C16=$B$12),1,0))","v":0},{"$f":"IF($C16=$B$13,$F16,0)","v":0},{"$f":"(IF(AND($E16=\"\",$C16=$B$13),1,0))","v":0},{"$nulls":5},{"$f":"SUM(AG16:AI16)","v":{"v":0,"d":"0.0"}},{"$f":"IF(AJ16=D16,1,0)","v":1},{"$f":"IF(AJ16=0,0,1)","v":0},{"$f":"IF(AK16+AL16=2,\"Korrekt\",\"\")","v":""}]
[2,{"$f":"'Wettkampf 1'!B17","v":"Wübben Jasper"},{"$f":"'Wettkampf 1'!C17","v":"Esterwegen"},null,null,{"$f":"IF(E17=\"x\",\"0\",D17)","v":{"v":0,"d":"0.0"}},{"$f":"IF(C17=$B$2,F17,0)","v":0},{"$f":"(IF(AND($E17=\"\",$C17=$B$2),1,0))","v":1},{"$f":"IF($C17=$B$3,F17,0)","v":0},{"$f":"(IF(AND($E17=\"\",$C17=$B$3),1,0))","v":0},{"$f":"IF($C17=$B$4,F17,0)","v":0},{"$f":"(IF(AND($E17=\"\",$C17=$B$4),1,0))","v":0},{"$f":"IF($C17=$B$5,F17,0)","v":0},{"$f":"(IF(AND($E17=\"\",$C17=$B$5),1,0))","v":0},{"$f":"IF($C17=$B$6,F17,0)","v":0},{"$f":"(IF(AND($E17=\"\",$C17=$B$6),1,0))","v":0},{"$f":"IF($C17=$B$7,F17,0)","v":0},{"$f":"(IF(AND($E17=\"\",$C17=$B$7),1,0))","v":0},{"$f":"IF($C17=$B$8,$F17,0)","v":0},{"$f":"(IF(AND($E17=\"\",$C17=$B$8),1,0))","v":0},{"$f":"IF($C17=$B$9,$F17,0)","v":0},{"$f":"(IF(AND($E17=\"\",$C17=$B$9),1,0))","v":0},{"$f":"IF($C17=$B$10,$F17,0)","v":0},{"$f":"(IF(AND($E17=\"\",$C17=$B$10),1,0))","v":0},{"$f":"IF($C17=$B$11,$F17,0)","v":0},{"$f":"(IF(AND($E17=\"\",$C17=$B$11),1,0))","v":0},{"$f":"IF($C17=$B$12,$F17,0)","v":0},{"$f":"(IF(AND($E17=\"\",$C17=$B$12),1,0))","v":0},{"$f":"IF($C17=$B$13,$F17,0)","v":0},{"$f":"(IF(AND($E17=\"\",$C17=$B$13),1,0))","v":0},{"$nulls":5},{"$f":"SUM(AG17:AI17)","v":{"v":0,"d":"0.0"}},{"$f":"IF(AJ17=D17,1,0)","v":1},{"$f":"IF(AJ17=0,0,1)","v":0},{"$f":"IF(AK17+AL17=2,\"Korrekt\",\"\")","v":""}]
[3,{"$f":"'Wettkampf 1'!B18","v":"Engbers Julian"},{"$f":"'Wettkampf 1'!C18","v":"Esterwegen"},null,null,{"v":0,"d":"0.0"},0,1,0,0,0,0,0,0,0,0,0,0,0,0,0,0,0,0,0,0,0,0,0,0,{"$nulls":5},{"v":0,"d":"0.0"},1,0,""]
[4,{"$f":"'Wettkampf 1'!B19","v":"Meyer Johan"},{"$f":"'Wettkampf 1'!C19","v":"Esterwegen"},null,null,{"v":0,"d":"0.0"},0,1,0,0,0,0,0,0,0,0,0,0,0,0,0,0,0,0,0,0,0,0,0,0,{"$nulls":5},{"v":0,"d":"0.0"},1,0,""]
[5,{"$f":"'Wettkampf 1'!B20","v":"Schütze 5"},{"$f":"'Wettkampf 1'!C20","v":"Esterwegen"},null,null,{"v":0,"d":"0.0"},0,1,0,0,0,0,0,0,0,0,0,0,0,0,0,0,0,0,0,0,0,0,0,0,{"$nulls":5},{"v":0,"d":"0.0"},1,0,""]
[6,{"$f":"'Wettkampf 1'!B21","v":"Strüwing Inja"},{"$f":"'Wettkampf 1'!C21","v":"Lähden Jugend I"},null,null,{"v":0,"d":"0.0"},0,0,0,1,0,0,0,0,0,0,0,0,0,0,0,0,0,0,0,0,0,0,0,0,{"$nulls":5},{"v":0,"d":"0.0"},1,0,""]
[7,{"$f":"'Wettkampf 1'!B22","v":"Bruns Hendrik"},{"$f":"'Wettkampf 1'!C22","v":"Lähden Jugend I"},null,null,{"v":0,"d":"0.0"},0,0,0,1,0,0,0,0,0,0,0,0,0,0,0,0,0,0,0,0,0,0,0,0,{"$nulls":5},{"v":0,"d":"0.0"},1,0,""]
[8,{"$f":"'Wettkampf 1'!B23","v":"Feldhaus Vanessa"},{"$f":"'Wettkampf 1'!C23","v":"Lähden Jugend I"},null,null,{"v":0,"d":"0.0"},0,0,0,1,0,0,0,0,0,0,0,0,0,0,0,0,0,0,0,0,0,0,0,0,{"$nulls":5},{"v":0,"d":"0.0"},1,0,""]
[9,{"$f":"'Wettkampf 1'!B24","v":"Feldhaus Celien "},{"$f":"'Wettkampf 1'!C24","v":"Lähden Jugend I"},null,null,{"v":0,"d":"0.0"},0,0,0,1,0,0,0,0,0,0,0,0,0,0,0,0,0,0,0,0,0,0,0,0,{"$nulls":5},{"v":0,"d":"0.0"},1,0,""]
[10,{"$f":"'Wettkampf 1'!B25","v":"Stümpler Jan-Luca"},{"$f":"'Wettkampf 1'!C25","v":"Lähden Jugend I"},null,null,{"v":0,"d":"0.0"},0,0,0,1,0,0,0,0,0,0,0,0,0,0,0,0,0,0,0,0,0,0,0,0,{"$nulls":5},{"v":0,"d":"0.0"},1,0,""]
[11,{"$f":"'Wettkampf 1'!B26","v":"Hanneken Maren"},{"$f":"'Wettkampf 1'!C26","v":"Börgerwald"},null,null,{"v":0,"d":"0.0"},0,0,0,0,0,1,0,0,0,0,0,0,0,0,0,0,0,0,0,0,0,0,0,0,{"$nulls":5},{"v":0,"d":"0.0"},1,0,""]
[12,{"$f":"'Wettkampf 1'!B27","v":"Köstering Nele"},{"$f":"'Wettkampf 1'!C27","v":"Börgerwald"},null,null,{"v":0,"d":"0.0"},0,0,0,0,0,1,0,0,0,0,0,0,0,0,0,0,0,0,0,0,0,0,0,0,{"$nulls":5},{"v":0,"d":"0.0"},1,0,""]
[13,{"$f":"'Wettkampf 1'!B28","v":"Lohmann Amy"},{"$f":"'Wettkampf 1'!C28","v":"Börgerwald"},null,null,{"v":0,"d":"0.0"},0,0,0,0,0,1,0,0,0,0,0,0,0,0,0,0,0,0,0,0,0,0,0,0,{"$nulls":5},{"v":0,"d":"0.0"},1,0,""]
[14,{"$f":"'Wettkampf 1'!B29","v":"Schütze 14"},{"$f":"'Wettkampf 1'!C29","v":"Börgerwald"},null,null,{"v":0,"d":"0.0"},0,0,0,0,0,1,0,0,0,0,0,0,0,0,0,0,0,0,0,0,0,0,0,0,{"$nulls":5},{"v":0,"d":"0.0"},1,0,""]
[15,{"$f":"'Wettkampf 1'!B30","v":"Schütze 15"},{"$f":"'Wettkampf 1'!C30","v":"Börgerwald"},null,null,{"v":0,"d":"0.0"},0,0,0,0,0,1,0,0,0,0,0,0,0,0,0,0,0,0,0,0,0,0,0,0,{"$nulls":5},{"v":0,"d":"0.0"},1,0,""]
[16,{"$f":"'Wettkampf 1'!B31","v":"Brandt Mira"},{"$f":"'Wettkampf 1'!C31","v":"Börgermoor"},null,null,{"v":0,"d":"0.0"},0,0,0,0,0,0,0,1,0,0,0,0,0,0,0,0,0,0,0,0,0,0,0,0,{"$nulls":5},{"v":0,"d":"0.0"},1,0,""]
[17,{"$f":"'Wettkampf 1'!B32","v":"Eichhorn Luca"},{"$f":"'Wettkampf 1'!C32","v":"Börgermoor"},null,null,{"v":0,"d":"0.0"},0,0,0,0,0,0,0,1,0,0,0,0,0,0,0,0,0,0,0,0,0,0,0,0,{"$nulls":5},{"v":0,"d":"0.0"},1,0,""]
[18,{"$f":"'Wettkampf 1'!B33","v":"Kohnen Saskia"},{"$f":"'Wettkampf 1'!C33","v":"Börgermoor"},null,null,{"v":0,"d":"0.0"},0,0,0,0,0,0,0,1,0,0,0,0,0,0,0,0,0,0,0,0,0,0,0,0,{"$nulls":5},{"v":0,"d":"0.0"},1,0,""]
[19,{"$f":"'Wettkampf 1'!B34","v":"Schütze 19"},{"$f":"'Wettkampf 1'!C34","v":"Börgermoor"},null,null,{"v":0,"d":"0.0"},0,0,0,0,0,0,0,1,0,0,0,0,0,0,0,0,0,0,0,0,0,0,0,0,{"$nulls":5},{"v":0,"d":"0.0"},1,0,""]
[20,{"$f":"'Wettkampf 1'!B35","v":"Schütze 20"},{"$f":"'Wettkampf 1'!C35","v":"Börgermoor"},null,null,{"v":0,"d":"0.0"},0,0,0,0,0,0,0,1,0,0,0,0,0,0,0,0,0,0,0,0,0,0,0,0,{"$nulls":5},{"v":0,"d":"0.0"},1,0,""]
[21,{"$f":"'Wettkampf 1'!B36","v":"Runde Marcel"},{"$f":"'Wettkampf 1'!C36","v":"Spahnharrenstätte"},null,null,{"v":0,"d":"0.0"},0,0,0,0,0,0,0,0,0,1,0,0,0,0,0,0,0,0,0,0,0,0,0,0,{"$nulls":5},{"v":0,"d":"0.0"},1,0,""]
[22,{"$f":"'Wettkampf 1'!B37","v":"Leis Fynn Lucas "},{"$f":"'Wettkampf 1'!C37","v":"Spahnharrenstätte"},null,null,{"v":0,"d":"0.0"},0,0,0,0,0,0,0,0,0,1,0,0,0,0,0,0,0,0,0,0,0,0,0,0,{"$nulls":5},{"v":0,"d":"0.0"},1,0,""]
[23,{"$f":"'Wettkampf 1'!B38","v":"Jansen Lars"},{"$f":"'Wettkampf 1'!C38","v":"Spahnharrenstätte"},null,null,{"v":0,"d":"0.0"},0,0,0,0,0,0,0,0,0,1,0,0,0,0,0,0,0,0,0,0,0,0,0,0,{"$nulls":5},{"v":0,"d":"0.0"},1,0,""]
[24,{"$f":"'Wettkampf 1'!B39","v":"Köster Thilo"},{"$f":"'Wettkampf 1'!C39","v":"Spahnharrenstätte"},null,null,{"v":0,"d":"0.0"},0,0,0,0,0,0,0,0,0,1,0,0,0,0,0,0,0,0,0,0,0,0,0,0,{"$nulls":5},{"v":0,"d":"0.0"},1,0,""]
[25,{"$f":"'Wettkampf 1'!B40","v":"Schütze 25"},{"$f":"'Wettkampf 1'!C40","v":"Spahnharrenstätte"},null,null,{"v":0,"d":"0.0"},0,0,0,0,0,0,0,0,0,1,0,0,0,0,0,0,0,0,0,0,0,0,0,0,{"$nulls":5},{"v":0,"d":"0.0"},1,0,""]
[26,{"$f":"'Wettkampf 1'!B41","v":"Dolling Leon"},{"$f":"'Wettkampf 1'!C41","v":"Lorup"},null,null,{"v":0,"d":"0.0"},0,0,0,0,0,0,0,0,0,0,0,1,0,0,0,0,0,0,0,0,0,0,0,0,{"$nulls":5},{"v":0,"d":"0.0"},1,0,""]
[27,{"$f":"'Wettkampf 1'!B42","v":"Schütze 27"},{"$f":"'Wettkampf 1'!C42","v":"Lorup"},null,null,{"v":0,"d":"0.0"},0,0,0,0,0,0,0,0,0,0,0,1,0,0,0,0,0,0,0,0,0,0,0,0,{"$nulls":5},{"v":0,"d":"0.0"},1,0,""]
[28,{"$f":"'Wettkampf 1'!B43","v":"Schütze 28"},{"$f":"'Wettkampf 1'!C43","v":"Lorup"},null,null,{"v":0,"d":"0.0"},0,0,0,0,0,0,0,0,0,0,0,1,0,0,0,0,0,0,0,0,0,0,0,0,{"$nulls":5},{"v":0,"d":"0.0"},1,0,""]
[29,{"$f":"'Wettkampf 1'!B44","v":"Schütze 29"},{"$f":"'Wettkampf 1'!C44","v":"Lorup"},null,null,{"v":0,"d":"0.0"},0,0,0,0,0,0,0,0,0,0,0,1,0,0,0,0,0,0,0,0,0,0,0,0,{"$nulls":5},{"v":0,"d":"0.0"},1,0,""]
[30,{"$f":"'Wettkampf 1'!B45","v":"Schütze 30"},{"$f":"'Wettkampf 1'!C45","v":"Lorup"},null,null,{"v":0,"d":"0.0"},0,0,0,0,0,0,0,0,0,0,0,1,0,0,0,0,0,0,0,0,0,0,0,0,{"$nulls":5},{"v":0,"d":"0.0"},1,0,""]
[31,{"$f":"'Wettkampf 1'!B46","v":"Wilken Noah"},{"$f":"'Wettkampf 1'!C46","v":"Lahn"},null,null,{"v":0,"d":"0.0"},0,0,0,0,0,0,0,0,0,0,0,0,0,1,0,0,0,0,0,0,0,0,0,0,{"$nulls":5},{"v":0,"d":"0.0"},1,0,""]
[32,{"$f":"'Wettkampf 1'!B47","v":"Schulz Mika"},{"$f":"'Wettkampf 1'!C47","v":"Lahn"},null,null,{"v":0,"d":"0.0"},0,0,0,0,0,0,0,0,0,0,0,0,0,1,0,0,0,0,0,0,0,0,0,0,{"$nulls":5},{"v":0,"d":"0.0"},1,0,""]
[33,{"$f":"'Wettkampf 1'!B48","v":"Schütze 33"},{"$f":"'Wettkampf 1'!C48","v":"Lahn"},null,null,{"v":0,"d":"0.0"},0,0,0,0,0,0,0,0,0,0,0,0,0,1,0,0,0,0,0,0,0,0,0,0,{"$nulls":5},{"v":0,"d":"0.0"},1,0,""]
[34,{"$f":"'Wettkampf 1'!B49","v":"Schütze 34"},{"$f":"'Wettkampf 1'!C49","v":"Lahn"},null,null,{"v":0,"d":"0.0"},0,0,0,0,0,0,0,0,0,0,0,0,0,1,0,0,0,0,0,0,0,0,0,0,{"$nulls":5},{"v":0,"d":"0.0"},1,0,""]
[35,{"$f":"'Wettkampf 1'!B50","v":"Schütze 35"},{"$f":"'Wettkampf 1'!C50","v":"Lahn"},null,null,{"v":0,"d":"0.0"},0,0,0,0,0,0,0,0,0,0,0,0,0,1,0,0,0,0,0,0,0,0,0,0,{"$nulls":5},{"v":0,"d":"0.0"},1,0,""]
[36,{"$f":"'Wettkampf 1'!B51","v":"Tharner Kim"},{"$f":"'Wettkampf 1'!C51","v":"Sögel"},null,null,{"v":0,"d":"0.0"},0,0,0,0,0,0,0,0,0,0,0,0,0,0,0,1,0,0,0,0,0,0,0,0,{"$nulls":5},{"v":0,"d":"0.0"},1,0,""]
[37,{"$f":"'Wettkampf 1'!B52","v":"Schütze 37"},{"$f":"'Wettkampf 1'!C52","v":"Sögel"},null,null,{"v":0,"d":"0.0"},0,0,0,0,0,0,0,0,0,0,0,0,0,0,0,1,0,0,0,0,0,0,0,0,{"$nulls":5},{"v":0,"d":"0.0"}]
[38,{"$f":"'Wettkampf 1'!B53","v":"Schütze 38"},{"$f":"'Wettkampf 1'!C53","v":"Sögel"},null,null,{"v":0,"d":"0.0"},0,0,0,0,0,0,0,0,0,0,0,0,0,0,0,1,0,0,0,0,0,0,0,0,{"$nulls":5},{"v":0,"d":"0.0"}]
[39,{"$f":"'Wettkampf 1'!B54","v":"Schütze 39"},{"$f":"'Wettkampf 1'!C54","v":"Sögel"},null,null,{"v":0,"d":"0.0"},0,0,0,0,0,0,0,0,0,0,0,0,{"$f":"IF($C54=$B$8,$F54,0)","v":0},{"$f":"(IF(AND($E54=\"\",$C54=$B$8),1,0))","v":0},{"$f":"IF($C54=$B$9,$F54,0)","v":0},{"$f":"(IF(AND($E54=\"\",$C54=$B$9),1,0))","v":1},{"$f":"IF($C54=$B$10,$F54,0)","v":0},{"$f":"(IF(AND($E54=\"\",$C54=$B$10),1,0))","v":0},{"$f":"IF($C54=$B$11,$F54,0)","v":0},{"$f":"(IF(AND($E54=\"\",$C54=$B$11),1,0))","v":0},{"$f":"IF($C54=$B$12,$F54,0)","v":0},{"$f":"(IF(AND($E54=\"\",$C54=$B$12),1,0))","v":0},{"$f":"IF($C54=$B$13,$F54,0)","v":0},{"$f":"(IF(AND($E54=\"\",$C54=$B$13),1,0))","v":0},{"$nulls":5},{"v":0,"d":"0.0"}]
[40,{"$f":"'Wettkampf 1'!B55","v":"Schütze 40"},{"$f":"'Wettkampf 1'!C55","v":"Sögel"},null,null,{"v":0,"d":"0.0"},0,0,0,0,0,0,0,0,0,0,0,0,0,0,0,1,0,0,0,0,0,0,0,0,{"$nulls":5},{"v":0,"d":"0.0"}]
[41,{"$f":"'Wettkampf 1'!B56","v":"Schütze 41"},{"$f":"'Wettkampf 1'!C56","v":"Verein IX"},null,null,{"v":0,"d":"0.0"},0,0,0,0,0,0,0,0,0,0,0,0,0,0,0,0,0,1,0,0,0,0,0,0,{"$nulls":5},{"v":0,"d":"0.0"}]
[42,{"$f":"'Wettkampf 1'!B57","v":"Schütze 42"},{"$f":"'Wettkampf 1'!C57","v":"Verein IX"},null,null,{"v":0,"d":"0.0"},0,0,0,0,0,0,0,0,0,0,0,0,0,0,0,0,0,1,0,0,0,0,0,0,{"$nulls":5},{"v":0,"d":"0.0"}]
[43,{"$f":"'Wettkampf 1'!B58","v":"Schütze 43"},{"$f":"'Wettkampf 1'!C58","v":"Verein IX"},null,null,{"v":0,"d":"0.0"},0,0,0,0,0,0,0,0,0,0,0,0,0,0,0,0,0,1,0,0,0,0,0,0,{"$nulls":5},{"v":0,"d":"0.0"}]
[44,{"$f":"'Wettkampf 1'!B59","v":"Schütze 44"},{"$f":"'Wettkampf 1'!C59","v":"Verein IX"},null,null,{"v":0,"d":"0.0"},0,0,0,0,0,0,0,0,0,0,0,0,0,0,0,0,0,1,0,0,0,0,0,0,{"$nulls":5},{"v":0,"d":"0.0"}]
[45,{"$f":"'Wettkampf 1'!B60","v":"Schütze 45"},{"$f":"'Wettkampf 1'!C60","v":"Verein IX"},null,null,{"v":0,"d":"0.0"},0,0,0,0,0,0,0,0,0,0,0,0,0,0,0,0,0,1,0,0,0,0,0,0,{"$nulls":5},{"v":0,"d":"0.0"}]
[46,{"$f":"'Wettkampf 1'!B61","v":"Schütze 46"},{"$f":"'Wettkampf 1'!C61","v":"Verein X"},null,null,{"v":0,"d":"0.0"},0,0,0,0,0,0,0,0,0,0,0,0,0,0,0,0,0,0,0,1,0,0,0,0,{"$nulls":5},{"v":0,"d":"0.0"}]
[47,{"$f":"'Wettkampf 1'!B62","v":"Schütze 47"},{"$f":"'Wettkampf 1'!C62","v":"Verein X"},null,null,{"v":0,"d":"0.0"},0,0,0,0,0,0,0,0,0,0,0,0,0,0,0,0,0,0,0,1,0,0,0,0,{"$nulls":5},{"v":0,"d":"0.0"}]
[48,{"$f":"'Wettkampf 1'!B63","v":"Schütze 48"},{"$f":"'Wettkampf 1'!C63","v":"Verein X"},null,null,{"v":0,"d":"0.0"},0,0,0,0,0,0,0,0,0,0,0,0,0,0,0,0,0,0,0,1,0,0,0,0,{"$nulls":5},{"v":0,"d":"0.0"}]
[49,{"$f":"'Wettkampf 1'!B64","v":"Schütze 49"},{"$f":"'Wettkampf 1'!C64","v":"Verein X"},null,null,{"v":0,"d":"0.0"},0,0,0,0,0,0,0,0,0,0,0,0,0,0,0,0,0,0,0,1,0,0,0,0,{"$nulls":5},{"v":0,"d":"0.0"}]
[50,{"$f":"'Wettkampf 1'!B65","v":"Schütze 50"},{"$f":"'Wettkampf 1'!C65","v":"Verein X"},null,null,{"v":0,"d":"0.0"},0,0,0,0,0,0,0,0,0,0,0,0,0,0,0,0,0,0,0,1,0,0,0,0,{"$nulls":5},{"v":0,"d":"0.0"}]
[51,{"$f":"'Wettkampf 1'!B66","v":"Schütze 51"},{"$f":"'Wettkampf 1'!C66","v":"Verein XI"},null,null,{"v":0,"d":"0.0"},0,0,0,0,0,0,0,0,0,0,0,0,0,0,0,0,0,0,0,0,0,1,0,0,{"$nulls":5},{"v":0,"d":"0.0"}]
[52,{"$f":"'Wettkampf 1'!B67","v":"Schütze 52"},{"$f":"'Wettkampf 1'!C67","v":"Verein XI"},null,null,{"v":0,"d":"0.0"},0,0,0,0,0,0,0,0,0,0,0,0,0,0,0,0,0,0,0,0,0,1,0,0,{"$nulls":5},{"v":0,"d":"0.0"}]
[53,{"$f":"'Wettkampf 1'!B68","v":"Schütze 53"},{"$f":"'Wettkampf 1'!C68","v":"Verein XI"},null,null,{"v":0,"d":"0.0"},0,0,0,0,0,0,0,0,0,0,0,0,0,0,0,0,0,0,0,0,0,1,0,0,{"$nulls":5},{"v":0,"d":"0.0"}]
[54,{"$f":"'Wettkampf 1'!B69","v":"Schütze 54"},{"$f":"'Wettkampf 1'!C69","v":"Verein XI"},null,null,{"v":0,"d":"0.0"},0,0,0,0,0,0,0,0,0,0,0,0,0,0,0,0,0,0,0,0,0,1,0,0,{"$nulls":5},{"v":0,"d":"0.0"}]
[55,{"$f":"'Wettkampf 1'!B70","v":"Schütze 55"},{"$f":"'Wettkampf 1'!C70","v":"Verein XI"},null,null,{"v":0,"d":"0.0"},0,0,0,0,0,0,0,0,0,0,0,0,0,0,0,0,0,0,0,0,0,1,0,0,{"$nulls":5},{"v":0,"d":"0.0"}]
[56,{"$f":"'Wettkampf 1'!B71","v":"Schütze 56"},{"$f":"'Wettkampf 1'!C71","v":"Verein XII"},null,null,{"v":0,"d":"0.0"},0,0,0,0,0,0,0,0,0,0,0,0,0,0,0,0,0,0,0,0,0,0,0,1,{"$nulls":5},{"v":0,"d":"0.0"}]
[57,{"$f":"'Wettkampf 1'!B72","v":"Schütze 57"},{"$f":"'Wettkampf 1'!C72","v":"Verein XII"},null,null,{"v":0,"d":"0.0"},0,0,0,0,0,0,0,0,0,0,0,0,0,0,0,0,0,0,0,0,0,0,0,1,{"$nulls":5},{"v":0,"d":"0.0"}]
[58,{"$f":"'Wettkampf 1'!B73","v":"Schütze 58"},{"$f":"'Wettkampf 1'!C73","v":"Verein XII"},null,null,{"v":0,"d":"0.0"},0,0,0,0,0,0,0,0,0,0,0,0,0,0,0,0,0,0,0,0,0,0,0,1,{"$nulls":5},{"v":0,"d":"0.0"}]
[59,{"$f":"'Wettkampf 1'!B74","v":"Schütze 59"},{"$f":"'Wettkampf 1'!C74","v":"Verein XII"},null,null,{"v":0,"d":"0.0"},0,0,0,0,0,0,0,0,0,0,0,0,0,0,0,0,0,0,0,0,0,0,0,1,{"$nulls":5},{"v":0,"d":"0.0"}]
[60,{"$f":"'Wettkampf 1'!B75","v":"Schütze 60"},{"$f":"'Wettkampf 1'!C75","v":"Verein XII"},null,null,{"v":0,"d":"0.0"},0,0,0,0,0,0,0,0,0,0,0,0,0,0,0,0,0,0,0,0,0,0,0,1,{"$nulls":5},{"v":0,"d":"0.0"}]
[{"$nulls":6},{"$f":"LARGE(G16:G75,1)+LARGE(G16:G75,2)+LARGE(G16:G75,3)","v":0},{"$f":"SUM(H16:H75)","v":5},{"$f":"LARGE(I16:I75,1)+LARGE(I16:I75,2)+LARGE(I16:I75,3)","v":0},{"$f":"SUM(J16:J75)","v":5},{"$f":"LARGE(K16:K75,1)+LARGE(K16:K75,2)+LARGE(K16:K75,3)","v":0},{"$f":"SUM(L16:L75)","v":5},{"$f":"LARGE(M16:M75,1)+LARGE(M16:M75,2)+LARGE(M16:M75,3)","v":0},{"$f":"SUM(N16:N75)","v":5},{"$f":"LARGE(O16:O75,1)+LARGE(O16:O75,2)+LARGE(O16:O75,3)","v":0},{"$f":"SUM(P16:P75)","v":5},{"$f":"LARGE(Q16:Q75,1)+LARGE(Q16:Q75,2)+LARGE(Q16:Q75,3)","v":0},{"$f":"SUM(R16:R75)","v":5},{"$f":"LARGE(S16:S75,1)+LARGE(S16:S75,2)+LARGE(S16:S75,3)","v":0},{"$f":"SUM(T16:T75)","v":5},{"$f":"LARGE(U16:U75,1)+LARGE(U16:U75,2)+LARGE(U16:U75,3)","v":0},{"$f":"SUM(V16:V75)","v":5},{"$f":"LARGE(W16:W75,1)+LARGE(W16:W75,2)+LARGE(W16:W75,3)","v":0},{"$f":"SUM(X16:X75)","v":5},{"$f":"LARGE(Y16:Y75,1)+LARGE(Y16:Y75,2)+LARGE(Y16:Y75,3)","v":0},{"$f":"SUM(Z16:Z75)","v":5},{"$f":"LARGE(AA16:AA75,1)+LARGE(AA16:AA75,2)+LARGE(AA16:AA75,3)","v":0},{"$f":"SUM(AB16:AB75)","v":5},{"$f":"LARGE(AC16:AC75,1)+LARGE(AC16:AC75,2)+LARGE(AC16:AC75,3)","v":0},{"$f":"SUM(AD16:AD75)","v":5}]
[null,null,"per Email an: sk-huemmling@gmx.de"]

{"sheet":"Ausdruck","index":13,"n_rows":48,"n_cols":29,"rows_kept":48,"merged":[[0,3,0,19],[0,24,0,25],[1,3,1,19],[1,24,1,25],[2,3,2,19],[3,3,3,19],[4,24,4,25],[5,24,5,25],[6,24,6,25],[8,22,8,25]]}
[null,"Verein / Gruppe","Ergebnisse",{"$f":"Übersicht!K1","v":"2024/2025"},{"$nulls":19},"Austragungsort:"]
[1,{"$f":"'Wettkampf 1'!B2","v":"Esterwegen"},null,"Klasse:",{"$nulls":19},"Wettkampftag:"]
[2,{"$f":"'Wettkampf 1'!B3","v":"Lähden Jugend I"},null,{"$f":"Übersicht!M1","v":0}]
[3,{"$f":"'Wettkampf 1'!B4","v":"Börgerwald"},null,{"$f":"Übersicht!P1","v":"Jugend"},{"$nulls":21},"Ansprechpartner für Rückfragen:"]
[4,{"$f":"'Wettkampf 1'!B5","v":"Börgermoor"},{"$nulls":21},"Name:"]
[5,{"$f":"'Wettkampf 1'!B6","v":"Spahnharrenstätte"},{"$nulls":21},"Tel:"]
[6,{"$f":"'Wettkampf 1'!B7","v":"Lorup"},{"$nulls":21},"Standaufsicht:"]
[]
[null,"Name Schütze","Verein/Gruppe","Ergebnis","AW? ",null,"Verein 1",null,"Verein 2",null,"Verein 3",null,"Verein 4",null,"Verein 5",null,"Verein 6",{"$nulls":3},"Geburts-datum",null,"Proberechnung bei Streifen:"]
[1,{"$f":"'Wettkampf 1'!B16","v":"Gedecksnis Stefan"},{"$f":"'Wettkampf 1'!C16","v":"Esterwegen"},null,null,{"$f":"IF(E10=\"x\",\"0\",D10)","v":0},{"$f":"IF(C10=$B$2,F10,0)","v":0},{"$f":"(IF(AND($E10=\"\",$C10=$B$2),1,0))","v":1},{"$f":"IF($C10=$B$3,F10,0)","v":0},{"$f":"(IF(AND($E10=\"\",$C10=$B$3),1,0))","v":0},{"$f":"IF($C10=$B$4,F10,0)","v":0},{"$f":"(IF(AND($E10=\"\",$C10=$B$4),1,0))","v":0},{"$f":"IF($C10=$B$5,F10,0)","v":0},{"$f":"(IF(AND($E10=\"\",$C10=$B$5),1,0))","v":0},{"$f":"IF($C10=$B$6,F10,0)","v":0},{"$f":"(IF(AND($E10=\"\",$C10=$B$6),1,0))","v":0},{"$f":"IF($C10=$B$7,F10,0)","v":0},{"$f":"(IF(AND($E10=\"\",$C10=$B$7),1,0))","v":0},{"$nulls":8},{"$f":"IF(Z10=D10,1,0)","v":1},{"$f":"IF(Z10=0,0,1)","v":0},{"$f":"IF(AA10+AB10=2,\"Korrekt\",\"\")","v":""}]
[2,{"$f":"'Wettkampf 1'!B17","v":"Wübben Jasper"},{"$f":"'Wettkampf 1'!C17","v":"Esterwegen"},null,null,{"$f":"IF(E11=\"x\",\"0\",D11)","v":0},{"$f":"IF(C11=$B$2,F11,0)","v":0},{"$f":"(IF(AND($E11=\"\",$C11=$B$2),1,0))","v":1},{"$f":"IF($C11=$B$3,F11,0)","v":0},{"$f":"(IF(AND($E11=\"\",$C11=$B$3),1,0))","v":0},{"$f":"IF($C11=$B$4,F11,0)","v":0},{"$f":"(IF(AND($E11=\"\",$C11=$B$4),1,0))","v":0},{"$f":"IF($C11=$B$5,F11,0)","v":0},{"$f":"(IF(AND($E11=\"\",$C11=$B$5),1,0))","v":0},{"$f":"IF($C11=$B$6,F11,0)","v":0},{"$f":"(IF(AND($E11=\"\",$C11=$B$6),1,0))","v":0},{"$f":"IF($C11=$B$7,F11,0)","v":0},{"$f":"(IF(AND($E11=\"\",$C11=$B$7),1,0))","v":0},{"$nulls":8},{"$f":"IF(Z11=D11,1,0)","v":1},{"$f":"IF(Z11=0,0,1)","v":0},{"$f":"IF(AA11+AB11=2,\"Korrekt\",\"\")","v":""}]
[3,{"$f":"'Wettkampf 1'!B18","v":"Engbers Julian"},{"$f":"'Wettkampf 1'!C18","v":"Esterwegen"},null,null,0,0,1,0,0,0,0,0,0,0,0,0,0,{"$nulls":8},1,0,""]
[4,{"$f":"'Wettkampf 1'!B19","v":"Meyer Johan"},{"$f":"'Wettkampf 1'!C19","v":"Esterwegen"},null,null,0,0,1,0,0,0,0,0,0,0,0,0,0,{"$nulls":8},1,0,""]
[5,{"$f":"'Wettkampf 1'!B20","v":"Schütze 5"},{"$f":"'Wettkampf 1'!C20","v":"Esterwegen"},null,null,0,0,1,0,0,0,0,0,0,0,0,0,0,{"$nulls":8},1,0,""]
[6,{"$f":"'Wettkampf 1'!B21","v":"Strüwing Inja"},{"$f":"'Wettkampf 1'!C21","v":"Lähden Jugend I"},null,null,0,0,0,0,1,0,0,0,0,0,0,0,0,{"$nulls":8},1,0,""]
[7,{"$f":"'Wettkampf 1'!B22","v":"Bruns Hendrik"},{"$f":"'Wettkampf 1'!C22","v":"Lähden Jugend I"},null,null,0,0,0,0,1,0,0,0,0,0,0,0,0,{"$nulls":8},1,0,""]
[8,{"$f":"'Wettkampf 1'!B23","v":"Feldhaus Vanessa"},{"$f":"'Wettkampf 1'!C23","v":"Lähden Jugend I"},null,null,0,0,0,0,1,0,0,0,0,0,0,0,0,{"$nulls":8},1,0,""]
[9,{"$f":"'Wettkampf 1'!B24","v":"Feldhaus Celien "},{"$f":"'Wettkampf 1'!C24","v":"Lähden Jugend I"},null,null,0,0,0,0,1,0,0,0,0,0,0,0,0,{"$nulls":8},1,0,""]
[10,{"$f":"'Wettkampf 1'!B25","v":"Stümpler Jan-Luca"},{"$f":"'Wettkampf 1'!C25","v":"Lähden Jugend I"},null,null,0,0,0,0,1,0,0,0,0,0,0,0,0,{"$nulls":8},1,0,""]
[11,{"$f":"'Wettkampf 1'!B26","v":"Hanneken Maren"},{"$f":"'Wettkampf 1'!C26","v":"Börgerwald"},null,null,0,0,0,0,0,0,1,0,0,0,0,0,0,{"$nulls":8},1,0,""]
[12,{"$f":"'Wettkampf 1'!B27","v":"Köstering Nele"},{"$f":"'Wettkampf 1'!C27","v":"Börgerwald"},null,null,0,0,0,0,0,0,1,0,0,0,0,0,0,{"$nulls":8},1,0,""]
[13,{"$f":"'Wettkampf 1'!B28","v":"Lohmann Amy"},{"$f":"'Wettkampf 1'!C28","v":"Börgerwald"},null,null,0,0,0,0,0,0,1,0,0,0,0,0,0,{"$nulls":8},1,0,""]
[14,{"$f":"'Wettkampf 1'!B29","v":"Schütze 14"},{"$f":"'Wettkampf 1'!C29","v":"Börgerwald"},null,null,0,0,0,0,0,0,1,0,0,0,0,0,0,{"$nulls":8},1,0,""]
[15,{"$f":"'Wettkampf 1'!B30","v":"Schütze 15"},{"$f":"'Wettkampf 1'!C30","v":"Börgerwald"},null,null,0,0,0,0,0,0,1,0,0,0,0,0,0,{"$nulls":8},1,0,""]
[16,{"$f":"'Wettkampf 1'!B31","v":"Brandt Mira"},{"$f":"'Wettkampf 1'!C31","v":"Börgermoor"},null,null,0,0,0,0,0,0,0,0,1,0,0,0,0,{"$nulls":8},1,0,""]
[17,{"$f":"'Wettkampf 1'!B32","v":"Eichhorn Luca"},{"$f":"'Wettkampf 1'!C32","v":"Börgermoor"},null,null,0,0,0,0,0,0,0,0,1,0,0,0,0,{"$nulls":8},1,0,""]
[18,{"$f":"'Wettkampf 1'!B33","v":"Kohnen Saskia"},{"$f":"'Wettkampf 1'!C33","v":"Börgermoor"},null,null,0,0,0,0,0,0,0,0,1,0,0,0,0,{"$nulls":8},1,0,""]
[19,{"$f":"'Wettkampf 1'!B34","v":"Schütze 19"},{"$f":"'Wettkampf 1'!C34","v":"Börgermoor"},null,null,0,0,0,0,0,0,0,0,1,0,0,0,0,{"$nulls":8},1,0,""]
[20,{"$f":"'Wettkampf 1'!B35","v":"Schütze 20"},{"$f":"'Wettkampf 1'!C35","v":"Börgermoor"},null,null,0,0,0,0,0,0,0,0,1,0,0,0,0,{"$nulls":8},1,0,""]
[21,{"$f":"'Wettkampf 1'!B36","v":"Runde Marcel"},{"$f":"'Wettkampf 1'!C36","v":"Spahnharrenstätte"},null,null,0,0,0,0,0,0,0,0,0,0,1,0,0,{"$nulls":8},1,0,""]
[22,{"$f":"'Wettkampf 1'!B37","v":"Leis Fynn Lucas "},{"$f":"'Wettkampf 1'!C37","v":"Spahnharrenstätte"},null,null,0,0,0,0,0,0,0,0,0,0,1,0,0,{"$nulls":8},1,0,""]
[23,{"$f":"'Wettkampf 1'!B38","v":"Jansen Lars"},{"$f":"'Wettkampf 1'!C38","v":"Spahnharrenstätte"},null,null,0,0,0,0,0,0,0,0,0,0,1,0,0,{"$nulls":8},1,0,""]
[24,{"$f":"'Wettkampf 1'!B39","v":"Köster Thilo"},{"$f":"'Wettkampf 1'!C39","v":"Spahnharrenstätte"},null,null,0,0,0,0,0,0,0,0,0,0,1,0,0,{"$nulls":8},1,0,""]
[25,{"$f":"'Wettkampf 1'!B40","v":"Schütze 25"},{"$f":"'Wettkampf 1'!C40","v":"Spahnharrenstätte"},null,null,0,0,0,0,0,0,0,0,0,0,1,0,0,{"$nulls":8},1,0,""]
[26,{"$f":"'Wettkampf 1'!B41","v":"Dolling Leon"},{"$f":"'Wettkampf 1'!C41","v":"Lorup"},null,null,0,0,0,0,0,0,0,0,0,0,0,0,1,{"$nulls":8},1,0,""]
[27,{"$f":"'Wettkampf 1'!B42","v":"Schütze 27"},{"$f":"'Wettkampf 1'!C42","v":"Lorup"},null,null,0,0,0,0,0,0,0,0,0,0,0,0,1,{"$nulls":8},1,0,""]
[28,{"$f":"'Wettkampf 1'!B43","v":"Schütze 28"},{"$f":"'Wettkampf 1'!C43","v":"Lorup"},null,null,0,0,0,0,0,0,0,0,0,0,0,0,1,{"$nulls":8},1,0,""]
[29,{"$f":"'Wettkampf 1'!B44","v":"Schütze 29"},{"$f":"'Wettkampf 1'!C44","v":"Lorup"},null,null,0,0,0,0,0,0,0,0,0,0,0,0,1,{"$nulls":8},1,0,""]
[30,{"$f":"'Wettkampf 1'!B45","v":"Schütze 30"},{"$f":"'Wettkampf 1'!C45","v":"Lorup"},null,null,0,0,0,0,0,0,0,0,0,0,0,0,1,{"$nulls":8},1,0,""]
[31,{"$f":"'Wettkampf 1'!B46","v":"Wilken Noah"},{"$f":"'Wettkampf 1'!C46","v":"Lahn"},null,null,0,0,0,0,0,0,0,0,0,0,0,0,0,{"$nulls":8},1,0,""]
[32,{"$f":"'Wettkampf 1'!B47","v":"Schulz Mika"},{"$f":"'Wettkampf 1'!C47","v":"Lahn"},null,null,0,0,0,0,0,0,0,0,0,0,0,0,0,{"$nulls":8},1,0,""]
[33,{"$f":"'Wettkampf 1'!B48","v":"Schütze 33"},{"$f":"'Wettkampf 1'!C48","v":"Lahn"},null,null,0,0,0,0,0,0,0,0,0,0,0,0,0,{"$nulls":8},1,0,""]
[34,{"$f":"'Wettkampf 1'!B49","v":"Schütze 34"},{"$f":"'Wettkampf 1'!C49","v":"Lahn"},null,null,0,0,0,0,0,0,0,0,0,0,0,0,0,{"$nulls":8},1,0,""]
[35,{"$f":"'Wettkampf 1'!B50","v":"Schütze 35"},{"$f":"'Wettkampf 1'!C50","v":"Lahn"},null,null,0,0,0,0,0,0,0,0,0,0,0,0,0,{"$nulls":8},1,0,""]
[36,{"$f":"'Wettkampf 1'!B51","v":"Tharner Kim"},{"$f":"'Wettkampf 1'!C51","v":"Sögel"},null,null,0,0,0,0,0,0,0,0,0,0,0,0,0,{"$nulls":8},1,0,""]
[{"$nulls":6},{"$f":"LARGE(G10:G45,1)+LARGE(G10:G45,2)+LARGE(G10:G45,3)","v":0},{"$f":"SUM(H10:H45)","v":5},{"$f":"LARGE(I10:I45,1)+LARGE(I10:I45,2)+LARGE(I10:I45,3)","v":0},{"$f":"SUM(J10:J45)","v":5},{"$f":"LARGE(K10:K45,1)+LARGE(K10:K45,2)+LARGE(K10:K45,3)","v":0},{"$f":"SUM(L10:L45)","v":5},{"$f":"LARGE(M10:M45,1)+LARGE(M10:M45,2)+LARGE(M10:M45,3)","v":0},{"$f":"SUM(N10:N45)","v":5},{"$f":"LARGE(O10:O45,1)+LARGE(O10:O45,2)+LARGE(O10:O45,3)","v":0},{"$f":"SUM(P10:P45)","v":5},{"$f":"LARGE(Q10:Q45,1)+LARGE(Q10:Q45,2)+LARGE(Q10:Q45,3)","v":0},{"$f":"SUM(R10:S45)","v":5}]
[]
[null,"Bitte beachtet, dass die Standaufsicht benannt werden muss"]

{"sheet":"Ausdruck blank","index":14,"n_rows":48,"n_cols":29,"rows_kept":48,"merged":[[0,3,0,19],[0,24,0,25],[1,3,1,19],[1,24,1,25],[2,3,2,19],[3,3,3,19],[4,24,4,25],[5,24,5,25],[6,24,6,25],[8,22,8,25]]}
[null,"Verein / Gruppe","Ergebnisse",{"$f":"Übersicht!K1","v":"2024/2025"},{"$nulls":19},"Austragungsort:"]
[1,null,null,"Klasse:",{"$nulls":19},"Wettkampftag:"]
[2]
[3,{"$nulls":24},"Ansprechpartner für Rückfragen:"]
[4,{"$nulls":22},"Name:"]
[5,{"$nulls":22},"Tel:"]
[6,{"$nulls":22},"Standaufsicht:"]
[]
[null,"Name Schütze","Verein/Gruppe","Ergebnis","AW? ",null,"Verein 1",null,"Verein 2",null,"Verein 3",null,"Verein 4",null,"Verein 5",null,"Verein 6",{"$nulls":3},"Geburts-datum",null,"Proberechnung bei Streifen:"]
[1,{"$nulls":4},{"$f":"IF(E10=\"x\",\"0\",D10)","v":0},{"$f":"IF(C10=$B$2,F10,0)","v":0},{"$f":"(IF(AND($E10=\"\",$C10=$B$2),1,0))","v":1},{"$f":"IF($C10=$B$3,F10,0)","v":0},{"$f":"(IF(AND($E10=\"\",$C10=$B$3),1,0))","v":1},{"$f":"IF($C10=$B$4,F10,0)","v":0},{"$f":"(IF(AND($E10=\"\",$C10=$B$4),1,0))","v":1},{"$f":"IF($C10=$B$5,F10,0)","v":0},{"$f":"(IF(AND($E10=\"\",$C10=$B$5),1,0))","v":1},{"$f":"IF($C10=$B$6,F10,0)","v":0},{"$f":"(IF(AND($E10=\"\",$C10=$B$6),1,0))","v":1},{"$f":"IF($C10=$B$7,F10,0)","v":0},{"$f":"(IF(AND($E10=\"\",$C10=$B$7),1,0))","v":1},{"$nulls":8},{"$f":"IF(Z10=D10,1,0)","v":1},{"$f":"IF(Z10=0,0,1)","v":0},{"$f":"IF(AA10+AB10=2,\"Korrekt\",\"\")","v":""}]
[2,{"$nulls":4},{"$f":"IF(E11=\"x\",\"0\",D11)","v":0},{"$f":"IF(C11=$B$2,F11,0)","v":0},{"$f":"(IF(AND($E11=\"\",$C11=$B$2),1,0))","v":1},{"$f":"IF($C11=$B$3,F11,0)","v":0},{"$f":"(IF(AND($E11=\"\",$C11=$B$3),1,0))","v":1},{"$f":"IF($C11=$B$4,F11,0)","v":0},{"$f":"(IF(AND($E11=\"\",$C11=$B$4),1,0))","v":1},{"$f":"IF($C11=$B$5,F11,0)","v":0},{"$f":"(IF(AND($E11=\"\",$C11=$B$5),1,0))","v":1},{"$f":"IF($C11=$B$6,F11,0)","v":0},{"$f":"(IF(AND($E11=\"\",$C11=$B$6),1,0))","v":1},{"$f":"IF($C11=$B$7,F11,0)","v":0},{"$f":"(IF(AND($E11=\"\",$C11=$B$7),1,0))","v":1},{"$nulls":8},{"$f":"IF(Z11=D11,1,0)","v":1},{"$f":"IF(Z11=0,0,1)","v":0},{"$f":"IF(AA11+AB11=2,\"Korrekt\",\"\")","v":""}]
[3,{"$nulls":4},0,0,1,0,1,0,1,0,1,0,1,0,1,{"$nulls":8},1,0,""]
[4,{"$nulls":4},0,0,1,0,1,0,1,0,1,0,1,0,1,{"$nulls":8},1,0,""]
[5,{"$nulls":4},0,0,1,0,1,0,1,0,1,0,1,0,1,{"$nulls":8},1,0,""]
[6,{"$nulls":4},0,0,1,0,1,0,1,0,1,0,1,0,1,{"$nulls":8},1,0,""]
[7,{"$nulls":4},0,0,1,0,1,0,1,0,1,0,1,0,1,{"$nulls":8},1,0,""]
[8,{"$nulls":4},0,0,1,0,1,0,1,0,1,0,1,0,1,{"$nulls":8},1,0,""]
[9,{"$nulls":4},0,0,1,0,1,0,1,0,1,0,1,0,1,{"$nulls":8},1,0,""]
[10,{"$nulls":4},0,0,1,0,1,0,1,0,1,0,1,0,1,{"$nulls":8},1,0,""]
[11,{"$nulls":4},0,0,1,0,1,0,1,0,1,0,1,0,1,{"$nulls":8},1,0,""]
[12,{"$nulls":4},0,0,1,0,1,0,1,0,1,0,1,0,1,{"$nulls":8},1,0,""]
[13,{"$nulls":4},0,0,1,0,1,0,1,0,1,0,1,0,1,{"$nulls":8},1,0,""]
[14,{"$nulls":4},0,0,1,0,1,0,1,0,1,0,1,0,1,{"$nulls":8},1,0,""]
[15,{"$nulls":4},0,0,1,0,1,0,1,0,1,0,1,0,1,{"$nulls":8},1,0,""]
[16,{"$nulls":4},0,0,1,0,1,0,1,0,1,0,1,0,1,{"$nulls":8},1,0,""]
[17,{"$nulls":4},0,0,1,0,1,0,1,0,1,0,1,0,1,{"$nulls":8},1,0,""]
[18,{"$nulls":4},0,0,1,0,1,0,1,0,1,0,1,0,1,{"$nulls":8},1,0,""]
[19,{"$nulls":4},0,0,1,0,1,0,1,0,1,0,1,0,1,{"$nulls":8},1,0,""]
[20,{"$nulls":4},0,0,1,0,1,0,1,0,1,0,1,0,1,{"$nulls":8},1,0,""]
[21,{"$nulls":4},0,0,1,0,1,0,1,0,1,0,1,0,1,{"$nulls":8},1,0,""]
[22,{"$nulls":4},0,0,1,0,1,0,1,0,1,0,1,0,1,{"$nulls":8},1,0,""]
[23,{"$nulls":4},0,0,1,0,1,0,1,0,1,0,1,0,1,{"$nulls":8},1,0,""]
[24,{"$nulls":4},0,0,1,0,1,0,1,0,1,0,1,0,1,{"$nulls":8},1,0,""]
[25,{"$nulls":4},0,0,1,0,1,0,1,0,1,0,1,0,1,{"$nulls":8},1,0,""]
[26,{"$nulls":4},0,0,1,0,1,0,1,0,1,0,1,0,1,{"$nulls":8},1,0,""]
[27,{"$nulls":4},0,0,1,0,1,0,1,0,1,0,1,0,1,{"$nulls":8},1,0,""]
[28,{"$nulls":4},0,0,1,0,1,0,1,0,1,0,1,0,1,{"$nulls":8},1,0,""]
[29,{"$nulls":4},0,0,1,0,1,0,1,0,1,0,1,0,1,{"$nulls":8},1,0,""]
[30,{"$nulls":4},0,0,1,0,1,0,1,0,1,0,1,0,1,{"$nulls":8},1,0,""]
[31,{"$nulls":4},0,0,1,0,1,0,1,0,1,0,1,0,1,{"$nulls":8},1,0,""]
[32,{"$nulls":4},0,0,1,0,1,0,1,0,1,0,1,0,1,{"$nulls":8},1,0,""]
[33,{"$nulls":4},0,0,1,0,1,0,1,0,1,0,1,0,1,{"$nulls":8},1,0,""]
[34,{"$nulls":4},0,0,1,0,1,0,1,0,1,0,1,0,1,{"$nulls":8},1,0,""]
[35,{"$nulls":4},0,0,1,0,1,0,1,0,1,0,1,0,1,{"$nulls":8},1,0,""]
[36,{"$nulls":4},0,0,1,0,1,0,1,0,1,0,1,0,1,{"$nulls":8},1,0,""]
[{"$nulls":6},{"$f":"LARGE(G10:G45,1)+LARGE(G10:G45,2)+LARGE(G10:G45,3)","v":0},{"$f":"SUM(H10:H45)","v":36},{"$f":"LARGE(I10:I45,1)+LARGE(I10:I45,2)+LARGE(I10:I45,3)","v":0},{"$f":"SUM(J10:J45)","v":36},{"$f":"LARGE(K10:K45,1)+LARGE(K10:K45,2)+LARGE(K10:K45,3)","v":0},{"$f":"SUM(L10:L45)","v":36},{"$f":"LARGE(M10:M45,1)+LARGE(M10:M45,2)+LARGE(M10:M45,3)","v":0},{"$f":"SUM(N10:N45)","v":36},{"$f":"LARGE(O10:O45,1)+LARGE(O10:O45,2)+LARGE(O10:O45,3)","v":0},{"$f":"SUM(P10:P45)","v":36},{"$f":"LARGE(Q10:Q45,1)+LARGE(Q10:Q45,2)+LARGE(Q10:Q45,3)","v":0},{"$f":"SUM(R10:S45)","v":36}]
[]
[null,"Bitte beachtet, dass die Standaufsicht benannt werden muss"]

{"sheet":"Übersicht Schützen","index":15,"n_rows":61,"n_cols":23,"rows_kept":61,"hidden":true}
[null,null,{"v":1,"d":"1.0"},{"v":2,"d":"2.0"},{"v":3,"d":"3.0"},{"v":4,"d":"4.0"},{"v":5,"d":"5.0"},{"v":6,"d":"6.0"},{"$nulls":3},{"v":7,"d":"7.0"},{"v":8,"d":"8.0"},{"v":9,"d":"9.0"},{"v":10,"d":"10.0"},{"v":11,"d":"11.0"},{"v":12,"d":"12.0"}]
["Strüwing Inja",{"$f":"VLOOKUP(A2,'Wettkampf 1'!$B$16:$C$75,2,FALSE)","v":"Lähden Jugend I"},{"$f":"VLOOKUP(A2,'Wettkampf 1'!$B$16:$D$75,3,FALSE)","v":375.8},{"$f":"VLOOKUP($A2,'2'!$B$16:$D$75,3,FALSE)","v":374.1},{"$f":"VLOOKUP($A2,'3'!$B$10:$D$75,3,FALSE)","v":375.9},{"$f":"VLOOKUP($A2,'4'!$B$10:$D$75,3,FALSE)","v":384.1},{"$f":"VLOOKUP($A2,'5'!$B$10:$D$75,3,FALSE)","v":{"v":373,"d":"373.0"}},{"$f":"VLOOKUP($A2,'6'!$B$10:$D$75,3,FALSE)","v":{"v":0,"d":"0.0"}},{"$f":"IF(J2 > 0,K2/J2,0)","v":{"v":376.58000000000004,"d":"376.6"}},{"$f":"VLOOKUP(A2,Formelhilfe!$A$15:$H$74,8,FALSE)","v":{"v":5,"d":"5.0"}},{"$f":"SUM(C2:H2)","v":{"v":1882.9,"d":"1,882.9"}},{"$f":"VLOOKUP($A2,'7'!$B$10:$D$75,3,FALSE)","v":389.3},{"$f":"VLOOKUP($A2,'8'!$B$10:$D$75,3,FALSE)","v":385.2},{"$f":"VLOOKUP($A2,'9'!$B$10:$D$75,3,FALSE)","v":{"v":0,"d":"0.0"}},{"$f":"VLOOKUP($A2,'10'!$B$10:$D$75,3,FALSE)","v":{"v":0,"d":"0.0"}},{"$f":"VLOOKUP($A2,'11'!$B$10:$D$75,3,FALSE)","v":{"v":0,"d":"0.0"}},{"$f":"VLOOKUP($A2,'12'!$B$10:$D$75,3,FALSE)","v":{"v":0,"d":"0.0"}},{"$f":"IF(S2 >0,T2/S2,0)","v":{"v":387.25,"d":"387.3"}},{"$f":"VLOOKUP(A2,Formelhilfe!$A$15:$O$74,15,FALSE)","v":{"v":2,"d":"2.0"}},{"$f":"SUM(L2:Q2)","v":774.5},{"$f":"IF(V2>0,W2/V2,0)","v":{"v":379.62857142857143,"d":"379.6"}},{"$f":"VLOOKUP(A2,Formelhilfe!$A$15:$P$74,16,FALSE)","v":{"v":7,"d":"7.0"}},{"$f":"SUM(C2:H2,L2:Q2)","v":{"v":2657.4,"d":"2,657.4"}}]
["Bruns Hendrik",{"$f":"VLOOKUP(A3,'Wettkampf 1'!$B$16:$C$75,2,FALSE)","v":"Lähden Jugend I"},{"$f":"VLOOKUP(A3,'Wettkampf 1'!$B$16:$D$75,3,FALSE)","v":356.9},{"$f":"VLOOKUP($A3,'2'!$B$16:$D$75,3,FALSE)","v":367.4},{"$f":"VLOOKUP($A3,'3'!$B$10:$D$75,3,FALSE)","v":366.2},{"$f":"VLOOKUP($A3,'4'!$B$10:$D$75,3,FALSE)","v":368.6},{"$f":"VLOOKUP($A3,'5'!$B$10:$D$75,3,FALSE)","v":{"v":359,"d":"359.0"}},{"$f":"VLOOKUP($A3,'6'!$B$10:$D$75,3,FALSE)","v":{"v":0,"d":"0.0"}},{"$f":"IF(J3 > 0,K3/J3,0)","v":{"v":363.62,"d":"363.6"}},{"$f":"VLOOKUP(A3,Formelhilfe!$A$15:$H$74,8,FALSE)","v":{"v":5,"d":"5.0"}},{"$f":"SUM(C3:H3)","v":{"v":1818.1,"d":"1,818.1"}},{"$f":"VLOOKUP($A3,'7'!$B$10:$D$75,3,FALSE)","v":382.2},{"$f":"VLOOKUP($A3,'8'!$B$10:$D$75,3,FALSE)","v":369.6},{"$f":"VLOOKUP($A3,'9'!$B$10:$D$75,3,FALSE)","v":{"v":0,"d":"0.0"}},{"$f":"VLOOKUP($A3,'10'!$B$10:$D$75,3,FALSE)","v":{"v":0,"d":"0.0"}},{"$f":"VLOOKUP($A3,'11'!$B$10:$D$75,3,FALSE)","v":{"v":0,"d":"0.0"}},{"$f":"VLOOKUP($A3,'12'!$B$10:$D$75,3,FALSE)","v":{"v":0,"d":"0.0"}},{"$f":"IF(S3 >0,T3/S3,0)","v":375.9},{"$f":"VLOOKUP(A3,Formelhilfe!$A$15:$O$74,15,FALSE)","v":{"v":2,"d":"2.0"}},{"$f":"SUM(L3:Q3)","v":751.8},{"$f":"IF(V3>0,W3/V3,0)","v":{"v":367.1285714285714,"d":"367.1"}},{"$f":"VLOOKUP(A3,Formelhilfe!$A$15:$P$74,16,FALSE)","v":{"v":7,"d":"7.0"}},{"$f":"SUM(C3:H3,L3:Q3)","v":{"v":2569.8999999999996,"d":"2,569.9"}}]
["Brandt Mira",{"$f":"VLOOKUP(A4,'Wettkampf 1'!$B$16:$C$75,2,FALSE)","v":"Börgermoor"},{"$f":"VLOOKUP(A4,'Wettkampf 1'!$B$16:$D$75,3,FALSE)","v":352.7},{"$f":"VLOOKUP($A4,'2'!$B$16:$D$75,3,FALSE)","v":354.6},{"$f":"VLOOKUP($A4,'3'!$B$10:$D$75,3,FALSE)","v":331.7},{"$f":"VLOOKUP($A4,'4'!$B$10:$D$75,3,FALSE)","v":355.1},{"$f":"VLOOKUP($A4,'5'!$B$10:$D$75,3,FALSE)","v":364.8},{"$f":"VLOOKUP($A4,'6'!$B$10:$D$75,3,FALSE)","v":{"v":0,"d":"0.0"}},{"$f":"IF(J4 > 0,K4/J4,0)","v":{"v":351.78,"d":"351.8"}},{"$f":"VLOOKUP(A4,Formelhilfe!$A$15:$H$74,8,FALSE)","v":{"v":5,"d":"5.0"}},{"$f":"SUM(C4:H4)","v":{"v":1758.8999999999999,"d":"1,758.9"}},{"$f":"VLOOKUP($A4,'7'!$B$10:$D$75,3,FALSE)","v":356.5},{"$f":"VLOOKUP($A4,'8'!$B$10:$D$75,3,FALSE)","v":349.7},{"$f":"VLOOKUP($A4,'9'!$B$10:$D$75,3,FALSE)","v":{"v":0,"d":"0.0"}},{"$f":"VLOOKUP($A4,'10'!$B$10:$D$75,3,FALSE)","v":{"v":0,"d":"0.0"}},{"$f":"VLOOKUP($A4,'11'!$B$10:$D$75,3,FALSE)","v":{"v":0,"d":"0.0"}},{"$f":"VLOOKUP($A4,'12'!$B$10:$D$75,3,FALSE)","v":{"v":0,"d":"0.0"}},{"$f":"IF(S4 >0,T4/S4,0)","v":353.1},{"$f":"VLOOKUP(A4,Formelhilfe!$A$15:$O$74,15,FALSE)","v":{"v":2,"d":"2.0"}},{"$f":"SUM(L4:Q4)","v":706.2},{"$f":"IF(V4>0,W4/V4,0)","v":{"v":352.1571428571428,"d":"352.2"}},{"$f":"VLOOKUP(A4,Formelhilfe!$A$15:$P$74,16,FALSE)","v":{"v":7,"d":"7.0"}},{"$f":"SUM(C4:H4,L4:Q4)","v":{"v":2465.0999999999995,"d":"2,465.1"}}]
["Eichhorn Luca",{"$f":"VLOOKUP(A5,'Wettkampf 1'!$B$16:$C$75,2,FALSE)","v":"Börgermoor"},{"$f":"VLOOKUP(A5,'Wettkampf 1'!$B$16:$D$75,3,FALSE)","v":298.1},{"$f":"VLOOKUP($A5,'2'!$B$16:$D$75,3,FALSE)","v":315.1},{"$f":"VLOOKUP($A5,'3'!$B$10:$D$75,3,FALSE)","v":285.6},{"$f":"VLOOKUP($A5,'4'!$B$10:$D$75,3,FALSE)","v":340.8},{"$f":"VLOOKUP($A5,'5'!$B$10:$D$75,3,FALSE)","v":333.8},{"$f":"VLOOKUP($A5,'6'!$B$10:$D$75,3,FALSE)","v":{"v":0,"d":"0.0"}},{"$f":"IF(J5 > 0,K5/J5,0)","v":{"v":314.68,"d":"314.7"}},{"$f":"VLOOKUP(A5,Formelhilfe!$A$15:$H$74,8,FALSE)","v":{"v":5,"d":"5.0"}},{"$f":"SUM(C5:H5)","v":{"v":1573.4,"d":"1,573.4"}},{"$f":"VLOOKUP($A5,'7'!$B$10:$D$75,3,FALSE)","v":335.3},{"$f":"VLOOKUP($A5,'8'!$B$10:$D$75,3,FALSE)","v":333.1},{"$f":"VLOOKUP($A5,'9'!$B$10:$D$75,3,FALSE)","v":{"v":0,"d":"0.0"}},{"$f":"VLOOKUP($A5,'10'!$B$10:$D$75,3,FALSE)","v":{"v":0,"d":"0.0"}},{"$f":"VLOOKUP($A5,'11'!$B$10:$D$75,3,FALSE)","v":{"v":0,"d":"0.0"}},{"$f":"VLOOKUP($A5,'12'!$B$10:$D$75,3,FALSE)","v":{"v":0,"d":"0.0"}},{"$f":"IF(S5 >0,T5/S5,0)","v":{"v":334.20000000000005,"d":"334.2"}},{"$f":"VLOOKUP(A5,Formelhilfe!$A$15:$O$74,15,FALSE)","v":{"v":2,"d":"2.0"}},{"$f":"SUM(L5:Q5)","v":{"v":668.4000000000001,"d":"668.4"}},{"$f":"IF(V5>0,W5/V5,0)","v":{"v":320.25714285714287,"d":"320.3"}},{"$f":"VLOOKUP(A5,Formelhilfe!$A$15:$P$74,16,FALSE)","v":{"v":7,"d":"7.0"}},{"$f":"SUM(C5:H5,L5:Q5)","v":{"v":2241.8,"d":"2,241.8"}}]
["Kohnen Saskia",{"$f":"VLOOKUP(A6,'Wettkampf 1'!$B$16:$C$75,2,FALSE)","v":"Börgermoor"},{"$f":"VLOOKUP(A6,'Wettkampf 1'!$B$16:$D$75,3,FALSE)","v":304.7},{"$f":"VLOOKUP($A6,'2'!$B$16:$D$75,3,FALSE)","v":{"v":334,"d":"334.0"}},{"$f":"VLOOKUP($A6,'3'!$B$10:$D$75,3,FALSE)","v":313.5},{"$f":"VLOOKUP($A6,'4'!$B$10:$D$75,3,FALSE)","v":318.2},{"$f":"VLOOKUP($A6,'5'!$B$10:$D$75,3,FALSE)","v":316.7},{"$f":"VLOOKUP($A6,'6'!$B$10:$D$75,3,FALSE)","v":{"v":0,"d":"0.0"}},{"$f":"IF(J6 > 0,K6/J6,0)","v":{"v":317.42,"d":"317.4"}},{"$f":"VLOOKUP(A6,Formelhilfe!$A$15:$H$74,8,FALSE)","v":{"v":5,"d":"5.0"}},{"$f":"SUM(C6:H6)","v":{"v":1587.1000000000001,"d":"1,587.1"}},{"$f":"VLOOKUP($A6,'7'!$B$10:$D$75,3,FALSE)","v":326.8},{"$f":"VLOOKUP($A6,'8'!$B$10:$D$75,3,FALSE)","v":327.2},{"$f":"VLOOKUP($A6,'9'!$B$10:$D$75,3,FALSE)","v":{"v":0,"d":"0.0"}},{"$f":"VLOOKUP($A6,'10'!$B$10:$D$75,3,FALSE)","v":{"v":0,"d":"0.0"}},{"$f":"VLOOKUP($A6,'11'!$B$10:$D$75,3,FALSE)","v":{"v":0,"d":"0.0"}},{"$f":"VLOOKUP($A6,'12'!$B$10:$D$75,3,FALSE)","v":{"v":0,"d":"0.0"}},{"$f":"IF(S6 >0,T6/S6,0)","v":{"v":327,"d":"327.0"}},{"$f":"VLOOKUP(A6,Formelhilfe!$A$15:$O$74,15,FALSE)","v":{"v":2,"d":"2.0"}},{"$f":"SUM(L6:Q6)","v":{"v":654,"d":"654.0"}},{"$f":"IF(V6>0,W6/V6,0)","v":{"v":320.15714285714284,"d":"320.2"}},{"$f":"VLOOKUP(A6,Formelhilfe!$A$15:$P$74,16,FALSE)","v":{"v":7,"d":"7.0"}},{"$f":"SUM(C6:H6,L6:Q6)","v":{"v":2241.1,"d":"2,241.1"}}]
["Wilken Noah",{"$f":"VLOOKUP(A7,'Wettkampf 1'!$B$16:$C$75,2,FALSE)","v":"Lahn"},{"$f":"VLOOKUP(A7,'Wettkampf 1'!$B$16:$D$75,3,FALSE)","v":{"v":305,"d":"305.0"}},{"$f":"VLOOKUP($A7,'2'!$B$16:$D$75,3,FALSE)","v":{"v":299,"d":"299.0"}},{"$f":"VLOOKUP($A7,'3'!$B$10:$D$75,3,FALSE)","v":313.6},{"$f":"VLOOKUP($A7,'4'!$B$10:$D$75,3,FALSE)","v":310.5},{"$f":"VLOOKUP($A7,'5'!$B$10:$D$75,3,FALSE)","v":284.7},{"$f":"VLOOKUP($A7,'6'!$B$10:$D$75,3,FALSE)","v":{"v":0,"d":"0.0"}},{"$f":"IF(J7 > 0,K7/J7,0)","v":{"v":302.56,"d":"302.6"}},{"$f":"VLOOKUP(A7,Formelhilfe!$A$15:$H$74,8,FALSE)","v":{"v":5,"d":"5.0"}},{"$f":"SUM(C7:H7)","v":{"v":1512.8,"d":"1,512.8"}},{"$f":"VLOOKUP($A7,'7'!$B$10:$D$75,3,FALSE)","v":290.3},{"$f":"VLOOKUP($A7,'8'!$B$10:$D$75,3,FALSE)","v":287.6},{"$f":"VLOOKUP($A7,'9'!$B$10:$D$75,3,FALSE)","v":{"v":0,"d":"0.0"}},{"$f":"VLOOKUP($A7,'10'!$B$10:$D$75,3,FALSE)","v":{"v":0,"d":"0.0"}},{"$f":"VLOOKUP($A7,'11'!$B$10:$D$75,3,FALSE)","v":{"v":0,"d":"0.0"}},{"$f":"VLOOKUP($A7,'12'!$B$10:$D$75,3,FALSE)","v":{"v":0,"d":"0.0"}},{"$f":"IF(S7 >0,T7/S7,0)","v":{"v":288.95000000000005,"d":"289.0"}},{"$f":"VLOOKUP(A7,Formelhilfe!$A$15:$O$74,15,FALSE)","v":{"v":2,"d":"2.0"}},{"$f":"SUM(L7:Q7)","v":{"v":577.9000000000001,"d":"577.9"}},{"$f":"IF(V7>0,W7/V7,0)","v":{"v":298.6714285714285,"d":"298.7"}},{"$f":"VLOOKUP(A7,Formelhilfe!$A$15:$P$74,16,FALSE)","v":{"v":7,"d":"7.0"}},{"$f":"SUM(C7:H7,L7:Q7)","v":{"v":2090.7,"d":"2,090.7"}}]
["Runde Marcel",{"$f":"VLOOKUP(A8,'Wettkampf 1'!$B$16:$C$75,2,FALSE)","v":"Spahnharrenstätte"},{"$f":"VLOOKUP(A8,'Wettkampf 1'!$B$16:$D$75,3,FALSE)","v":295.5},{"$f":"VLOOKUP($A8,'2'!$B$16:$D$75,3,FALSE)","v":{"v":0,"d":"0.0"}},{"$f":"VLOOKUP($A8,'3'!$B$10:$D$75,3,FALSE)","v":307.4},{"$f":"VLOOKUP($A8,'4'!$B$10:$D$75,3,FALSE)","v":{"v":317,"d":"317.0"}},{"$f":"VLOOKUP($A8,'5'!$B$10:$D$75,3,FALSE)","v":315.8},{"$f":"VLOOKUP($A8,'6'!$B$10:$D$75,3,FALSE)","v":{"v":0,"d":"0.0"}},{"$f":"IF(J8 > 0,K8/J8,0)","v":{"v":308.925,"d":"308.9"}},{"$f":"VLOOKUP(A8,Formelhilfe!$A$15:$H$74,8,FALSE)","v":{"v":4,"d":"4.0"}},{"$f":"SUM(C8:H8)","v":{"v":1235.7,"d":"1,235.7"}},{"$f":"VLOOKUP($A8,'7'!$B$10:$D$75,3,FALSE)","v":319.5},{"$f":"VLOOKUP($A8,'8'!$B$10:$D$75,3,FALSE)","v":336.5},{"$f":"VLOOKUP($A8,'9'!$B$10:$D$75,3,FALSE)","v":{"v":0,"d":"0.0"}},{"$f":"VLOOKUP($A8,'10'!$B$10:$D$75,3,FALSE)","v":{"v":0,"d":"0.0"}},{"$f":"VLOOKUP($A8,'11'!$B$10:$D$75,3,FALSE)","v":{"v":0,"d":"0.0"}},{"$f":"VLOOKUP($A8,'12'!$B$10:$D$75,3,FALSE)","v":{"v":0,"d":"0.0"}},{"$f":"IF(S8 >0,T8/S8,0)","v":{"v":328,"d":"328.0"}},{"$f":"VLOOKUP(A8,Formelhilfe!$A$15:$O$74,15,FALSE)","v":{"v":2,"d":"2.0"}},{"$f":"SUM(L8:Q8)","v":{"v":656,"d":"656.0"}},{"$f":"IF(V8>0,W8/V8,0)","v":{"v":315.28333333333336,"d":"315.3"}},{"$f":"VLOOKUP(A8,Formelhilfe!$A$15:$P$74,16,FALSE)","v":{"v":6,"d":"6.0"}},{"$f":"SUM(C8:H8,L8:Q8)","v":{"v":1891.7,"d":"1,891.7"}}]
["Feldhaus Celien ",{"$f":"VLOOKUP(A9,'Wettkampf 1'!$B$16:$C$75,2,FALSE)","v":"Lähden Jugend I"},{"$f":"VLOOKUP(A9,'Wettkampf 1'!$B$16:$D$75,3,FALSE)","v":327.1},{"$f":"VLOOKUP($A9,'2'!$B$16:$D$75,3,FALSE)","v":{"v":0,"d":"0.0"}},{"$f":"VLOOKUP($A9,'3'!$B$10:$D$75,3,FALSE)","v":338.1},{"$f":"VLOOKUP($A9,'4'!$B$10:$D$75,3,FALSE)","v":337.8},{"$f":"VLOOKUP($A9,'5'!$B$10:$D$75,3,FALSE)","v":{"v":0,"d":"0.0"}},{"$f":"VLOOKUP($A9,'6'!$B$10:$D$75,3,FALSE)","v":{"v":0,"d":"0.0"}},{"$f":"IF(J9 > 0,K9/J9,0)","v":{"v":334.3333333333333,"d":"334.3"}},{"$f":"VLOOKUP(A9,Formelhilfe!$A$15:$H$74,8,FALSE)","v":{"v":3,"d":"3.0"}},{"$f":"SUM(C9:H9)","v":{"v":1003,"d":"1,003.0"}},{"$f":"VLOOKUP($A9,'7'!$B$10:$D$75,3,FALSE)","v":349.9},{"$f":"VLOOKUP($A9,'8'!$B$10:$D$75,3,FALSE)","v":361.2},{"$f":"VLOOKUP($A9,'9'!$B$10:$D$75,3,FALSE)","v":{"v":0,"d":"0.0"}},{"$f":"VLOOKUP($A9,'10'!$B$10:$D$75,3,FALSE)","v":{"v":0,"d":"0.0"}},{"$f":"VLOOKUP($A9,'11'!$B$10:$D$75,3,FALSE)","v":{"v":0,"d":"0.0"}},{"$f":"VLOOKUP($A9,'12'!$B$10:$D$75,3,FALSE)","v":{"v":0,"d":"0.0"}},{"$f":"IF(S9 >0,T9/S9,0)","v":{"v":355.54999999999995,"d":"355.6"}},{"$f":"VLOOKUP(A9,Formelhilfe!$A$15:$O$74,15,FALSE)","v":{"v":2,"d":"2.0"}},{"$f":"SUM(L9:Q9)","v":{"v":711.0999999999999,"d":"711.1"}},{"$f":"IF(V9>0,W9/V9,0)","v":{"v":342.82000000000005,"d":"342.8"}},{"$f":"VLOOKUP(A9,Formelhilfe!$A$15:$P$74,16,FALSE)","v":{"v":5,"d":"5.0"}},{"$f":"SUM(C9:H9,L9:Q9)","v":{"v":1714.1000000000001,"d":"1,714.1"}}]
["Feldhaus Vanessa",{"$f":"VLOOKUP(A10,'Wettkampf 1'!$B$16:$C$75,2,FALSE)","v":"Lähden Jugend I"},{"$f":"VLOOKUP(A10,'Wettkampf 1'!$B$16:$D$75,3,FALSE)","v":301.6},{"$f":"VLOOKUP($A10,'2'!$B$16:$D$75,3,FALSE)","v":{"v":0,"d":"0.0"}},{"$f":"VLOOKUP($A10,'3'!$B$10:$D$75,3,FALSE)","v":320.3},{"$f":"VLOOKUP($A10,'4'!$B$10:$D$75,3,FALSE)","v":{"v":324,"d":"324.0"}},{"$f":"VLOOKUP($A10,'5'!$B$10:$D$75,3,FALSE)","v":{"v":0,"d":"0.0"}},{"$f":"VLOOKUP($A10,'6'!$B$10:$D$75,3,FALSE)","v":{"v":0,"d":"0.0"}},{"$f":"IF(J10 > 0,K10/J10,0)","v":315.3},{"$f":"VLOOKUP(A10,Formelhilfe!$A$15:$H$74,8,FALSE)","v":{"v":3,"d":"3.0"}},{"$f":"SUM(C10:H10)","v":{"v":945.9000000000001,"d":"945.9"}},{"$f":"VLOOKUP($A10,'7'!$B$10:$D$75,3,FALSE)","v":345.2},{"$f":"VLOOKUP($A10,'8'!$B$10:$D$75,3,FALSE)","v":318.7},{"$f":"VLOOKUP($A10,'9'!$B$10:$D$75,3,FALSE)","v":{"v":0,"d":"0.0"}},{"$f":"VLOOKUP($A10,'10'!$B$10:$D$75,3,FALSE)","v":{"v":0,"d":"0.0"}},{"$f":"VLOOKUP($A10,'11'!$B$10:$D$75,3,FALSE)","v":{"v":0,"d":"0.0"}},{"$f":"VLOOKUP($A10,'12'!$B$10:$D$75,3,FALSE)","v":{"v":0,"d":"0.0"}},{"$f":"IF(S10 >0,T10/S10,0)","v":{"v":331.95,"d":"332.0"}},{"$f":"VLOOKUP(A10,Formelhilfe!$A$15:$O$74,15,FALSE)","v":{"v":2,"d":"2.0"}},{"$f":"SUM(L10:Q10)","v":663.9},{"$f":"IF(V10>0,W10/V10,0)","v":{"v":321.96000000000004,"d":"322.0"}},{"$f":"VLOOKUP(A10,Formelhilfe!$A$15:$P$74,16,FALSE)","v":{"v":5,"d":"5.0"}},{"$f":"SUM(C10:H10,L10:Q10)","v":{"v":1609.8000000000002,"d":"1,609.8"}}]
["Stümpler Jan-Luca",{"$f":"VLOOKUP(A11,'Wettkampf 1'!$B$16:$C$75,2,FALSE)","v":"Lähden Jugend I"},{"$f":"VLOOKUP(A11,'Wettkampf 1'!$B$16:$D$75,3,FALSE)","v":{"v":0,"d":"0.0"}},{"$f":"VLOOKUP($A11,'2'!$B$16:$D$75,3,FALSE)","v":{"v":0,"d":"0.0"}},{"$f":"VLOOKUP($A11,'3'!$B$10:$D$75,3,FALSE)","v":{"v":0,"d":"0.0"}},{"$f":"VLOOKUP($A11,'4'!$B$10:$D$75,3,FALSE)","v":379.5},{"$f":"VLOOKUP($A11,'5'!$B$10:$D$75,3,FALSE)","v":388.3},{"$f":"VLOOKUP($A11,'6'!$B$10:$D$75,3,FALSE)","v":{"v":0,"d":"0.0"}},{"$f":"IF(J11 > 0,K11/J11,0)","v":383.9},{"$f":"VLOOKUP(A11,Formelhilfe!$A$15:$H$74,8,FALSE)","v":{"v":2,"d":"2.0"}},{"$f":"SUM(C11:H11)","v":767.8},{"$f":"VLOOKUP($A11,'7'!$B$10:$D$75,3,FALSE)","v":386.9},{"$f":"VLOOKUP($A11,'8'!$B$10:$D$75,3,FALSE)","v":379.4},{"$f":"VLOOKUP($A11,'9'!$B$10:$D$75,3,FALSE)","v":{"v":0,"d":"0.0"}},{"$f":"VLOOKUP($A11,'10'!$B$10:$D$75,3,FALSE)","v":{"v":0,"d":"0.0"}},{"$f":"VLOOKUP($A11,'11'!$B$10:$D$75,3,FALSE)","v":{"v":0,"d":"0.0"}},{"$f":"VLOOKUP($A11,'12'!$B$10:$D$75,3,FALSE)","v":{"v":0,"d":"0.0"}},{"$f":"IF(S11 >0,T11/S11,0)","v":{"v":383.15,"d":"383.2"}},{"$f":"VLOOKUP(A11,Formelhilfe!$A$15:$O$74,15,FALSE)","v":{"v":2,"d":"2.0"}},{"$f":"SUM(L11:Q11)","v":766.3},{"$f":"IF(V11>0,W11/V11,0)","v":{"v":383.525,"d":"383.5"}},{"$f":"VLOOKUP(A11,Formelhilfe!$A$15:$P$74,16,FALSE)","v":{"v":4,"d":"4.0"}},{"$f":"SUM(C11:H11,L11:Q11)","v":{"v":1534.1,"d":"1,534.1"}}]
["Gedecksnis Stefan",{"$f":"VLOOKUP(A12,'Wettkampf 1'!$B$16:$C$75,2,FALSE)","v":"Esterwegen"},{"$f":"VLOOKUP(A12,'Wettkampf 1'!$B$16:$D$75,3,FALSE)","v":200.6},{"$f":"VLOOKUP($A12,'2'!$B$16:$D$75,3,FALSE)","v":224.4},{"$f":"VLOOKUP($A12,'3'!$B$10:$D$75,3,FALSE)","v":{"v":0,"d":"0.0"}},{"$f":"VLOOKUP($A12,'4'!$B$10:$D$75,3,FALSE)","v":294.1},{"$f":"VLOOKUP($A12,'5'!$B$10:$D$75,3,FALSE)","v":289.8},{"$f":"VLOOKUP($A12,'6'!$B$10:$D$75,3,FALSE)","v":{"v":0,"d":"0.0"}},{"$f":"IF(J12 > 0,K12/J12,0)","v":{"v":252.22500000000002,"d":"252.2"}},{"$f":"VLOOKUP(A12,Formelhilfe!$A$15:$H$74,8,FALSE)","v":{"v":4,"d":"4.0"}},{"$f":"SUM(C12:H12)","v":{"v":1008.9000000000001,"d":"1,008.9"}},{"$f":"VLOOKUP($A12,'7'!$B$10:$D$75,3,FALSE)","v":279.9},{"$f":"VLOOKUP($A12,'8'!$B$10:$D$75,3,FALSE)","v":{"v":0,"d":"0.0"}},{"$f":"VLOOKUP($A12,'9'!$B$10:$D$75,3,FALSE)","v":{"v":0,"d":"0.0"}},{"$f":"VLOOKUP($A12,'10'!$B$10:$D$75,3,FALSE)","v":{"v":0,"d":"0.0"}},{"$f":"VLOOKUP($A12,'11'!$B$10:$D$75,3,FALSE)","v":{"v":0,"d":"0.0"}},{"$f":"VLOOKUP($A12,'12'!$B$10:$D$75,3,FALSE)","v":{"v":0,"d":"0.0"}},{"$f":"IF(S12 >0,T12/S12,0)","v":279.9},{"$f":"VLOOKUP(A12,Formelhilfe!$A$15:$O$74,15,FALSE)","v":{"v":1,"d":"1.0"}},{"$f":"SUM(L12:Q12)","v":279.9},{"$f":"IF(V12>0,W12/V12,0)","v":{"v":257.76000000000005,"d":"257.8"}},{"$f":"VLOOKUP(A12,Formelhilfe!$A$15:$P$74,16,FALSE)","v":{"v":5,"d":"5.0"}},{"$f":"SUM(C12:H12,L12:Q12)","v":{"v":1288.8000000000002,"d":"1,288.8"}}]
["Hanneken Maren",{"$f":"VLOOKUP(A13,'Wettkampf 1'!$B$16:$C$75,2,FALSE)","v":"Börgerwald"},{"$f":"VLOOKUP(A13,'Wettkampf 1'!$B$16:$D$75,3,FALSE)","v":{"v":321,"d":"321.0"}},{"$f":"VLOOKUP($A13,'2'!$B$16:$D$75,3,FALSE)","v":319.9},{"$f":"VLOOKUP($A13,'3'!$B$10:$D$75,3,FALSE)","v":296.3},{"$f":"VLOOKUP($A13,'4'!$B$10:$D$75,3,FALSE)","v":{"v":331,"d":"331.0"}},{"$f":"VLOOKUP($A13,'5'!$B$10:$D$75,3,FALSE)","v":{"v":0,"d":"0.0"}},{"$f":"VLOOKUP($A13,'6'!$B$10:$D$75,3,FALSE)","v":{"v":0,"d":"0.0"}},{"$f":"IF(J13 > 0,K13/J13,0)","v":{"v":317.05,"d":"317.1"}},{"$f":"VLOOKUP(A13,Formelhilfe!$A$15:$H$74,8,FALSE)","v":{"v":4,"d":"4.0"}},{"$f":"SUM(C13:H13)","v":{"v":1268.2,"d":"1,268.2"}},{"$f":"VLOOKUP($A13,'7'!$B$10:$D$75,3,FALSE)","v":{"v":0,"d":"0.0"}},{"$f":"VLOOKUP($A13,'8'!$B$10:$D$75,3,FALSE)","v":{"v":0,"d":"0.0"}},{"$f":"VLOOKUP($A13,'9'!$B$10:$D$75,3,FALSE)","v":{"v":0,"d":"0.0"}},{"$f":"VLOOKUP($A13,'10'!$B$10:$D$75,3,FALSE)","v":{"v":0,"d":"0.0"}},{"$f":"VLOOKUP($A13,'11'!$B$10:$D$75,3,FALSE)","v":{"v":0,"d":"0.0"}},{"$f":"VLOOKUP($A13,'12'!$B$10:$D$75,3,FALSE)","v":{"v":0,"d":"0.0"}},{"$f":"IF(S13 >0,T13/S13,0)","v":{"v":0,"d":"0.0"}},{"$f":"VLOOKUP(A13,Formelhilfe!$A$15:$O$74,15,FALSE)","v":{"v":0,"d":"0.0"}},{"$f":"SUM(L13:Q13)","v":{"v":0,"d":"0.0"}},{"$f":"IF(V13>0,W13/V13,0)","v":{"v":317.05,"d":"317.1"}},{"$f":"VLOOKUP(A13,Formelhilfe!$A$15:$P$74,16,FALSE)","v":{"v":4,"d":"4.0"}},{"$f":"SUM(C13:H13,L13:Q13)","v":{"v":1268.2,"d":"1,268.2"}}]
["Schulz Mika",{"$f":"VLOOKUP(A14,'Wettkampf 1'!$B$16:$C$75,2,FALSE)","v":"Lahn"},{"$f":"VLOOKUP(A14,'Wettkampf 1'!$B$16:$D$75,3,FALSE)","v":{"v":0,"d":"0.0"}},{"$f":"VLOOKUP($A14,'2'!$B$16:$D$75,3,FALSE)","v":291.1},{"$f":"VLOOKUP($A14,'3'!$B$10:$D$75,3,FALSE)","v":239.9},{"$f":"VLOOKUP($A14,'4'!$B$10:$D$75,3,FALSE)","v":252.5},{"$f":"VLOOKUP($A14,'5'!$B$10:$D$75,3,FALSE)","v":{"v":0,"d":"0.0"}},{"$f":"VLOOKUP($A14,'6'!$B$10:$D$75,3,FALSE)","v":{"v":0,"d":"0.0"}},{"$f":"IF(J14 > 0,K14/J14,0)","v":{"v":261.1666666666667,"d":"261.2"}},{"$f":"VLOOKUP(A14,Formelhilfe!$A$15:$H$74,8,FALSE)","v":{"v":3,"d":"3.0"}},{"$f":"SUM(C14:H14)","v":783.5},{"$f":"VLOOKUP($A14,'7'!$B$10:$D$75,3,FALSE)","v":174.6},{"$f":"VLOOKUP($A14,'8'!$B$10:$D$75,3,FALSE)","v":203.4},{"$f":"VLOOKUP($A14,'9'!$B$10:$D$75,3,FALSE)","v":{"v":0,"d":"0.0"}},{"$f":"VLOOKUP($A14,'10'!$B$10:$D$75,3,FALSE)","v":{"v":0,"d":"0.0"}},{"$f":"VLOOKUP($A14,'11'!$B$10:$D$75,3,FALSE)","v":{"v":0,"d":"0.0"}},{"$f":"VLOOKUP($A14,'12'!$B$10:$D$75,3,FALSE)","v":{"v":0,"d":"0.0"}},{"$f":"IF(S14 >0,T14/S14,0)","v":{"v":189,"d":"189.0"}},{"$f":"VLOOKUP(A14,Formelhilfe!$A$15:$O$74,15,FALSE)","v":{"v":2,"d":"2.0"}},{"$f":"SUM(L14:Q14)","v":{"v":378,"d":"378.0"}},{"$f":"IF(V14>0,W14/V14,0)","v":232.3},{"$f":"VLOOKUP(A14,Formelhilfe!$A$15:$P$74,16,FALSE)","v":{"v":5,"d":"5.0"}},{"$f":"SUM(C14:H14,L14:Q14)","v":{"v":1161.5,"d":"1,161.5"}}]
["Jansen Lars",{"$f":"VLOOKUP(A15,'Wettkampf 1'!$B$16:$C$75,2,FALSE)","v":"Spahnharrenstätte"},{"$f":"VLOOKUP(A15,'Wettkampf 1'!$B$16:$D$75,3,FALSE)","v":234.2},{"$f":"VLOOKUP($A15,'2'!$B$16:$D$75,3,FALSE)","v":274.1},{"$f":"VLOOKUP($A15,'3'!$B$10:$D$75,3,FALSE)","v":{"v":0,"d":"0.0"}},{"$f":"VLOOKUP($A15,'4'!$B$10:$D$75,3,FALSE)","v":224.5},{"$f":"VLOOKUP($A15,'5'!$B$10:$D$75,3,FALSE)","v":255.6},{"$f":"VLOOKUP($A15,'6'!$B$10:$D$75,3,FALSE)","v":{"v":0,"d":"0.0"}},{"$f":"IF(J15 > 0,K15/J15,0)","v":247.1},{"$f":"VLOOKUP(A15,Formelhilfe!$A$15:$H$74,8,FALSE)","v":{"v":4,"d":"4.0"}},{"$f":"SUM(C15:H15)","v":988.4},{"$f":"VLOOKUP($A15,'7'!$B$10:$D$75,3,FALSE)","v":{"v":0,"d":"0.0"}},{"$f":"VLOOKUP($A15,'8'!$B$10:$D$75,3,FALSE)","v":{"v":0,"d":"0.0"}},{"$f":"VLOOKUP($A15,'9'!$B$10:$D$75,3,FALSE)","v":{"v":0,"d":"0.0"}},{"$f":"VLOOKUP($A15,'10'!$B$10:$D$75,3,FALSE)","v":{"v":0,"d":"0.0"}},{"$f":"VLOOKUP($A15,'11'!$B$10:$D$75,3,FALSE)","v":{"v":0,"d":"0.0"}},{"$f":"VLOOKUP($A15,'12'!$B$10:$D$75,3,FALSE)","v":{"v":0,"d":"0.0"}},{"$f":"IF(S15 >0,T15/S15,0)","v":{"v":0,"d":"0.0"}},{"$f":"VLOOKUP(A15,Formelhilfe!$A$15:$O$74,15,FALSE)","v":{"v":0,"d":"0.0"}},{"$f":"SUM(L15:Q15)","v":{"v":0,"d":"0.0"}},{"$f":"IF(V15>0,W15/V15,0)","v":247.1},{"$f":"VLOOKUP(A15,Formelhilfe!$A$15:$P$74,16,FALSE)","v":{"v":4,"d":"4.0"}},{"$f":"SUM(C15:H15,L15:Q15)","v":988.4}]
["Lohmann Amy",{"$f":"VLOOKUP(A16,'Wettkampf 1'!$B$16:$C$75,2,FALSE)","v":"Börgerwald"},{"$f":"VLOOKUP(A16,'Wettkampf 1'!$B$16:$D$75,3,FALSE)","v":{"v":0,"d":"0.0"}},{"$f":"VLOOKUP($A16,'2'!$B$16:$D$75,3,FALSE)","v":{"v":0,"d":"0.0"}},{"$f":"VLOOKUP($A16,'3'!$B$10:$D$75,3,FALSE)","v":353.9},{"$f":"VLOOKUP($A16,'4'!$B$10:$D$75,3,FALSE)","v":{"v":366,"d":"366.0"}},{"$f":"VLOOKUP($A16,'5'!$B$10:$D$75,3,FALSE)","v":{"v":0,"d":"0.0"}},{"$f":"VLOOKUP($A16,'6'!$B$10:$D$75,3,FALSE)","v":{"v":0,"d":"0.0"}},{"$f":"IF(J16 > 0,K16/J16,0)","v":{"v":359.95,"d":"360.0"}},{"$f":"VLOOKUP(A16,Formelhilfe!$A$15:$H$74,8,FALSE)","v":{"v":2,"d":"2.0"}},{"$f":"SUM(C16:H16)","v":719.9},{"$f":"VLOOKUP($A16,'7'!$B$10:$D$75,3,FALSE)","v":{"v":0,"d":"0.0"}},{"$f":"VLOOKUP($A16,'8'!$B$10:$D$75,3,FALSE)","v":{"v":0,"d":"0.0"}},{"$f":"VLOOKUP($A16,'9'!$B$10:$D$75,3,FALSE)","v":{"v":0,"d":"0.0"}},{"$f":"VLOOKUP($A16,'10'!$B$10:$D$75,3,FALSE)","v":{"v":0,"d":"0.0"}},{"$f":"VLOOKUP($A16,'11'!$B$10:$D$75,3,FALSE)","v":{"v":0,"d":"0.0"}},{"$f":"VLOOKUP($A16,'12'!$B$10:$D$75,3,FALSE)","v":{"v":0,"d":"0.0"}},{"$f":"IF(S16 >0,T16/S16,0)","v":{"v":0,"d":"0.0"}},{"$f":"VLOOKUP(A16,Formelhilfe!$A$15:$O$74,15,FALSE)","v":{"v":0,"d":"0.0"}},{"$f":"SUM(L16:Q16)","v":{"v":0,"d":"0.0"}},{"$f":"IF(V16>0,W16/V16,0)","v":{"v":359.95,"d":"360.0"}},{"$f":"VLOOKUP(A16,Formelhilfe!$A$15:$P$74,16,FALSE)","v":{"v":2,"d":"2.0"}},{"$f":"SUM(C16:H16,L16:Q16)","v":719.9}]
["Köstering Nele",{"$f":"VLOOKUP(A17,'Wettkampf 1'!$B$16:$C$75,2,FALSE)","v":"Börgerwald"},{"$f":"VLOOKUP(A17,'Wettkampf 1'!$B$16:$D$75,3,FALSE)","v":{"v":353,"d":"353.0"}},{"$f":"VLOOKUP($A17,'2'!$B$16:$D$75,3,FALSE)","v":{"v":0,"d":"0.0"}},{"$f":"VLOOKUP($A17,'3'!$B$10:$D$75,3,FALSE)","v":{"v":0,"d":"0.0"}},{"$f":"VLOOKUP($A17,'4'!$B$10:$D$75,3,FALSE)","v":345.5},{"$f":"VLOOKUP($A17,'5'!$B$10:$D$75,3,FALSE)","v":{"v":0,"d":"0.0"}},{"$f":"VLOOKUP($A17,'6'!$B$10:$D$75,3,FALSE)","v":{"v":0,"d":"0.0"}},{"$f":"IF(J17 > 0,K17/J17,0)","v":{"v":349.25,"d":"349.3"}},{"$f":"VLOOKUP(A17,Formelhilfe!$A$15:$H$74,8,FALSE)","v":{"v":2,"d":"2.0"}},{"$f":"SUM(C17:H17)","v":698.5},{"$f":"VLOOKUP($A17,'7'!$B$10:$D$75,3,FALSE)","v":{"v":0,"d":"0.0"}},{"$f":"VLOOKUP($A17,'8'!$B$10:$D$75,3,FALSE)","v":{"v":0,"d":"0.0"}},{"$f":"VLOOKUP($A17,'9'!$B$10:$D$75,3,FALSE)","v":{"v":0,"d":"0.0"}},{"$f":"VLOOKUP($A17,'10'!$B$10:$D$75,3,FALSE)","v":{"v":0,"d":"0.0"}},{"$f":"VLOOKUP($A17,'11'!$B$10:$D$75,3,FALSE)","v":{"v":0,"d":"0.0"}},{"$f":"VLOOKUP($A17,'12'!$B$10:$D$75,3,FALSE)","v":{"v":0,"d":"0.0"}},{"$f":"IF(S17 >0,T17/S17,0)","v":{"v":0,"d":"0.0"}},{"$f":"VLOOKUP(A17,Formelhilfe!$A$15:$O$74,15,FALSE)","v":{"v":0,"d":"0.0"}},{"$f":"SUM(L17:Q17)","v":{"v":0,"d":"0.0"}},{"$f":"IF(V17>0,W17/V17,0)","v":{"v":349.25,"d":"349.3"}},{"$f":"VLOOKUP(A17,Formelhilfe!$A$15:$P$74,16,FALSE)","v":{"v":2,"d":"2.0"}},{"$f":"SUM(C17:H17,L17:Q17)","v":698.5}]
["Dolling Leon",{"$f":"VLOOKUP(A18,'Wettkampf 1'!$B$16:$C$75,2,FALSE)","v":"Lorup"},{"$f":"VLOOKUP(A18,'Wettkampf 1'!$B$16:$D$75,3,FALSE)","v":274.7},{"$f":"VLOOKUP($A18,'2'!$B$16:$D$75,3,FALSE)","v":{"v":0,"d":"0.0"}},{"$f":"VLOOKUP($A18,'3'!$B$10:$D$75,3,FALSE)","v":{"v":0,"d":"0.0"}},{"$f":"VLOOKUP($A18,'4'!$B$10:$D$75,3,FALSE)","v":287.1},{"$f":"VLOOKUP($A18,'5'!$B$10:$D$75,3,FALSE)","v":{"v":0,"d":"0.0"}},{"$f":"VLOOKUP($A18,'6'!$B$10:$D$75,3,FALSE)","v":{"v":0,"d":"0.0"}},{"$f":"IF(J18 > 0,K18/J18,0)","v":280.9},{"$f":"VLOOKUP(A18,Formelhilfe!$A$15:$H$74,8,FALSE)","v":{"v":2,"d":"2.0"}},{"$f":"SUM(C18:H18)","v":561.8},{"$f":"VLOOKUP($A18,'7'!$B$10:$D$75,3,FALSE)","v":{"v":0,"d":"0.0"}},{"$f":"VLOOKUP($A18,'8'!$B$10:$D$75,3,FALSE)","v":{"v":0,"d":"0.0"}},{"$f":"VLOOKUP($A18,'9'!$B$10:$D$75,3,FALSE)","v":{"v":0,"d":"0.0"}},{"$f":"VLOOKUP($A18,'10'!$B$10:$D$75,3,FALSE)","v":{"v":0,"d":"0.0"}},{"$f":"VLOOKUP($A18,'11'!$B$10:$D$75,3,FALSE)","v":{"v":0,"d":"0.0"}},{"$f":"VLOOKUP($A18,'12'!$B$10:$D$75,3,FALSE)","v":{"v":0,"d":"0.0"}},{"$f":"IF(S18 >0,T18/S18,0)","v":{"v":0,"d":"0.0"}},{"$f":"VLOOKUP(A18,Formelhilfe!$A$15:$O$74,15,FALSE)","v":{"v":0,"d":"0.0"}},{"$f":"SUM(L18:Q18)","v":{"v":0,"d":"0.0"}},{"$f":"IF(V18>0,W18/V18,0)","v":280.9},{"$f":"VLOOKUP(A18,Formelhilfe!$A$15:$P$74,16,FALSE)","v":{"v":2,"d":"2.0"}},{"$f":"SUM(C18:H18,L18:Q18)","v":561.8}]
["Tharner Kim",{"$f":"VLOOKUP(A19,'Wettkampf 1'!$B$16:$C$75,2,FALSE)","v":"Sögel"},{"$f":"VLOOKUP(A19,'Wettkampf 1'!$B$16:$D$75,3,FALSE)","v":{"v":0,"d":"0.0"}},{"$f":"VLOOKUP($A19,'2'!$B$16:$D$75,3,FALSE)","v":{"v":0,"d":"0.0"}},{"$f":"VLOOKUP($A19,'3'!$B$10:$D$75,3,FALSE)","v":{"v":0,"d":"0.0"}},{"$f":"VLOOKUP($A19,'4'!$B$10:$D$75,3,FALSE)","v":358.1},{"$f":"VLOOKUP($A19,'5'!$B$10:$D$75,3,FALSE)","v":{"v":0,"d":"0.0"}},{"$f":"VLOOKUP($A19,'6'!$B$10:$D$75,3,FALSE)","v":{"v":0,"d":"0.0"}},{"$f":"IF(J19 > 0,K19/J19,0)","v":358.1},{"$f":"VLOOKUP(A19,Formelhilfe!$A$15:$H$74,8,FALSE)","v":{"v":1,"d":"1.0"}},{"$f":"SUM(C19:H19)","v":358.1},{"$f":"VLOOKUP($A19,'7'!$B$10:$D$75,3,FALSE)","v":{"v":0,"d":"0.0"}},{"$f":"VLOOKUP($A19,'8'!$B$10:$D$75,3,FALSE)","v":{"v":0,"d":"0.0"}},{"$f":"VLOOKUP($A19,'9'!$B$10:$D$75,3,FALSE)","v":{"v":0,"d":"0.0"}},{"$f":"VLOOKUP($A19,'10'!$B$10:$D$75,3,FALSE)","v":{"v":0,"d":"0.0"}},{"$f":"VLOOKUP($A19,'11'!$B$10:$D$75,3,FALSE)","v":{"v":0,"d":"0.0"}},{"$f":"VLOOKUP($A19,'12'!$B$10:$D$75,3,FALSE)","v":{"v":0,"d":"0.0"}},{"$f":"IF(S19 >0,T19/S19,0)","v":{"v":0,"d":"0.0"}},{"$f":"VLOOKUP(A19,Formelhilfe!$A$15:$O$74,15,FALSE)","v":{"v":0,"d":"0.0"}},{"$f":"SUM(L19:Q19)","v":{"v":0,"d":"0.0"}},{"$f":"IF(V19>0,W19/V19,0)","v":358.1},{"$f":"VLOOKUP(A19,Formelhilfe!$A$15:$P$74,16,FALSE)","v":{"v":1,"d":"1.0"}},{"$f":"SUM(C19:H19,L19:Q19)","v":358.1}]
["Köster Thilo",{"$f":"VLOOKUP(A20,'Wettkampf 1'!$B$16:$C$75,2,FALSE)","v":"Spahnharrenstätte"},{"$f":"VLOOKUP(A20,'Wettkampf 1'!$B$16:$D$75,3,FALSE)","v":{"v":0,"d":"0.0"}},{"$f":"VLOOKUP($A20,'2'!$B$16:$D$75,3,FALSE)","v":{"v":0,"d":"0.0"}},{"$f":"VLOOKUP($A20,'3'!$B$10:$D$75,3,FALSE)","v":{"v":0,"d":"0.0"}},{"$f":"VLOOKUP($A20,'4'!$B$10:$D$75,3,FALSE)","v":132.6},{"$f":"VLOOKUP($A20,'5'!$B$10:$D$75,3,FALSE)","v":{"v":224,"d":"224.0"}},{"$f":"VLOOKUP($A20,'6'!$B$10:$D$75,3,FALSE)","v":{"v":0,"d":"0.0"}},{"$f":"IF(J20 > 0,K20/J20,0)","v":178.3},{"$f":"VLOOKUP(A20,Formelhilfe!$A$15:$H$74,8,FALSE)","v":{"v":2,"d":"2.0"}},{"$f":"SUM(C20:H20)","v":356.6},{"$f":"VLOOKUP($A20,'7'!$B$10:$D$75,3,FALSE)","v":{"v":0,"d":"0.0"}},{"$f":"VLOOKUP($A20,'8'!$B$10:$D$75,3,FALSE)","v":{"v":0,"d":"0.0"}},{"$f":"VLOOKUP($A20,'9'!$B$10:$D$75,3,FALSE)","v":{"v":0,"d":"0.0"}},{"$f":"VLOOKUP($A20,'10'!$B$10:$D$75,3,FALSE)","v":{"v":0,"d":"0.0"}},{"$f":"VLOOKUP($A20,'11'!$B$10:$D$75,3,FALSE)","v":{"v":0,"d":"0.0"}},{"$f":"VLOOKUP($A20,'12'!$B$10:$D$75,3,FALSE)","v":{"v":0,"d":"0.0"}},{"$f":"IF(S20 >0,T20/S20,0)","v":{"v":0,"d":"0.0"}},{"$f":"VLOOKUP(A20,Formelhilfe!$A$15:$O$74,15,FALSE)","v":{"v":0,"d":"0.0"}},{"$f":"SUM(L20:Q20)","v":{"v":0,"d":"0.0"}},{"$f":"IF(V20>0,W20/V20,0)","v":178.3},{"$f":"VLOOKUP(A20,Formelhilfe!$A$15:$P$74,16,FALSE)","v":{"v":2,"d":"2.0"}},{"$f":"SUM(C20:H20,L20:Q20)","v":356.6}]
["Leis Fynn Lucas ",{"$f":"VLOOKUP(A21,'Wettkampf 1'!$B$16:$C$75,2,FALSE)","v":"Spahnharrenstätte"},{"$f":"VLOOKUP(A21,'Wettkampf 1'!$B$16:$D$75,3,FALSE)","v":83.8},{"$f":"VLOOKUP($A21,'2'!$B$16:$D$75,3,FALSE)","v":{"v":0,"d":"0.0"}},{"$f":"VLOOKUP($A21,'3'!$B$10:$D$75,3,FALSE)","v":{"v":0,"d":"0.0"}},{"$f":"VLOOKUP($A21,'4'!$B$10:$D$75,3,FALSE)","v":{"v":0,"d":"0.0"}},{"$f":"VLOOKUP($A21,'5'!$B$10:$D$75,3,FALSE)","v":{"v":0,"d":"0.0"}},{"$f":"VLOOKUP($A21,'6'!$B$10:$D$75,3,FALSE)","v":{"v":0,"d":"0.0"}},{"$f":"IF(J21 > 0,K21/J21,0)","v":83.8},{"$f":"VLOOKUP(A21,Formelhilfe!$A$15:$H$74,8,FALSE)","v":{"v":1,"d":"1.0"}},{"$f":"SUM(C21:H21)","v":83.8},{"$f":"VLOOKUP($A21,'7'!$B$10:$D$75,3,FALSE)","v":{"v":0,"d":"0.0"}},{"$f":"VLOOKUP($A21,'8'!$B$10:$D$75,3,FALSE)","v":{"v":0,"d":"0.0"}},{"$f":"VLOOKUP($A21,'9'!$B$10:$D$75,3,FALSE)","v":{"v":0,"d":"0.0"}},{"$f":"VLOOKUP($A21,'10'!$B$10:$D$75,3,FALSE)","v":{"v":0,"d":"0.0"}},{"$f":"VLOOKUP($A21,'11'!$B$10:$D$75,3,FALSE)","v":{"v":0,"d":"0.0"}},{"$f":"VLOOKUP($A21,'12'!$B$10:$D$75,3,FALSE)","v":{"v":0,"d":"0.0"}},{"$f":"IF(S21 >0,T21/S21,0)","v":{"v":0,"d":"0.0"}},{"$f":"VLOOKUP(A21,Formelhilfe!$A$15:$O$74,15,FALSE)","v":{"v":0,"d":"0.0"}},{"$f":"SUM(L21:Q21)","v":{"v":0,"d":"0.0"}},{"$f":"IF(V21>0,W21/V21,0)","v":83.8},{"$f":"VLOOKUP(A21,Formelhilfe!$A$15:$P$74,16,FALSE)","v":{"v":1,"d":"1.0"}},{"$f":"SUM(C21:H21,L21:Q21)","v":83.8}]
["Wübben Jasper",{"$f":"VLOOKUP(A22,'Wettkampf 1'!$B$16:$C$75,2,FALSE)","v":"Esterwegen"},{"$f":"VLOOKUP(A22,'Wettkampf 1'!$B$16:$D$75,3,FALSE)","v":{"v":0,"d":"0.0"}},{"$f":"VLOOKUP($A22,'2'!$B$16:$D$75,3,FALSE)","v":{"v":0,"d":"0.0"}},{"$f":"VLOOKUP($A22,'3'!$B$10:$D$75,3,FALSE)","v":{"v":0,"d":"0.0"}},{"$f":"VLOOKUP($A22,'4'!$B$10:$D$75,3,FALSE)","v":{"v":0,"d":"0.0"}},{"$f":"VLOOKUP($A22,'5'!$B$10:$D$75,3,FALSE)","v":{"v":0,"d":"0.0"}},{"$f":"VLOOKUP($A22,'6'!$B$10:$D$75,3,FALSE)","v":{"v":0,"d":"0.0"}},{"$f":"IF(J22 > 0,K22/J22,0)","v":{"v":0,"d":"0.0"}},{"$f":"VLOOKUP(A22,Formelhilfe!$A$15:$H$74,8,FALSE)","v":{"v":0,"d":"0.0"}},{"$f":"SUM(C22:H22)","v":{"v":0,"d":"0.0"}},{"$f":"VLOOKUP($A22,'7'!$B$10:$D$75,3,FALSE)","v":{"v":0,"d":"0.0"}},{"$f":"VLOOKUP($A22,'8'!$B$10:$D$75,3,FALSE)","v":{"v":0,"d":"0.0"}},{"$f":"VLOOKUP($A22,'9'!$B$10:$D$75,3,FALSE)","v":{"v":0,"d":"0.0"}},{"$f":"VLOOKUP($A22,'10'!$B$10:$D$75,3,FALSE)","v":{"v":0,"d":"0.0"}},{"$f":"VLOOKUP($A22,'11'!$B$10:$D$75,3,FALSE)","v":{"v":0,"d":"0.0"}},{"$f":"VLOOKUP($A22,'12'!$B$10:$D$75,3,FALSE)","v":{"v":0,"d":"0.0"}},{"$f":"IF(S22 >0,T22/S22,0)","v":{"v":0,"d":"0.0"}},{"$f":"VLOOKUP(A22,Formelhilfe!$A$15:$O$74,15,FALSE)","v":{"v":0,"d":"0.0"}},{"$f":"SUM(L22:Q22)","v":{"v":0,"d":"0.0"}},{"$f":"IF(V22>0,W22/V22,0)","v":{"v":0,"d":"0.0"}},{"$f":"VLOOKUP(A22,Formelhilfe!$A$15:$P$74,16,FALSE)","v":{"v":0,"d":"0.0"}},{"$f":"SUM(C22:H22,L22:Q22)","v":{"v":0,"d":"0.0"}}]
["Engbers Julian",{"$f":"VLOOKUP(A23,'Wettkampf 1'!$B$16:$C$75,2,FALSE)","v":"Esterwegen"},{"$f":"VLOOKUP(A23,'Wettkampf 1'!$B$16:$D$75,3,FALSE)","v":{"v":0,"d":"0.0"}},{"$f":"VLOOKUP($A23,'2'!$B$16:$D$75,3,FALSE)","v":{"v":0,"d":"0.0"}},{"$f":"VLOOKUP($A23,'3'!$B$10:$D$75,3,FALSE)","v":{"v":0,"d":"0.0"}},{"$f":"VLOOKUP($A23,'4'!$B$10:$D$75,3,FALSE)","v":{"v":0,"d":"0.0"}},{"$f":"VLOOKUP($A23,'5'!$B$10:$D$75,3,FALSE)","v":{"v":0,"d":"0.0"}},{"$f":"VLOOKUP($A23,'6'!$B$10:$D$75,3,FALSE)","v":{"v":0,"d":"0.0"}},{"$f":"IF(J23 > 0,K23/J23,0)","v":{"v":0,"d":"0.0"}},{"$f":"VLOOKUP(A23,Formelhilfe!$A$15:$H$74,8,FALSE)","v":{"v":0,"d":"0.0"}},{"$f":"SUM(C23:H23)","v":{"v":0,"d":"0.0"}},{"$f":"VLOOKUP($A23,'7'!$B$10:$D$75,3,FALSE)","v":{"v":0,"d":"0.0"}},{"$f":"VLOOKUP($A23,'8'!$B$10:$D$75,3,FALSE)","v":{"v":0,"d":"0.0"}},{"$f":"VLOOKUP($A23,'9'!$B$10:$D$75,3,FALSE)","v":{"v":0,"d":"0.0"}},{"$f":"VLOOKUP($A23,'10'!$B$10:$D$75,3,FALSE)","v":{"v":0,"d":"0.0"}},{"$f":"VLOOKUP($A23,'11'!$B$10:$D$75,3,FALSE)","v":{"v":0,"d":"0.0"}},{"$f":"VLOOKUP($A23,'12'!$B$10:$D$75,3,FALSE)","v":{"v":0,"d":"0.0"}},{"$f":"IF(S23 >0,T23/S23,0)","v":{"v":0,"d":"0.0"}},{"$f":"VLOOKUP(A23,Formelhilfe!$A$15:$O$74,15,FALSE)","v":{"v":0,"d":"0.0"}},{"$f":"SUM(L23:Q23)","v":{"v":0,"d":"0.0"}},{"$f":"IF(V23>0,W23/V23,0)","v":{"v":0,"d":"0.0"}},{"$f":"VLOOKUP(A23,Formelhilfe!$A$15:$P$74,16,FALSE)","v":{"v":0,"d":"0.0"}},{"$f":"SUM(C23:H23,L23:Q23)","v":{"v":0,"d":"0.0"}}]
["Meyer Johan",{"$f":"VLOOKUP(A24,'Wettkampf 1'!$B$16:$C$75,2,FALSE)","v":"Esterwegen"},{"$f":"VLOOKUP(A24,'Wettkampf 1'!$B$16:$D$75,3,FALSE)","v":{"v":0,"d":"0.0"}},{"$f":"VLOOKUP($A24,'2'!$B$16:$D$75,3,FALSE)","v":{"v":0,"d":"0.0"}},{"$f":"VLOOKUP($A24,'3'!$B$10:$D$75,3,FALSE)","v":{"v":0,"d":"0.0"}},{"$f":"VLOOKUP($A24,'4'!$B$10:$D$75,3,FALSE)","v":{"v":0,"d":"0.0"}},{"$f":"VLOOKUP($A24,'5'!$B$10:$D$75,3,FALSE)","v":{"v":0,"d":"0.0"}},{"$f":"VLOOKUP($A24,'6'!$B$10:$D$75,3,FALSE)","v":{"v":0,"d":"0.0"}},{"$f":"IF(J24 > 0,K24/J24,0)","v":{"v":0,"d":"0.0"}},{"$f":"VLOOKUP(A24,Formelhilfe!$A$15:$H$74,8,FALSE)","v":{"v":0,"d":"0.0"}},{"$f":"SUM(C24:H24)","v":{"v":0,"d":"0.0"}},{"$f":"VLOOKUP($A24,'7'!$B$10:$D$75,3,FALSE)","v":{"v":0,"d":"0.0"}},{"$f":"VLOOKUP($A24,'8'!$B$10:$D$75,3,FALSE)","v":{"v":0,"d":"0.0"}},{"$f":"VLOOKUP($A24,'9'!$B$10:$D$75,3,FALSE)","v":{"v":0,"d":"0.0"}},{"$f":"VLOOKUP($A24,'10'!$B$10:$D$75,3,FALSE)","v":{"v":0,"d":"0.0"}},{"$f":"VLOOKUP($A24,'11'!$B$10:$D$75,3,FALSE)","v":{"v":0,"d":"0.0"}},{"$f":"VLOOKUP($A24,'12'!$B$10:$D$75,3,FALSE)","v":{"v":0,"d":"0.0"}},{"$f":"IF(S24 >0,T24/S24,0)","v":{"v":0,"d":"0.0"}},{"$f":"VLOOKUP(A24,Formelhilfe!$A$15:$O$74,15,FALSE)","v":{"v":0,"d":"0.0"}},{"$f":"SUM(L24:Q24)","v":{"v":0,"d":"0.0"}},{"$f":"IF(V24>0,W24/V24,0)","v":{"v":0,"d":"0.0"}},{"$f":"VLOOKUP(A24,Formelhilfe!$A$15:$P$74,16,FALSE)","v":{"v":0,"d":"0.0"}},{"$f":"SUM(C24:H24,L24:Q24)","v":{"v":0,"d":"0.0"}}]
["Schütze 5",{"$f":"VLOOKUP(A25,'Wettkampf 1'!$B$16:$C$75,2,FALSE)","v":"Esterwegen"},{"$f":"VLOOKUP(A25,'Wettkampf 1'!$B$16:$D$75,3,FALSE)","v":{"v":0,"d":"0.0"}},{"$f":"VLOOKUP($A25,'2'!$B$16:$D$75,3,FALSE)","v":{"v":0,"d":"0.0"}},{"$f":"VLOOKUP($A25,'3'!$B$10:$D$75,3,FALSE)","v":{"v":0,"d":"0.0"}},{"$f":"VLOOKUP($A25,'4'!$B$10:$D$75,3,FALSE)","v":{"v":0,"d":"0.0"}},{"$f":"VLOOKUP($A25,'5'!$B$10:$D$75,3,FALSE)","v":{"v":0,"d":"0.0"}},{"$f":"VLOOKUP($A25,'6'!$B$10:$D$75,3,FALSE)","v":{"v":0,"d":"0.0"}},{"$f":"IF(J25 > 0,K25/J25,0)","v":{"v":0,"d":"0.0"}},{"$f":"VLOOKUP(A25,Formelhilfe!$A$15:$H$74,8,FALSE)","v":{"v":0,"d":"0.0"}},{"$f":"SUM(C25:H25)","v":{"v":0,"d":"0.0"}},{"$f":"VLOOKUP($A25,'7'!$B$10:$D$75,3,FALSE)","v":{"v":0,"d":"0.0"}},{"$f":"VLOOKUP($A25,'8'!$B$10:$D$75,3,FALSE)","v":{"v":0,"d":"0.0"}},{"$f":"VLOOKUP($A25,'9'!$B$10:$D$75,3,FALSE)","v":{"v":0,"d":"0.0"}},{"$f":"VLOOKUP($A25,'10'!$B$10:$D$75,3,FALSE)","v":{"v":0,"d":"0.0"}},{"$f":"VLOOKUP($A25,'11'!$B$10:$D$75,3,FALSE)","v":{"v":0,"d":"0.0"}},{"$f":"VLOOKUP($A25,'12'!$B$10:$D$75,3,FALSE)","v":{"v":0,"d":"0.0"}},{"$f":"IF(S25 >0,T25/S25,0)","v":{"v":0,"d":"0.0"}},{"$f":"VLOOKUP(A25,Formelhilfe!$A$15:$O$74,15,FALSE)","v":{"v":0,"d":"0.0"}},{"$f":"SUM(L25:Q25)","v":{"v":0,"d":"0.0"}},{"$f":"IF(V25>0,W25/V25,0)","v":{"v":0,"d":"0.0"}},{"$f":"VLOOKUP(A25,Formelhilfe!$A$15:$P$74,16,FALSE)","v":{"v":0,"d":"0.0"}},{"$f":"SUM(C25:H25,L25:Q25)","v":{"v":0,"d":"0.0"}}]
["Schütze 14",{"$f":"VLOOKUP(A26,'Wettkampf 1'!$B$16:$C$75,2,FALSE)","v":"Börgerwald"},{"$f":"VLOOKUP(A26,'Wettkampf 1'!$B$16:$D$75,3,FALSE)","v":{"v":0,"d":"0.0"}},{"$f":"VLOOKUP($A26,'2'!$B$16:$D$75,3,FALSE)","v":{"v":0,"d":"0.0"}},{"$f":"VLOOKUP($A26,'3'!$B$10:$D$75,3,FALSE)","v":{"v":0,"d":"0.0"}},{"$f":"VLOOKUP($A26,'4'!$B$10:$D$75,3,FALSE)","v":{"v":0,"d":"0.0"}},{"$f":"VLOOKUP($A26,'5'!$B$10:$D$75,3,FALSE)","v":{"v":0,"d":"0.0"}},{"$f":"VLOOKUP($A26,'6'!$B$10:$D$75,3,FALSE)","v":{"v":0,"d":"0.0"}},{"$f":"IF(J26 > 0,K26/J26,0)","v":{"v":0,"d":"0.0"}},{"$f":"VLOOKUP(A26,Formelhilfe!$A$15:$H$74,8,FALSE)","v":{"v":0,"d":"0.0"}},{"$f":"SUM(C26:H26)","v":{"v":0,"d":"0.0"}},{"$f":"VLOOKUP($A26,'7'!$B$10:$D$75,3,FALSE)","v":{"v":0,"d":"0.0"}},{"$f":"VLOOKUP($A26,'8'!$B$10:$D$75,3,FALSE)","v":{"v":0,"d":"0.0"}},{"$f":"VLOOKUP($A26,'9'!$B$10:$D$75,3,FALSE)","v":{"v":0,"d":"0.0"}},{"$f":"VLOOKUP($A26,'10'!$B$10:$D$75,3,FALSE)","v":{"v":0,"d":"0.0"}},{"$f":"VLOOKUP($A26,'11'!$B$10:$D$75,3,FALSE)","v":{"v":0,"d":"0.0"}},{"$f":"VLOOKUP($A26,'12'!$B$10:$D$75,3,FALSE)","v":{"v":0,"d":"0.0"}},{"$f":"IF(S26 >0,T26/S26,0)","v":{"v":0,"d":"0.0"}},{"$f":"VLOOKUP(A26,Formelhilfe!$A$15:$O$74,15,FALSE)","v":{"v":0,"d":"0.0"}},{"$f":"SUM(L26:Q26)","v":{"v":0,"d":"0.0"}},{"$f":"IF(V26>0,W26/V26,0)","v":{"v":0,"d":"0.0"}},{"$f":"VLOOKUP(A26,Formelhilfe!$A$15:$P$74,16,FALSE)","v":{"v":0,"d":"0.0"}},{"$f":"SUM(C26:H26,L26:Q26)","v":{"v":0,"d":"0.0"}}]
["Schütze 15",{"$f":"VLOOKUP(A27,'Wettkampf 1'!$B$16:$C$75,2,FALSE)","v":"Börgerwald"},{"$f":"VLOOKUP(A27,'Wettkampf 1'!$B$16:$D$75,3,FALSE)","v":{"v":0,"d":"0.0"}},{"$f":"VLOOKUP($A27,'2'!$B$16:$D$75,3,FALSE)","v":{"v":0,"d":"0.0"}},{"$f":"VLOOKUP($A27,'3'!$B$10:$D$75,3,FALSE)","v":{"v":0,"d":"0.0"}},{"$f":"VLOOKUP($A27,'4'!$B$10:$D$75,3,FALSE)","v":{"v":0,"d":"0.0"}},{"$f":"VLOOKUP($A27,'5'!$B$10:$D$75,3,FALSE)","v":{"v":0,"d":"0.0"}},{"$f":"VLOOKUP($A27,'6'!$B$10:$D$75,3,FALSE)","v":{"v":0,"d":"0.0"}},{"$f":"IF(J27 > 0,K27/J27,0)","v":{"v":0,"d":"0.0"}},{"$f":"VLOOKUP(A27,Formelhilfe!$A$15:$H$74,8,FALSE)","v":{"v":0,"d":"0.0"}},{"$f":"SUM(C27:H27)","v":{"v":0,"d":"0.0"}},{"$f":"VLOOKUP($A27,'7'!$B$10:$D$75,3,FALSE)","v":{"v":0,"d":"0.0"}},{"$f":"VLOOKUP($A27,'8'!$B$10:$D$75,3,FALSE)","v":{"v":0,"d":"0.0"}},{"$f":"VLOOKUP($A27,'9'!$B$10:$D$75,3,FALSE)","v":{"v":0,"d":"0.0"}},{"$f":"VLOOKUP($A27,'10'!$B$10:$D$75,3,FALSE)","v":{"v":0,"d":"0.0"}},{"$f":"VLOOKUP($A27,'11'!$B$10:$D$75,3,FALSE)","v":{"v":0,"d":"0.0"}},{"$f":"VLOOKUP($A27,'12'!$B$10:$D$75,3,FALSE)","v":{"v":0,"d":"0.0"}},{"$f":"IF(S27 >0,T27/S27,0)","v":{"v":0,"d":"0.0"}},{"$f":"VLOOKUP(A27,Formelhilfe!$A$15:$O$74,15,FALSE)","v":{"v":0,"d":"0.0"}},{"$f":"SUM(L27:Q27)","v":{"v":0,"d":"0.0"}},{"$f":"IF(V27>0,W27/V27,0)","v":{"v":0,"d":"0.0"}},{"$f":"VLOOKUP(A27,Formelhilfe!$A$15:$P$74,16,FALSE)","v":{"v":0,"d":"0.0"}},{"$f":"SUM(C27:H27,L27:Q27)","v":{"v":0,"d":"0.0"}}]
["Schütze 19",{"$f":"VLOOKUP(A28,'Wettkampf 1'!$B$16:$C$75,2,FALSE)","v":"Börgermoor"},{"$f":"VLOOKUP(A28,'Wettkampf 1'!$B$16:$D$75,3,FALSE)","v":{"v":0,"d":"0.0"}},{"$f":"VLOOKUP($A28,'2'!$B$16:$D$75,3,FALSE)","v":{"v":0,"d":"0.0"}},{"$f":"VLOOKUP($A28,'3'!$B$10:$D$75,3,FALSE)","v":{"v":0,"d":"0.0"}},{"$f":"VLOOKUP($A28,'4'!$B$10:$D$75,3,FALSE)","v":{"v":0,"d":"0.0"}},{"$f":"VLOOKUP($A28,'5'!$B$10:$D$75,3,FALSE)","v":{"v":0,"d":"0.0"}},{"$f":"VLOOKUP($A28,'6'!$B$10:$D$75,3,FALSE)","v":{"v":0,"d":"0.0"}},{"$f":"IF(J28 > 0,K28/J28,0)","v":{"v":0,"d":"0.0"}},{"$f":"VLOOKUP(A28,Formelhilfe!$A$15:$H$74,8,FALSE)","v":{"v":0,"d":"0.0"}},{"$f":"SUM(C28:H28)","v":{"v":0,"d":"0.0"}},{"$f":"VLOOKUP($A28,'7'!$B$10:$D$75,3,FALSE)","v":{"v":0,"d":"0.0"}},{"$f":"VLOOKUP($A28,'8'!$B$10:$D$75,3,FALSE)","v":{"v":0,"d":"0.0"}},{"$f":"VLOOKUP($A28,'9'!$B$10:$D$75,3,FALSE)","v":{"v":0,"d":"0.0"}},{"$f":"VLOOKUP($A28,'10'!$B$10:$D$75,3,FALSE)","v":{"v":0,"d":"0.0"}},{"$f":"VLOOKUP($A28,'11'!$B$10:$D$75,3,FALSE)","v":{"v":0,"d":"0.0"}},{"$f":"VLOOKUP($A28,'12'!$B$10:$D$75,3,FALSE)","v":{"v":0,"d":"0.0"}},{"$f":"IF(S28 >0,T28/S28,0)","v":{"v":0,"d":"0.0"}},{"$f":"VLOOKUP(A28,Formelhilfe!$A$15:$O$74,15,FALSE)","v":{"v":0,"d":"0.0"}},{"$f":"SUM(L28:Q28)","v":{"v":0,"d":"0.0"}},{"$f":"IF(V28>0,W28/V28,0)","v":{"v":0,"d":"0.0"}},{"$f":"VLOOKUP(A28,Formelhilfe!$A$15:$P$74,16,FALSE)","v":{"v":0,"d":"0.0"}},{"$f":"SUM(C28:H28,L28:Q28)","v":{"v":0,"d":"0.0"}}]
["Schütze 20",{"$f":"VLOOKUP(A29,'Wettkampf 1'!$B$16:$C$75,2,FALSE)","v":"Börgermoor"},{"$f":"VLOOKUP(A29,'Wettkampf 1'!$B$16:$D$75,3,FALSE)","v":{"v":0,"d":"0.0"}},{"$f":"VLOOKUP($A29,'2'!$B$16:$D$75,3,FALSE)","v":{"v":0,"d":"0.0"}},{"$f":"VLOOKUP($A29,'3'!$B$10:$D$75,3,FALSE)","v":{"v":0,"d":"0.0"}},{"$f":"VLOOKUP($A29,'4'!$B$10:$D$75,3,FALSE)","v":{"v":0,"d":"0.0"}},{"$f":"VLOOKUP($A29,'5'!$B$10:$D$75,3,FALSE)","v":{"v":0,"d":"0.0"}},{"$f":"VLOOKUP($A29,'6'!$B$10:$D$75,3,FALSE)","v":{"v":0,"d":"0.0"}},{"$f":"IF(J29 > 0,K29/J29,0)","v":{"v":0,"d":"0.0"}},{"$f":"VLOOKUP(A29,Formelhilfe!$A$15:$H$74,8,FALSE)","v":{"v":0,"d":"0.0"}},{"$f":"SUM(C29:H29)","v":{"v":0,"d":"0.0"}},{"$f":"VLOOKUP($A29,'7'!$B$10:$D$75,3,FALSE)","v":{"v":0,"d":"0.0"}},{"$f":"VLOOKUP($A29,'8'!$B$10:$D$75,3,FALSE)","v":{"v":0,"d":"0.0"}},{"$f":"VLOOKUP($A29,'9'!$B$10:$D$75,3,FALSE)","v":{"v":0,"d":"0.0"}},{"$f":"VLOOKUP($A29,'10'!$B$10:$D$75,3,FALSE)","v":{"v":0,"d":"0.0"}},{"$f":"VLOOKUP($A29,'11'!$B$10:$D$75,3,FALSE)","v":{"v":0,"d":"0.0"}},{"$f":"VLOOKUP($A29,'12'!$B$10:$D$75,3,FALSE)","v":{"v":0,"d":"0.0"}},{"$f":"IF(S29 >0,T29/S29,0)","v":{"v":0,"d":"0.0"}},{"$f":"VLOOKUP(A29,Formelhilfe!$A$15:$O$74,15,FALSE)","v":{"v":0,"d":"0.0"}},{"$f":"SUM(L29:Q29)","v":{"v":0,"d":"0.0"}},{"$f":"IF(V29>0,W29/V29,0)","v":{"v":0,"d":"0.0"}},{"$f":"VLOOKUP(A29,Formelhilfe!$A$15:$P$74,16,FALSE)","v":{"v":0,"d":"0.0"}},{"$f":"SUM(C29:H29,L29:Q29)","v":{"v":0,"d":"0.0"}}]
["Schütze 25",{"$f":"VLOOKUP(A30,'Wettkampf 1'!$B$16:$C$75,2,FALSE)","v":"Spahnharrenstätte"},{"$f":"VLOOKUP(A30,'Wettkampf 1'!$B$16:$D$75,3,FALSE)","v":{"v":0,"d":"0.0"}},{"$f":"VLOOKUP($A30,'2'!$B$16:$D$75,3,FALSE)","v":{"v":0,"d":"0.0"}},{"$f":"VLOOKUP($A30,'3'!$B$10:$D$75,3,FALSE)","v":{"v":0,"d":"0.0"}},{"$f":"VLOOKUP($A30,'4'!$B$10:$D$75,3,FALSE)","v":{"v":0,"d":"0.0"}},{"$f":"VLOOKUP($A30,'5'!$B$10:$D$75,3,FALSE)","v":{"v":0,"d":"0.0"}},{"$f":"VLOOKUP($A30,'6'!$B$10:$D$75,3,FALSE)","v":{"v":0,"d":"0.0"}},{"$f":"IF(J30 > 0,K30/J30,0)","v":{"v":0,"d":"0.0"}},{"$f":"VLOOKUP(A30,Formelhilfe!$A$15:$H$74,8,FALSE)","v":{"v":0,"d":"0.0"}},{"$f":"SUM(C30:H30)","v":{"v":0,"d":"0.0"}},{"$f":"VLOOKUP($A30,'7'!$B$10:$D$75,3,FALSE)","v":{"v":0,"d":"0.0"}},{"$f":"VLOOKUP($A30,'8'!$B$10:$D$75,3,FALSE)","v":{"v":0,"d":"0.0"}},{"$f":"VLOOKUP($A30,'9'!$B$10:$D$75,3,FALSE)","v":{"v":0,"d":"0.0"}},{"$f":"VLOOKUP($A30,'10'!$B$10:$D$75,3,FALSE)","v":{"v":0,"d":"0.0"}},{"$f":"VLOOKUP($A30,'11'!$B$10:$D$75,3,FALSE)","v":{"v":0,"d":"0.0"}},{"$f":"VLOOKUP($A30,'12'!$B$10:$D$75,3,FALSE)","v":{"v":0,"d":"0.0"}},{"$f":"IF(S30 >0,T30/S30,0)","v":{"v":0,"d":"0.0"}},{"$f":"VLOOKUP(A30,Formelhilfe!$A$15:$O$74,15,FALSE)","v":{"v":0,"d":"0.0"}},{"$f":"SUM(L30:Q30)","v":{"v":0,"d":"0.0"}},{"$f":"IF(V30>0,W30/V30,0)","v":{"v":0,"d":"0.0"}},{"$f":"VLOOKUP(A30,Formelhilfe!$A$15:$P$74,16,FALSE)","v":{"v":0,"d":"0.0"}},{"$f":"SUM(C30:H30,L30:Q30)","v":{"v":0,"d":"0.0"}}]
["Schütze 27",{"$f":"VLOOKUP(A31,'Wettkampf 1'!$B$16:$C$75,2,FALSE)","v":"Lorup"},{"$f":"VLOOKUP(A31,'Wettkampf 1'!$B$16:$D$75,3,FALSE)","v":{"v":0,"d":"0.0"}},{"$f":"VLOOKUP($A31,'2'!$B$16:$D$75,3,FALSE)","v":{"v":0,"d":"0.0"}},{"$f":"VLOOKUP($A31,'3'!$B$10:$D$75,3,FALSE)","v":{"v":0,"d":"0.0"}},{"$f":"VLOOKUP($A31,'4'!$B$10:$D$75,3,FALSE)","v":{"v":0,"d":"0.0"}},{"$f":"VLOOKUP($A31,'5'!$B$10:$D$75,3,FALSE)","v":{"v":0,"d":"0.0"}},{"$f":"VLOOKUP($A31,'6'!$B$10:$D$75,3,FALSE)","v":{"v":0,"d":"0.0"}},{"$f":"IF(J31 > 0,K31/J31,0)","v":{"v":0,"d":"0.0"}},{"$f":"VLOOKUP(A31,Formelhilfe!$A$15:$H$74,8,FALSE)","v":{"v":0,"d":"0.0"}},{"$f":"SUM(C31:H31)","v":{"v":0,"d":"0.0"}},{"$f":"VLOOKUP($A31,'7'!$B$10:$D$75,3,FALSE)","v":{"v":0,"d":"0.0"}},{"$f":"VLOOKUP($A31,'8'!$B$10:$D$75,3,FALSE)","v":{"v":0,"d":"0.0"}},{"$f":"VLOOKUP($A31,'9'!$B$10:$D$75,3,FALSE)","v":{"v":0,"d":"0.0"}},{"$f":"VLOOKUP($A31,'10'!$B$10:$D$75,3,FALSE)","v":{"v":0,"d":"0.0"}},{"$f":"VLOOKUP($A31,'11'!$B$10:$D$75,3,FALSE)","v":{"v":0,"d":"0.0"}},{"$f":"VLOOKUP($A31,'12'!$B$10:$D$75,3,FALSE)","v":{"v":0,"d":"0.0"}},{"$f":"IF(S31 >0,T31/S31,0)","v":{"v":0,"d":"0.0"}},{"$f":"VLOOKUP(A31,Formelhilfe!$A$15:$O$74,15,FALSE)","v":{"v":0,"d":"0.0"}},{"$f":"SUM(L31:Q31)","v":{"v":0,"d":"0.0"}},{"$f":"IF(V31>0,W31/V31,0)","v":{"v":0,"d":"0.0"}},{"$f":"VLOOKUP(A31,Formelhilfe!$A$15:$P$74,16,FALSE)","v":{"v":0,"d":"0.0"}},{"$f":"SUM(C31:H31,L31:Q31)","v":{"v":0,"d":"0.0"}}]
["Schütze 28",{"$f":"VLOOKUP(A32,'Wettkampf 1'!$B$16:$C$75,2,FALSE)","v":"Lorup"},{"$f":"VLOOKUP(A32,'Wettkampf 1'!$B$16:$D$75,3,FALSE)","v":{"v":0,"d":"0.0"}},{"$f":"VLOOKUP($A32,'2'!$B$16:$D$75,3,FALSE)","v":{"v":0,"d":"0.0"}},{"$f":"VLOOKUP($A32,'3'!$B$10:$D$75,3,FALSE)","v":{"v":0,"d":"0.0"}},{"$f":"VLOOKUP($A32,'4'!$B$10:$D$75,3,FALSE)","v":{"v":0,"d":"0.0"}},{"$f":"VLOOKUP($A32,'5'!$B$10:$D$75,3,FALSE)","v":{"v":0,"d":"0.0"}},{"$f":"VLOOKUP($A32,'6'!$B$10:$D$75,3,FALSE)","v":{"v":0,"d":"0.0"}},{"$f":"IF(J32 > 0,K32/J32,0)","v":{"v":0,"d":"0.0"}},{"$f":"VLOOKUP(A32,Formelhilfe!$A$15:$H$74,8,FALSE)","v":{"v":0,"d":"0.0"}},{"$f":"SUM(C32:H32)","v":{"v":0,"d":"0.0"}},{"$f":"VLOOKUP($A32,'7'!$B$10:$D$75,3,FALSE)","v":{"v":0,"d":"0.0"}},{"$f":"VLOOKUP($A32,'8'!$B$10:$D$75,3,FALSE)","v":{"v":0,"d":"0.0"}},{"$f":"VLOOKUP($A32,'9'!$B$10:$D$75,3,FALSE)","v":{"v":0,"d":"0.0"}},{"$f":"VLOOKUP($A32,'10'!$B$10:$D$75,3,FALSE)","v":{"v":0,"d":"0.0"}},{"$f":"VLOOKUP($A32,'11'!$B$10:$D$75,3,FALSE)","v":{"v":0,"d":"0.0"}},{"$f":"VLOOKUP($A32,'12'!$B$10:$D$75,3,FALSE)","v":{"v":0,"d":"0.0"}},{"$f":"IF(S32 >0,T32/S32,0)","v":{"v":0,"d":"0.0"}},{"$f":"VLOOKUP(A32,Formelhilfe!$A$15:$O$74,15,FALSE)","v":{"v":0,"d":"0.0"}},{"$f":"SUM(L32:Q32)","v":{"v":0,"d":"0.0"}},{"$f":"IF(V32>0,W32/V32,0)","v":{"v":0,"d":"0.0"}},{"$f":"VLOOKUP(A32,Formelhilfe!$A$15:$P$74,16,FALSE)","v":{"v":0,"d":"0.0"}},{"$f":"SUM(C32:H32,L32:Q32)","v":{"v":0,"d":"0.0"}}]
["Schütze 29",{"$f":"VLOOKUP(A33,'Wettkampf 1'!$B$16:$C$75,2,FALSE)","v":"Lorup"},{"$f":"VLOOKUP(A33,'Wettkampf 1'!$B$16:$D$75,3,FALSE)","v":{"v":0,"d":"0.0"}},{"$f":"VLOOKUP($A33,'2'!$B$16:$D$75,3,FALSE)","v":{"v":0,"d":"0.0"}},{"$f":"VLOOKUP($A33,'3'!$B$10:$D$75,3,FALSE)","v":{"v":0,"d":"0.0"}},{"$f":"VLOOKUP($A33,'4'!$B$10:$D$75,3,FALSE)","v":{"v":0,"d":"0.0"}},{"$f":"VLOOKUP($A33,'5'!$B$10:$D$75,3,FALSE)","v":{"v":0,"d":"0.0"}},{"$f":"VLOOKUP($A33,'6'!$B$10:$D$75,3,FALSE)","v":{"v":0,"d":"0.0"}},{"$f":"IF(J33 > 0,K33/J33,0)","v":{"v":0,"d":"0.0"}},{"$f":"VLOOKUP(A33,Formelhilfe!$A$15:$H$74,8,FALSE)","v":{"v":0,"d":"0.0"}},{"$f":"SUM(C33:H33)","v":{"v":0,"d":"0.0"}},{"$f":"VLOOKUP($A33,'7'!$B$10:$D$75,3,FALSE)","v":{"v":0,"d":"0.0"}},{"$f":"VLOOKUP($A33,'8'!$B$10:$D$75,3,FALSE)","v":{"v":0,"d":"0.0"}},{"$f":"VLOOKUP($A33,'9'!$B$10:$D$75,3,FALSE)","v":{"v":0,"d":"0.0"}},{"$f":"VLOOKUP($A33,'10'!$B$10:$D$75,3,FALSE)","v":{"v":0,"d":"0.0"}},{"$f":"VLOOKUP($A33,'11'!$B$10:$D$75,3,FALSE)","v":{"v":0,"d":"0.0"}},{"$f":"VLOOKUP($A33,'12'!$B$10:$D$75,3,FALSE)","v":{"v":0,"d":"0.0"}},{"$f":"IF(S33 >0,T33/S33,0)","v":{"v":0,"d":"0.0"}},{"$f":"VLOOKUP(A33,Formelhilfe!$A$15:$O$74,15,FALSE)","v":{"v":0,"d":"0.0"}},{"$f":"SUM(L33:Q33)","v":{"v":0,"d":"0.0"}},{"$f":"IF(V33>0,W33/V33,0)","v":{"v":0,"d":"0.0"}},{"$f":"VLOOKUP(A33,Formelhilfe!$A$15:$P$74,16,FALSE)","v":{"v":0,"d":"0.0"}},{"$f":"SUM(C33:H33,L33:Q33)","v":{"v":0,"d":"0.0"}}]
["Schütze 30",{"$f":"VLOOKUP(A34,'Wettkampf 1'!$B$16:$C$75,2,FALSE)","v":"Lorup"},{"$f":"VLOOKUP(A34,'Wettkampf 1'!$B$16:$D$75,3,FALSE)","v":{"v":0,"d":"0.0"}},{"$f":"VLOOKUP($A34,'2'!$B$16:$D$75,3,FALSE)","v":{"v":0,"d":"0.0"}},{"$f":"VLOOKUP($A34,'3'!$B$10:$D$75,3,FALSE)","v":{"v":0,"d":"0.0"}},{"$f":"VLOOKUP($A34,'4'!$B$10:$D$75,3,FALSE)","v":{"v":0,"d":"0.0"}},{"$f":"VLOOKUP($A34,'5'!$B$10:$D$75,3,FALSE)","v":{"v":0,"d":"0.0"}},{"$f":"VLOOKUP($A34,'6'!$B$10:$D$75,3,FALSE)","v":{"v":0,"d":"0.0"}},{"$f":"IF(J34 > 0,K34/J34,0)","v":{"v":0,"d":"0.0"}},{"$f":"VLOOKUP(A34,Formelhilfe!$A$15:$H$74,8,FALSE)","v":{"v":0,"d":"0.0"}},{"$f":"SUM(C34:H34)","v":{"v":0,"d":"0.0"}},{"$f":"VLOOKUP($A34,'7'!$B$10:$D$75,3,FALSE)","v":{"v":0,"d":"0.0"}},{"$f":"VLOOKUP($A34,'8'!$B$10:$D$75,3,FALSE)","v":{"v":0,"d":"0.0"}},{"$f":"VLOOKUP($A34,'9'!$B$10:$D$75,3,FALSE)","v":{"v":0,"d":"0.0"}},{"$f":"VLOOKUP($A34,'10'!$B$10:$D$75,3,FALSE)","v":{"v":0,"d":"0.0"}},{"$f":"VLOOKUP($A34,'11'!$B$10:$D$75,3,FALSE)","v":{"v":0,"d":"0.0"}},{"$f":"VLOOKUP($A34,'12'!$B$10:$D$75,3,FALSE)","v":{"v":0,"d":"0.0"}},{"$f":"IF(S34 >0,T34/S34,0)","v":{"v":0,"d":"0.0"}},{"$f":"VLOOKUP(A34,Formelhilfe!$A$15:$O$74,15,FALSE)","v":{"v":0,"d":"0.0"}},{"$f":"SUM(L34:Q34)","v":{"v":0,"d":"0.0"}},{"$f":"IF(V34>0,W34/V34,0)","v":{"v":0,"d":"0.0"}},{"$f":"VLOOKUP(A34,Formelhilfe!$A$15:$P$74,16,FALSE)","v":{"v":0,"d":"0.0"}},{"$f":"SUM(C34:H34,L34:Q34)","v":{"v":0,"d":"0.0"}}]
["Schütze 33",{"$f":"VLOOKUP(A35,'Wettkampf 1'!$B$16:$C$75,2,FALSE)","v":"Lahn"},{"$f":"VLOOKUP(A35,'Wettkampf 1'!$B$16:$D$75,3,FALSE)","v":{"v":0,"d":"0.0"}},{"$f":"VLOOKUP($A35,'2'!$B$16:$D$75,3,FALSE)","v":{"v":0,"d":"0.0"}},{"$f":"VLOOKUP($A35,'3'!$B$10:$D$75,3,FALSE)","v":{"v":0,"d":"0.0"}},{"$f":"VLOOKUP($A35,'4'!$B$10:$D$75,3,FALSE)","v":{"v":0,"d":"0.0"}},{"$f":"VLOOKUP($A35,'5'!$B$10:$D$75,3,FALSE)","v":{"v":0,"d":"0.0"}},{"$f":"VLOOKUP($A35,'6'!$B$10:$D$75,3,FALSE)","v":{"v":0,"d":"0.0"}},{"$f":"IF(J35 > 0,K35/J35,0)","v":{"v":0,"d":"0.0"}},{"$f":"VLOOKUP(A35,Formelhilfe!$A$15:$H$74,8,FALSE)","v":{"v":0,"d":"0.0"}},{"$f":"SUM(C35:H35)","v":{"v":0,"d":"0.0"}},{"$f":"VLOOKUP($A35,'7'!$B$10:$D$75,3,FALSE)","v":{"v":0,"d":"0.0"}},{"$f":"VLOOKUP($A35,'8'!$B$10:$D$75,3,FALSE)","v":{"v":0,"d":"0.0"}},{"$f":"VLOOKUP($A35,'9'!$B$10:$D$75,3,FALSE)","v":{"v":0,"d":"0.0"}},{"$f":"VLOOKUP($A35,'10'!$B$10:$D$75,3,FALSE)","v":{"v":0,"d":"0.0"}},{"$f":"VLOOKUP($A35,'11'!$B$10:$D$75,3,FALSE)","v":{"v":0,"d":"0.0"}},{"$f":"VLOOKUP($A35,'12'!$B$10:$D$75,3,FALSE)","v":{"v":0,"d":"0.0"}},{"$f":"IF(S35 >0,T35/S35,0)","v":{"v":0,"d":"0.0"}},{"$f":"VLOOKUP(A35,Formelhilfe!$A$15:$O$74,15,FALSE)","v":{"v":0,"d":"0.0"}},{"$f":"SUM(L35:Q35)","v":{"v":0,"d":"0.0"}},{"$f":"IF(V35>0,W35/V35,0)","v":{"v":0,"d":"0.0"}},{"$f":"VLOOKUP(A35,Formelhilfe!$A$15:$P$74,16,FALSE)","v":{"v":0,"d":"0.0"}},{"$f":"SUM(C35:H35,L35:Q35)","v":{"v":0,"d":"0.0"}}]
["Schütze 34",{"$f":"VLOOKUP(A36,'Wettkampf 1'!$B$16:$C$75,2,FALSE)","v":"Lahn"},{"$f":"VLOOKUP(A36,'Wettkampf 1'!$B$16:$D$75,3,FALSE)","v":{"v":0,"d":"0.0"}},{"$f":"VLOOKUP($A36,'2'!$B$16:$D$75,3,FALSE)","v":{"v":0,"d":"0.0"}},{"$f":"VLOOKUP($A36,'3'!$B$10:$D$75,3,FALSE)","v":{"v":0,"d":"0.0"}},{"$f":"VLOOKUP($A36,'4'!$B$10:$D$75,3,FALSE)","v":{"v":0,"d":"0.0"}},{"$f":"VLOOKUP($A36,'5'!$B$10:$D$75,3,FALSE)","v":{"v":0,"d":"0.0"}},{"$f":"VLOOKUP($A36,'6'!$B$10:$D$75,3,FALSE)","v":{"v":0,"d":"0.0"}},{"$f":"IF(J36 > 0,K36/J36,0)","v":{"v":0,"d":"0.0"}},{"$f":"VLOOKUP(A36,Formelhilfe!$A$15:$H$74,8,FALSE)","v":{"v":0,"d":"0.0"}},{"$f":"SUM(C36:H36)","v":{"v":0,"d":"0.0"}},{"$f":"VLOOKUP($A36,'7'!$B$10:$D$75,3,FALSE)","v":{"v":0,"d":"0.0"}},{"$f":"VLOOKUP($A36,'8'!$B$10:$D$75,3,FALSE)","v":{"v":0,"d":"0.0"}},{"$f":"VLOOKUP($A36,'9'!$B$10:$D$75,3,FALSE)","v":{"v":0,"d":"0.0"}},{"$f":"VLOOKUP($A36,'10'!$B$10:$D$75,3,FALSE)","v":{"v":0,"d":"0.0"}},{"$f":"VLOOKUP($A36,'11'!$B$10:$D$75,3,FALSE)","v":{"v":0,"d":"0.0"}},{"$f":"VLOOKUP($A36,'12'!$B$10:$D$75,3,FALSE)","v":{"v":0,"d":"0.0"}},{"$f":"IF(S36 >0,T36/S36,0)","v":{"v":0,"d":"0.0"}},{"$f":"VLOOKUP(A36,Formelhilfe!$A$15:$O$74,15,FALSE)","v":{"v":0,"d":"0.0"}},{"$f":"SUM(L36:Q36)","v":{"v":0,"d":"0.0"}},{"$f":"IF(V36>0,W36/V36,0)","v":{"v":0,"d":"0.0"}},{"$f":"VLOOKUP(A36,Formelhilfe!$A$15:$P$74,16,FALSE)","v":{"v":0,"d":"0.0"}},{"$f":"SUM(C36:H36,L36:Q36)","v":{"v":0,"d":"0.0"}}]
["Schütze 35",{"$f":"VLOOKUP(A37,'Wettkampf 1'!$B$16:$C$75,2,FALSE)","v":"Lahn"},{"$f":"VLOOKUP(A37,'Wettkampf 1'!$B$16:$D$75,3,FALSE)","v":{"v":0,"d":"0.0"}},{"$f":"VLOOKUP($A37,'2'!$B$16:$D$75,3,FALSE)","v":{"v":0,"d":"0.0"}},{"$f":"VLOOKUP($A37,'3'!$B$10:$D$75,3,FALSE)","v":{"v":0,"d":"0.0"}},{"$f":"VLOOKUP($A37,'4'!$B$10:$D$75,3,FALSE)","v":{"v":0,"d":"0.0"}},{"$f":"VLOOKUP($A37,'5'!$B$10:$D$75,3,FALSE)","v":{"v":0,"d":"0.0"}},{"$f":"VLOOKUP($A37,'6'!$B$10:$D$75,3,FALSE)","v":{"v":0,"d":"0.0"}},{"$f":"IF(J37 > 0,K37/J37,0)","v":{"v":0,"d":"0.0"}},{"$f":"VLOOKUP(A37,Formelhilfe!$A$15:$H$74,8,FALSE)","v":{"v":0,"d":"0.0"}},{"$f":"SUM(C37:H37)","v":{"v":0,"d":"0.0"}},{"$f":"VLOOKUP($A37,'7'!$B$10:$D$75,3,FALSE)","v":{"v":0,"d":"0.0"}},{"$f":"VLOOKUP($A37,'8'!$B$10:$D$75,3,FALSE)","v":{"v":0,"d":"0.0"}},{"$f":"VLOOKUP($A37,'9'!$B$10:$D$75,3,FALSE)","v":{"v":0,"d":"0.0"}},{"$f":"VLOOKUP($A37,'10'!$B$10:$D$75,3,FALSE)","v":{"v":0,"d":"0.0"}},{"$f":"VLOOKUP($A37,'11'!$B$10:$D$75,3,FALSE)","v":{"v":0,"d":"0.0"}},{"$f":"VLOOKUP($A37,'12'!$B$10:$D$75,3,FALSE)","v":{"v":0,"d":"0.0"}},{"$f":"IF(S37 >0,T37/S37,0)","v":{"v":0,"d":"0.0"}},{"$f":"VLOOKUP(A37,Formelhilfe!$A$15:$O$74,15,FALSE)","v":{"v":0,"d":"0.0"}},{"$f":"SUM(L37:Q37)","v":{"v":0,"d":"0.0"}},{"$f":"IF(V37>0,W37/V37,0)","v":{"v":0,"d":"0.0"}},{"$f":"VLOOKUP(A37,Formelhilfe!$A$15:$P$74,16,FALSE)","v":{"v":0,"d":"0.0"}},{"$f":"SUM(C37:H37,L37:Q37)","v":{"v":0,"d":"0.0"}}]
["Schütze 37",{"$f":"VLOOKUP(A38,'Wettkampf 1'!$B$16:$C$75,2,FALSE)","v":"Sögel"},{"$f":"VLOOKUP(A38,'Wettkampf 1'!$B$16:$D$75,3,FALSE)","v":{"v":0,"d":"0.0"}},{"$f":"VLOOKUP($A38,'2'!$B$16:$D$75,3,FALSE)","v":{"v":0,"d":"0.0"}},{"$f":"VLOOKUP($A38,'3'!$B$10:$D$75,3,FALSE)","v":{"v":0,"d":"0.0"}},{"$f":"VLOOKUP($A38,'4'!$B$10:$D$75,3,FALSE)","v":{"v":0,"d":"0.0"}},{"$f":"VLOOKUP($A38,'5'!$B$10:$D$75,3,FALSE)","v":{"v":0,"d":"0.0"}},{"$f":"VLOOKUP($A38,'6'!$B$10:$D$75,3,FALSE)","v":{"v":0,"d":"0.0"}},{"$f":"IF(J38 > 0,K38/J38,0)","v":{"v":0,"d":"0.0"}},{"$f":"VLOOKUP(A38,Formelhilfe!$A$15:$H$74,8,FALSE)","v":{"v":0,"d":"0.0"}},{"$f":"SUM(C38:H38)","v":{"v":0,"d":"0.0"}},{"$f":"VLOOKUP($A38,'7'!$B$10:$D$75,3,FALSE)","v":{"v":0,"d":"0.0"}},{"$f":"VLOOKUP($A38,'8'!$B$10:$D$75,3,FALSE)","v":{"v":0,"d":"0.0"}},{"$f":"VLOOKUP($A38,'9'!$B$10:$D$75,3,FALSE)","v":{"v":0,"d":"0.0"}},{"$f":"VLOOKUP($A38,'10'!$B$10:$D$75,3,FALSE)","v":{"v":0,"d":"0.0"}},{"$f":"VLOOKUP($A38,'11'!$B$10:$D$75,3,FALSE)","v":{"v":0,"d":"0.0"}},{"$f":"VLOOKUP($A38,'12'!$B$10:$D$75,3,FALSE)","v":{"v":0,"d":"0.0"}},{"$f":"IF(S38 >0,T38/S38,0)","v":{"v":0,"d":"0.0"}},{"$f":"VLOOKUP(A38,Formelhilfe!$A$15:$O$74,15,FALSE)","v":{"v":0,"d":"0.0"}},{"$f":"SUM(L38:Q38)","v":{"v":0,"d":"0.0"}},{"$f":"IF(V38>0,W38/V38,0)","v":{"v":0,"d":"0.0"}},{"$f":"VLOOKUP(A38,Formelhilfe!$A$15:$P$74,16,FALSE)","v":{"v":0,"d":"0.0"}},{"$f":"SUM(C38:H38,L38:Q38)","v":{"v":0,"d":"0.0"}}]
["Schütze 38",{"$f":"VLOOKUP(A39,'Wettkampf 1'!$B$16:$C$75,2,FALSE)","v":"Sögel"},{"$f":"VLOOKUP(A39,'Wettkampf 1'!$B$16:$D$75,3,FALSE)","v":{"v":0,"d":"0.0"}},{"$f":"VLOOKUP($A39,'2'!$B$16:$D$75,3,FALSE)","v":{"v":0,"d":"0.0"}},{"$f":"VLOOKUP($A39,'3'!$B$10:$D$75,3,FALSE)","v":{"v":0,"d":"0.0"}},{"$f":"VLOOKUP($A39,'4'!$B$10:$D$75,3,FALSE)","v":{"v":0,"d":"0.0"}},{"$f":"VLOOKUP($A39,'5'!$B$10:$D$75,3,FALSE)","v":{"v":0,"d":"0.0"}},{"$f":"VLOOKUP($A39,'6'!$B$10:$D$75,3,FALSE)","v":{"v":0,"d":"0.0"}},{"$f":"IF(J39 > 0,K39/J39,0)","v":{"v":0,"d":"0.0"}},{"$f":"VLOOKUP(A39,Formelhilfe!$A$15:$H$74,8,FALSE)","v":{"v":0,"d":"0.0"}},{"$f":"SUM(C39:H39)","v":{"v":0,"d":"0.0"}},{"$f":"VLOOKUP($A39,'7'!$B$10:$D$75,3,FALSE)","v":{"v":0,"d":"0.0"}},{"$f":"VLOOKUP($A39,'8'!$B$10:$D$75,3,FALSE)","v":{"v":0,"d":"0.0"}},{"$f":"VLOOKUP($A39,'9'!$B$10:$D$75,3,FALSE)","v":{"v":0,"d":"0.0"}},{"$f":"VLOOKUP($A39,'10'!$B$10:$D$75,3,FALSE)","v":{"v":0,"d":"0.0"}},{"$f":"VLOOKUP($A39,'11'!$B$10:$D$75,3,FALSE)","v":{"v":0,"d":"0.0"}},{"$f":"VLOOKUP($A39,'12'!$B$10:$D$75,3,FALSE)","v":{"v":0,"d":"0.0"}},{"$f":"IF(S39 >0,T39/S39,0)","v":{"v":0,"d":"0.0"}},{"$f":"VLOOKUP(A39,Formelhilfe!$A$15:$O$74,15,FALSE)","v":{"v":0,"d":"0.0"}},{"$f":"SUM(L39:Q39)","v":{"v":0,"d":"0.0"}},{"$f":"IF(V39>0,W39/V39,0)","v":{"v":0,"d":"0.0"}},{"$f":"VLOOKUP(A39,Formelhilfe!$A$15:$P$74,16,FALSE)","v":{"v":0,"d":"0.0"}},{"$f":"SUM(C39:H39,L39:Q39)","v":{"v":0,"d":"0.0"}}]
["Schütze 39",{"$f":"VLOOKUP(A40,'Wettkampf 1'!$B$16:$C$75,2,FALSE)","v":"Sögel"},{"$f":"VLOOKUP(A40,'Wettkampf 1'!$B$16:$D$75,3,FALSE)","v":{"v":0,"d":"0.0"}},{"$f":"VLOOKUP($A40,'2'!$B$16:$D$75,3,FALSE)","v":{"v":0,"d":"0.0"}},{"$f":"VLOOKUP($A40,'3'!$B$10:$D$75,3,FALSE)","v":{"v":0,"d":"0.0"}},{"$f":"VLOOKUP($A40,'4'!$B$10:$D$75,3,FALSE)","v":{"v":0,"d":"0.0"}},{"$f":"VLOOKUP($A40,'5'!$B$10:$D$75,3,FALSE)","v":{"v":0,"d":"0.0"}},{"$f":"VLOOKUP($A40,'6'!$B$10:$D$75,3,FALSE)","v":{"v":0,"d":"0.0"}},{"$f":"IF(J40 > 0,K40/J40,0)","v":{"v":0,"d":"0.0"}},{"$f":"VLOOKUP(A40,Formelhilfe!$A$15:$H$74,8,FALSE)","v":{"v":0,"d":"0.0"}},{"$f":"SUM(C40:H40)","v":{"v":0,"d":"0.0"}},{"$f":"VLOOKUP($A40,'7'!$B$10:$D$75,3,FALSE)","v":{"v":0,"d":"0.0"}},{"$f":"VLOOKUP($A40,'8'!$B$10:$D$75,3,FALSE)","v":{"v":0,"d":"0.0"}},{"$f":"VLOOKUP($A40,'9'!$B$10:$D$75,3,FALSE)","v":{"v":0,"d":"0.0"}},{"$f":"VLOOKUP($A40,'10'!$B$10:$D$75,3,FALSE)","v":{"v":0,"d":"0.0"}},{"$f":"VLOOKUP($A40,'11'!$B$10:$D$75,3,FALSE)","v":{"v":0,"d":"0.0"}},{"$f":"VLOOKUP($A40,'12'!$B$10:$D$75,3,FALSE)","v":{"v":0,"d":"0.0"}},{"$f":"IF(S40 >0,T40/S40,0)","v":{"v":0,"d":"0.0"}},{"$f":"VLOOKUP(A40,Formelhilfe!$A$15:$O$74,15,FALSE)","v":{"v":0,"d":"0.0"}},{"$f":"SUM(L40:Q40)","v":{"v":0,"d":"0.0"}},{"$f":"IF(V40>0,W40/V40,0)","v":{"v":0,"d":"0.0"}},{"$f":"VLOOKUP(A40,Formelhilfe!$A$15:$P$74,16,FALSE)","v":{"v":0,"d":"0.0"}},{"$f":"SUM(C40:H40,L40:Q40)","v":{"v":0,"d":"0.0"}}]
["Schütze 40",{"$f":"VLOOKUP(A41,'Wettkampf 1'!$B$16:$C$75,2,FALSE)","v":"Sögel"},{"$f":"VLOOKUP(A41,'Wettkampf 1'!$B$16:$D$75,3,FALSE)","v":{"v":0,"d":"0.0"}},{"$f":"VLOOKUP($A41,'2'!$B$16:$D$75,3,FALSE)","v":{"v":0,"d":"0.0"}},{"$f":"VLOOKUP($A41,'3'!$B$10:$D$75,3,FALSE)","v":{"v":0,"d":"0.0"}},{"$f":"VLOOKUP($A41,'4'!$B$10:$D$75,3,FALSE)","v":{"v":0,"d":"0.0"}},{"$f":"VLOOKUP($A41,'5'!$B$10:$D$75,3,FALSE)","v":{"v":0,"d":"0.0"}},{"$f":"VLOOKUP($A41,'6'!$B$10:$D$75,3,FALSE)","v":{"v":0,"d":"0.0"}},{"$f":"IF(J41 > 0,K41/J41,0)","v":{"v":0,"d":"0.0"}},{"$f":"VLOOKUP(A41,Formelhilfe!$A$15:$H$74,8,FALSE)","v":{"v":0,"d":"0.0"}},{"$f":"SUM(C41:H41)","v":{"v":0,"d":"0.0"}},{"$f":"VLOOKUP($A41,'7'!$B$10:$D$75,3,FALSE)","v":{"v":0,"d":"0.0"}},{"$f":"VLOOKUP($A41,'8'!$B$10:$D$75,3,FALSE)","v":{"v":0,"d":"0.0"}},{"$f":"VLOOKUP($A41,'9'!$B$10:$D$75,3,FALSE)","v":{"v":0,"d":"0.0"}},{"$f":"VLOOKUP($A41,'10'!$B$10:$D$75,3,FALSE)","v":{"v":0,"d":"0.0"}},{"$f":"VLOOKUP($A41,'11'!$B$10:$D$75,3,FALSE)","v":{"v":0,"d":"0.0"}},{"$f":"VLOOKUP($A41,'12'!$B$10:$D$75,3,FALSE)","v":{"v":0,"d":"0.0"}},{"$f":"IF(S41 >0,T41/S41,0)","v":{"v":0,"d":"0.0"}},{"$f":"VLOOKUP(A41,Formelhilfe!$A$15:$O$74,15,FALSE)","v":{"v":0,"d":"0.0"}},{"$f":"SUM(L41:Q41)","v":{"v":0,"d":"0.0"}},{"$f":"IF(V41>0,W41/V41,0)","v":{"v":0,"d":"0.0"}},{"$f":"VLOOKUP(A41,Formelhilfe!$A$15:$P$74,16,FALSE)","v":{"v":0,"d":"0.0"}},{"$f":"SUM(C41:H41,L41:Q41)","v":{"v":0,"d":"0.0"}}]
["Schütze 41",{"$f":"VLOOKUP(A42,'Wettkampf 1'!$B$16:$C$75,2,FALSE)","v":"Verein IX"},{"$f":"VLOOKUP(A42,'Wettkampf 1'!$B$16:$D$75,3,FALSE)","v":{"v":0,"d":"0.0"}},{"$f":"VLOOKUP($A42,'2'!$B$16:$D$75,3,FALSE)","v":{"v":0,"d":"0.0"}},{"$f":"VLOOKUP($A42,'3'!$B$10:$D$75,3,FALSE)","v":{"v":0,"d":"0.0"}},{"$f":"VLOOKUP($A42,'4'!$B$10:$D$75,3,FALSE)","v":{"v":0,"d":"0.0"}},{"$f":"VLOOKUP($A42,'5'!$B$10:$D$75,3,FALSE)","v":{"v":0,"d":"0.0"}},{"$f":"VLOOKUP($A42,'6'!$B$10:$D$75,3,FALSE)","v":{"v":0,"d":"0.0"}},{"$f":"IF(J42 > 0,K42/J42,0)","v":{"v":0,"d":"0.0"}},{"$f":"VLOOKUP(A42,Formelhilfe!$A$15:$H$74,8,FALSE)","v":{"v":0,"d":"0.0"}},{"$f":"SUM(C42:H42)","v":{"v":0,"d":"0.0"}},{"$f":"VLOOKUP($A42,'7'!$B$10:$D$75,3,FALSE)","v":{"v":0,"d":"0.0"}},{"$f":"VLOOKUP($A42,'8'!$B$10:$D$75,3,FALSE)","v":{"v":0,"d":"0.0"}},{"$f":"VLOOKUP($A42,'9'!$B$10:$D$75,3,FALSE)","v":{"v":0,"d":"0.0"}},{"$f":"VLOOKUP($A42,'10'!$B$10:$D$75,3,FALSE)","v":{"v":0,"d":"0.0"}},{"$f":"VLOOKUP($A42,'11'!$B$10:$D$75,3,FALSE)","v":{"v":0,"d":"0.0"}},{"$f":"VLOOKUP($A42,'12'!$B$10:$D$75,3,FALSE)","v":{"v":0,"d":"0.0"}},{"$f":"IF(S42 >0,T42/S42,0)","v":{"v":0,"d":"0.0"}},{"$f":"VLOOKUP(A42,Formelhilfe!$A$15:$O$74,15,FALSE)","v":{"v":0,"d":"0.0"}},{"$f":"SUM(L42:Q42)","v":{"v":0,"d":"0.0"}},{"$f":"IF(V42>0,W42/V42,0)","v":{"v":0,"d":"0.0"}},{"$f":"VLOOKUP(A42,Formelhilfe!$A$15:$P$74,16,FALSE)","v":{"v":0,"d":"0.0"}},{"$f":"SUM(C42:H42,L42:Q42)","v":{"v":0,"d":"0.0"}}]
["Schütze 42",{"$f":"VLOOKUP(A43,'Wettkampf 1'!$B$16:$C$75,2,FALSE)","v":"Verein IX"},{"$f":"VLOOKUP(A43,'Wettkampf 1'!$B$16:$D$75,3,FALSE)","v":{"v":0,"d":"0.0"}},{"$f":"VLOOKUP($A43,'2'!$B$16:$D$75,3,FALSE)","v":{"v":0,"d":"0.0"}},{"$f":"VLOOKUP($A43,'3'!$B$10:$D$75,3,FALSE)","v":{"v":0,"d":"0.0"}},{"$f":"VLOOKUP($A43,'4'!$B$10:$D$75,3,FALSE)","v":{"v":0,"d":"0.0"}},{"$f":"VLOOKUP($A43,'5'!$B$10:$D$75,3,FALSE)","v":{"v":0,"d":"0.0"}},{"$f":"VLOOKUP($A43,'6'!$B$10:$D$75,3,FALSE)","v":{"v":0,"d":"0.0"}},{"$f":"IF(J43 > 0,K43/J43,0)","v":{"v":0,"d":"0.0"}},{"$f":"VLOOKUP(A43,Formelhilfe!$A$15:$H$74,8,FALSE)","v":{"v":0,"d":"0.0"}},{"$f":"SUM(C43:H43)","v":{"v":0,"d":"0.0"}},{"$f":"VLOOKUP($A43,'7'!$B$10:$D$75,3,FALSE)","v":{"v":0,"d":"0.0"}},{"$f":"VLOOKUP($A43,'8'!$B$10:$D$75,3,FALSE)","v":{"v":0,"d":"0.0"}},{"$f":"VLOOKUP($A43,'9'!$B$10:$D$75,3,FALSE)","v":{"v":0,"d":"0.0"}},{"$f":"VLOOKUP($A43,'10'!$B$10:$D$75,3,FALSE)","v":{"v":0,"d":"0.0"}},{"$f":"VLOOKUP($A43,'11'!$B$10:$D$75,3,FALSE)","v":{"v":0,"d":"0.0"}},{"$f":"VLOOKUP($A43,'12'!$B$10:$D$75,3,FALSE)","v":{"v":0,"d":"0.0"}},{"$f":"IF(S43 >0,T43/S43,0)","v":{"v":0,"d":"0.0"}},{"$f":"VLOOKUP(A43,Formelhilfe!$A$15:$O$74,15,FALSE)","v":{"v":0,"d":"0.0"}},{"$f":"SUM(L43:Q43)","v":{"v":0,"d":"0.0"}},{"$f":"IF(V43>0,W43/V43,0)","v":{"v":0,"d":"0.0"}},{"$f":"VLOOKUP(A43,Formelhilfe!$A$15:$P$74,16,FALSE)","v":{"v":0,"d":"0.0"}},{"$f":"SUM(C43:H43,L43:Q43)","v":{"v":0,"d":"0.0"}}]
["Schütze 43",{"$f":"VLOOKUP(A44,'Wettkampf 1'!$B$16:$C$75,2,FALSE)","v":"Verein IX"},{"$f":"VLOOKUP(A44,'Wettkampf 1'!$B$16:$D$75,3,FALSE)","v":{"v":0,"d":"0.0"}},{"$f":"VLOOKUP($A44,'2'!$B$16:$D$75,3,FALSE)","v":{"v":0,"d":"0.0"}},{"$f":"VLOOKUP($A44,'3'!$B$10:$D$75,3,FALSE)","v":{"v":0,"d":"0.0"}},{"$f":"VLOOKUP($A44,'4'!$B$10:$D$75,3,FALSE)","v":{"v":0,"d":"0.0"}},{"$f":"VLOOKUP($A44,'5'!$B$10:$D$75,3,FALSE)","v":{"v":0,"d":"0.0"}},{"$f":"VLOOKUP($A44,'6'!$B$10:$D$75,3,FALSE)","v":{"v":0,"d":"0.0"}},{"$f":"IF(J44 > 0,K44/J44,0)","v":{"v":0,"d":"0.0"}},{"$f":"VLOOKUP(A44,Formelhilfe!$A$15:$H$74,8,FALSE)","v":{"v":0,"d":"0.0"}},{"$f":"SUM(C44:H44)","v":{"v":0,"d":"0.0"}},{"$f":"VLOOKUP($A44,'7'!$B$10:$D$75,3,FALSE)","v":{"v":0,"d":"0.0"}},{"$f":"VLOOKUP($A44,'8'!$B$10:$D$75,3,FALSE)","v":{"v":0,"d":"0.0"}},{"$f":"VLOOKUP($A44,'9'!$B$10:$D$75,3,FALSE)","v":{"v":0,"d":"0.0"}},{"$f":"VLOOKUP($A44,'10'!$B$10:$D$75,3,FALSE)","v":{"v":0,"d":"0.0"}},{"$f":"VLOOKUP($A44,'11'!$B$10:$D$75,3,FALSE)","v":{"v":0,"d":"0.0"}},{"$f":"VLOOKUP($A44,'12'!$B$10:$D$75,3,FALSE)","v":{"v":0,"d":"0.0"}},{"$f":"IF(S44 >0,T44/S44,0)","v":{"v":0,"d":"0.0"}},{"$f":"VLOOKUP(A44,Formelhilfe!$A$15:$O$74,15,FALSE)","v":{"v":0,"d":"0.0"}},{"$f":"SUM(L44:Q44)","v":{"v":0,"d":"0.0"}},{"$f":"IF(V44>0,W44/V44,0)","v":{"v":0,"d":"0.0"}},{"$f":"VLOOKUP(A44,Formelhilfe!$A$15:$P$74,16,FALSE)","v":{"v":0,"d":"0.0"}},{"$f":"SUM(C44:H44,L44:Q44)","v":{"v":0,"d":"0.0"}}]
["Schütze 44",{"$f":"VLOOKUP(A45,'Wettkampf 1'!$B$16:$C$75,2,FALSE)","v":"Verein IX"},{"$f":"VLOOKUP(A45,'Wettkampf 1'!$B$16:$D$75,3,FALSE)","v":{"v":0,"d":"0.0"}},{"$f":"VLOOKUP($A45,'2'!$B$16:$D$75,3,FALSE)","v":{"v":0,"d":"0.0"}},{"$f":"VLOOKUP($A45,'3'!$B$10:$D$75,3,FALSE)","v":{"v":0,"d":"0.0"}},{"$f":"VLOOKUP($A45,'4'!$B$10:$D$75,3,FALSE)","v":{"v":0,"d":"0.0"}},{"$f":"VLOOKUP($A45,'5'!$B$10:$D$75,3,FALSE)","v":{"v":0,"d":"0.0"}},{"$f":"VLOOKUP($A45,'6'!$B$10:$D$75,3,FALSE)","v":{"v":0,"d":"0.0"}},{"$f":"IF(J45 > 0,K45/J45,0)","v":{"v":0,"d":"0.0"}},{"$f":"VLOOKUP(A45,Formelhilfe!$A$15:$H$74,8,FALSE)","v":{"v":0,"d":"0.0"}},{"$f":"SUM(C45:H45)","v":{"v":0,"d":"0.0"}},{"$f":"VLOOKUP($A45,'7'!$B$10:$D$75,3,FALSE)","v":{"v":0,"d":"0.0"}},{"$f":"VLOOKUP($A45,'8'!$B$10:$D$75,3,FALSE)","v":{"v":0,"d":"0.0"}},{"$f":"VLOOKUP($A45,'9'!$B$10:$D$75,3,FALSE)","v":{"v":0,"d":"0.0"}},{"$f":"VLOOKUP($A45,'10'!$B$10:$D$75,3,FALSE)","v":{"v":0,"d":"0.0"}},{"$f":"VLOOKUP($A45,'11'!$B$10:$D$75,3,FALSE)","v":{"v":0,"d":"0.0"}},{"$f":"VLOOKUP($A45,'12'!$B$10:$D$75,3,FALSE)","v":{"v":0,"d":"0.0"}},{"$f":"IF(S45 >0,T45/S45,0)","v":{"v":0,"d":"0.0"}},{"$f":"VLOOKUP(A45,Formelhilfe!$A$15:$O$74,15,FALSE)","v":{"v":0,"d":"0.0"}},{"$f":"SUM(L45:Q45)","v":{"v":0,"d":"0.0"}},{"$f":"IF(V45>0,W45/V45,0)","v":{"v":0,"d":"0.0"}},{"$f":"VLOOKUP(A45,Formelhilfe!$A$15:$P$74,16,FALSE)","v":{"v":0,"d":"0.0"}},{"$f":"SUM(C45:H45,L45:Q45)","v":{"v":0,"d":"0.0"}}]
["Schütze 45",{"$f":"VLOOKUP(A46,'Wettkampf 1'!$B$16:$C$75,2,FALSE)","v":"Verein IX"},{"$f":"VLOOKUP(A46,'Wettkampf 1'!$B$16:$D$75,3,FALSE)","v":{"v":0,"d":"0.0"}},{"$f":"VLOOKUP($A46,'2'!$B$16:$D$75,3,FALSE)","v":{"v":0,"d":"0.0"}},{"$f":"VLOOKUP($A46,'3'!$B$10:$D$75,3,FALSE)","v":{"v":0,"d":"0.0"}},{"$f":"VLOOKUP($A46,'4'!$B$10:$D$75,3,FALSE)","v":{"v":0,"d":"0.0"}},{"$f":"VLOOKUP($A46,'5'!$B$10:$D$75,3,FALSE)","v":{"v":0,"d":"0.0"}},{"$f":"VLOOKUP($A46,'6'!$B$10:$D$75,3,FALSE)","v":{"v":0,"d":"0.0"}},{"$f":"IF(J46 > 0,K46/J46,0)","v":{"v":0,"d":"0.0"}},{"$f":"VLOOKUP(A46,Formelhilfe!$A$15:$H$74,8,FALSE)","v":{"v":0,"d":"0.0"}},{"$f":"SUM(C46:H46)","v":{"v":0,"d":"0.0"}},{"$f":"VLOOKUP($A46,'7'!$B$10:$D$75,3,FALSE)","v":{"v":0,"d":"0.0"}},{"$f":"VLOOKUP($A46,'8'!$B$10:$D$75,3,FALSE)","v":{"v":0,"d":"0.0"}},{"$f":"VLOOKUP($A46,'9'!$B$10:$D$75,3,FALSE)","v":{"v":0,"d":"0.0"}},{"$f":"VLOOKUP($A46,'10'!$B$10:$D$75,3,FALSE)","v":{"v":0,"d":"0.0"}},{"$f":"VLOOKUP($A46,'11'!$B$10:$D$75,3,FALSE)","v":{"v":0,"d":"0.0"}},{"$f":"VLOOKUP($A46,'12'!$B$10:$D$75,3,FALSE)","v":{"v":0,"d":"0.0"}},{"$f":"IF(S46 >0,T46/S46,0)","v":{"v":0,"d":"0.0"}},{"$f":"VLOOKUP(A46,Formelhilfe!$A$15:$O$74,15,FALSE)","v":{"v":0,"d":"0.0"}},{"$f":"SUM(L46:Q46)","v":{"v":0,"d":"0.0"}},{"$f":"IF(V46>0,W46/V46,0)","v":{"v":0,"d":"0.0"}},{"$f":"VLOOKUP(A46,Formelhilfe!$A$15:$P$74,16,FALSE)","v":{"v":0,"d":"0.0"}},{"$f":"SUM(C46:H46,L46:Q46)","v":{"v":0,"d":"0.0"}}]
["Schütze 46",{"$f":"VLOOKUP(A47,'Wettkampf 1'!$B$16:$C$75,2,FALSE)","v":"Verein X"},{"$f":"VLOOKUP(A47,'Wettkampf 1'!$B$16:$D$75,3,FALSE)","v":{"v":0,"d":"0.0"}},{"$f":"VLOOKUP($A47,'2'!$B$16:$D$75,3,FALSE)","v":{"v":0,"d":"0.0"}},{"$f":"VLOOKUP($A47,'3'!$B$10:$D$75,3,FALSE)","v":{"v":0,"d":"0.0"}},{"$f":"VLOOKUP($A47,'4'!$B$10:$D$75,3,FALSE)","v":{"v":0,"d":"0.0"}},{"$f":"VLOOKUP($A47,'5'!$B$10:$D$75,3,FALSE)","v":{"v":0,"d":"0.0"}},{"$f":"VLOOKUP($A47,'6'!$B$10:$D$75,3,FALSE)","v":{"v":0,"d":"0.0"}},{"$f":"IF(J47 > 0,K47/J47,0)","v":{"v":0,"d":"0.0"}},{"$f":"VLOOKUP(A47,Formelhilfe!$A$15:$H$74,8,FALSE)","v":{"v":0,"d":"0.0"}},{"$f":"SUM(C47:H47)","v":{"v":0,"d":"0.0"}},{"$f":"VLOOKUP($A47,'7'!$B$10:$D$75,3,FALSE)","v":{"v":0,"d":"0.0"}},{"$f":"VLOOKUP($A47,'8'!$B$10:$D$75,3,FALSE)","v":{"v":0,"d":"0.0"}},{"$f":"VLOOKUP($A47,'9'!$B$10:$D$75,3,FALSE)","v":{"v":0,"d":"0.0"}},{"$f":"VLOOKUP($A47,'10'!$B$10:$D$75,3,FALSE)","v":{"v":0,"d":"0.0"}},{"$f":"VLOOKUP($A47,'11'!$B$10:$D$75,3,FALSE)","v":{"v":0,"d":"0.0"}},{"$f":"VLOOKUP($A47,'12'!$B$10:$D$75,3,FALSE)","v":{"v":0,"d":"0.0"}},{"$f":"IF(S47 >0,T47/S47,0)","v":{"v":0,"d":"0.0"}},{"$f":"VLOOKUP(A47,Formelhilfe!$A$15:$O$74,15,FALSE)","v":{"v":0,"d":"0.0"}},{"$f":"SUM(L47:Q47)","v":{"v":0,"d":"0.0"}},{"$f":"IF(V47>0,W47/V47,0)","v":{"v":0,"d":"0.0"}},{"$f":"VLOOKUP(A47,Formelhilfe!$A$15:$P$74,16,FALSE)","v":{"v":0,"d":"0.0"}},{"$f":"SUM(C47:H47,L47:Q47)","v":{"v":0,"d":"0.0"}}]
["Schütze 47",{"$f":"VLOOKUP(A48,'Wettkampf 1'!$B$16:$C$75,2,FALSE)","v":"Verein X"},{"$f":"VLOOKUP(A48,'Wettkampf 1'!$B$16:$D$75,3,FALSE)","v":{"v":0,"d":"0.0"}},{"$f":"VLOOKUP($A48,'2'!$B$16:$D$75,3,FALSE)","v":{"v":0,"d":"0.0"}},{"$f":"VLOOKUP($A48,'3'!$B$10:$D$75,3,FALSE)","v":{"v":0,"d":"0.0"}},{"$f":"VLOOKUP($A48,'4'!$B$10:$D$75,3,FALSE)","v":{"v":0,"d":"0.0"}},{"$f":"VLOOKUP($A48,'5'!$B$10:$D$75,3,FALSE)","v":{"v":0,"d":"0.0"}},{"$f":"VLOOKUP($A48,'6'!$B$10:$D$75,3,FALSE)","v":{"v":0,"d":"0.0"}},{"$f":"IF(J48 > 0,K48/J48,0)","v":{"v":0,"d":"0.0"}},{"$f":"VLOOKUP(A48,Formelhilfe!$A$15:$H$74,8,FALSE)","v":{"v":0,"d":"0.0"}},{"$f":"SUM(C48:H48)","v":{"v":0,"d":"0.0"}},{"$f":"VLOOKUP($A48,'7'!$B$10:$D$75,3,FALSE)","v":{"v":0,"d":"0.0"}},{"$f":"VLOOKUP($A48,'8'!$B$10:$D$75,3,FALSE)","v":{"v":0,"d":"0.0"}},{"$f":"VLOOKUP($A48,'9'!$B$10:$D$75,3,FALSE)","v":{"v":0,"d":"0.0"}},{"$f":"VLOOKUP($A48,'10'!$B$10:$D$75,3,FALSE)","v":{"v":0,"d":"0.0"}},{"$f":"VLOOKUP($A48,'11'!$B$10:$D$75,3,FALSE)","v":{"v":0,"d":"0.0"}},{"$f":"VLOOKUP($A48,'12'!$B$10:$D$75,3,FALSE)","v":{"v":0,"d":"0.0"}},{"$f":"IF(S48 >0,T48/S48,0)","v":{"v":0,"d":"0.0"}},{"$f":"VLOOKUP(A48,Formelhilfe!$A$15:$O$74,15,FALSE)","v":{"v":0,"d":"0.0"}},{"$f":"SUM(L48:Q48)","v":{"v":0,"d":"0.0"}},{"$f":"IF(V48>0,W48/V48,0)","v":{"v":0,"d":"0.0"}},{"$f":"VLOOKUP(A48,Formelhilfe!$A$15:$P$74,16,FALSE)","v":{"v":0,"d":"0.0"}},{"$f":"SUM(C48:H48,L48:Q48)","v":{"v":0,"d":"0.0"}}]
["Schütze 48",{"$f":"VLOOKUP(A49,'Wettkampf 1'!$B$16:$C$75,2,FALSE)","v":"Verein X"},{"$f":"VLOOKUP(A49,'Wettkampf 1'!$B$16:$D$75,3,FALSE)","v":{"v":0,"d":"0.0"}},{"$f":"VLOOKUP($A49,'2'!$B$16:$D$75,3,FALSE)","v":{"v":0,"d":"0.0"}},{"$f":"VLOOKUP($A49,'3'!$B$10:$D$75,3,FALSE)","v":{"v":0,"d":"0.0"}},{"$f":"VLOOKUP($A49,'4'!$B$10:$D$75,3,FALSE)","v":{"v":0,"d":"0.0"}},{"$f":"VLOOKUP($A49,'5'!$B$10:$D$75,3,FALSE)","v":{"v":0,"d":"0.0"}},{"$f":"VLOOKUP($A49,'6'!$B$10:$D$75,3,FALSE)","v":{"v":0,"d":"0.0"}},{"$f":"IF(J49 > 0,K49/J49,0)","v":{"v":0,"d":"0.0"}},{"$f":"VLOOKUP(A49,Formelhilfe!$A$15:$H$74,8,FALSE)","v":{"v":0,"d":"0.0"}},{"$f":"SUM(C49:H49)","v":{"v":0,"d":"0.0"}},{"$f":"VLOOKUP($A49,'7'!$B$10:$D$75,3,FALSE)","v":{"v":0,"d":"0.0"}},{"$f":"VLOOKUP($A49,'8'!$B$10:$D$75,3,FALSE)","v":{"v":0,"d":"0.0"}},{"$f":"VLOOKUP($A49,'9'!$B$10:$D$75,3,FALSE)","v":{"v":0,"d":"0.0"}},{"$f":"VLOOKUP($A49,'10'!$B$10:$D$75,3,FALSE)","v":{"v":0,"d":"0.0"}},{"$f":"VLOOKUP($A49,'11'!$B$10:$D$75,3,FALSE)","v":{"v":0,"d":"0.0"}},{"$f":"VLOOKUP($A49,'12'!$B$10:$D$75,3,FALSE)","v":{"v":0,"d":"0.0"}},{"$f":"IF(S49 >0,T49/S49,0)","v":{"v":0,"d":"0.0"}},{"$f":"VLOOKUP(A49,Formelhilfe!$A$15:$O$74,15,FALSE)","v":{"v":0,"d":"0.0"}},{"$f":"SUM(L49:Q49)","v":{"v":0,"d":"0.0"}},{"$f":"IF(V49>0,W49/V49,0)","v":{"v":0,"d":"0.0"}},{"$f":"VLOOKUP(A49,Formelhilfe!$A$15:$P$74,16,FALSE)","v":{"v":0,"d":"0.0"}},{"$f":"SUM(C49:H49,L49:Q49)","v":{"v":0,"d":"0.0"}}]
["Schütze 49",{"$f":"VLOOKUP(A50,'Wettkampf 1'!$B$16:$C$75,2,FALSE)","v":"Verein X"},{"$f":"VLOOKUP(A50,'Wettkampf 1'!$B$16:$D$75,3,FALSE)","v":{"v":0,"d":"0.0"}},{"$f":"VLOOKUP($A50,'2'!$B$16:$D$75,3,FALSE)","v":{"v":0,"d":"0.0"}},{"$f":"VLOOKUP($A50,'3'!$B$10:$D$75,3,FALSE)","v":{"v":0,"d":"0.0"}},{"$f":"VLOOKUP($A50,'4'!$B$10:$D$75,3,FALSE)","v":{"v":0,"d":"0.0"}},{"$f":"VLOOKUP($A50,'5'!$B$10:$D$75,3,FALSE)","v":{"v":0,"d":"0.0"}},{"$f":"VLOOKUP($A50,'6'!$B$10:$D$75,3,FALSE)","v":{"v":0,"d":"0.0"}},{"$f":"IF(J50 > 0,K50/J50,0)","v":{"v":0,"d":"0.0"}},{"$f":"VLOOKUP(A50,Formelhilfe!$A$15:$H$74,8,FALSE)","v":{"v":0,"d":"0.0"}},{"$f":"SUM(C50:H50)","v":{"v":0,"d":"0.0"}},{"$f":"VLOOKUP($A50,'7'!$B$10:$D$75,3,FALSE)","v":{"v":0,"d":"0.0"}},{"$f":"VLOOKUP($A50,'8'!$B$10:$D$75,3,FALSE)","v":{"v":0,"d":"0.0"}},{"$f":"VLOOKUP($A50,'9'!$B$10:$D$75,3,FALSE)","v":{"v":0,"d":"0.0"}},{"$f":"VLOOKUP($A50,'10'!$B$10:$D$75,3,FALSE)","v":{"v":0,"d":"0.0"}},{"$f":"VLOOKUP($A50,'11'!$B$10:$D$75,3,FALSE)","v":{"v":0,"d":"0.0"}},{"$f":"VLOOKUP($A50,'12'!$B$10:$D$75,3,FALSE)","v":{"v":0,"d":"0.0"}},{"$f":"IF(S50 >0,T50/S50,0)","v":{"v":0,"d":"0.0"}},{"$f":"VLOOKUP(A50,Formelhilfe!$A$15:$O$74,15,FALSE)","v":{"v":0,"d":"0.0"}},{"$f":"SUM(L50:Q50)","v":{"v":0,"d":"0.0"}},{"$f":"IF(V50>0,W50/V50,0)","v":{"v":0,"d":"0.0"}},{"$f":"VLOOKUP(A50,Formelhilfe!$A$15:$P$74,16,FALSE)","v":{"v":0,"d":"0.0"}},{"$f":"SUM(C50:H50,L50:Q50)","v":{"v":0,"d":"0.0"}}]
["Schütze 50",{"$f":"VLOOKUP(A51,'Wettkampf 1'!$B$16:$C$75,2,FALSE)","v":"Verein X"},{"$f":"VLOOKUP(A51,'Wettkampf 1'!$B$16:$D$75,3,FALSE)","v":{"v":0,"d":"0.0"}},{"$f":"VLOOKUP($A51,'2'!$B$16:$D$75,3,FALSE)","v":{"v":0,"d":"0.0"}},{"$f":"VLOOKUP($A51,'3'!$B$10:$D$75,3,FALSE)","v":{"v":0,"d":"0.0"}},{"$f":"VLOOKUP($A51,'4'!$B$10:$D$75,3,FALSE)","v":{"v":0,"d":"0.0"}},{"$f":"VLOOKUP($A51,'5'!$B$10:$D$75,3,FALSE)","v":{"v":0,"d":"0.0"}},{"$f":"VLOOKUP($A51,'6'!$B$10:$D$75,3,FALSE)","v":{"v":0,"d":"0.0"}},{"$f":"IF(J51 > 0,K51/J51,0)","v":{"v":0,"d":"0.0"}},{"$f":"VLOOKUP(A51,Formelhilfe!$A$15:$H$74,8,FALSE)","v":{"v":0,"d":"0.0"}},{"$f":"SUM(C51:H51)","v":{"v":0,"d":"0.0"}},{"$f":"VLOOKUP($A51,'7'!$B$10:$D$75,3,FALSE)","v":{"v":0,"d":"0.0"}},{"$f":"VLOOKUP($A51,'8'!$B$10:$D$75,3,FALSE)","v":{"v":0,"d":"0.0"}},{"$f":"VLOOKUP($A51,'9'!$B$10:$D$75,3,FALSE)","v":{"v":0,"d":"0.0"}},{"$f":"VLOOKUP($A51,'10'!$B$10:$D$75,3,FALSE)","v":{"v":0,"d":"0.0"}},{"$f":"VLOOKUP($A51,'11'!$B$10:$D$75,3,FALSE)","v":{"v":0,"d":"0.0"}},{"$f":"VLOOKUP($A51,'12'!$B$10:$D$75,3,FALSE)","v":{"v":0,"d":"0.0"}},{"$f":"IF(S51 >0,T51/S51,0)","v":{"v":0,"d":"0.0"}},{"$f":"VLOOKUP(A51,Formelhilfe!$A$15:$O$74,15,FALSE)","v":{"v":0,"d":"0.0"}},{"$f":"SUM(L51:Q51)","v":{"v":0,"d":"0.0"}},{"$f":"IF(V51>0,W51/V51,0)","v":{"v":0,"d":"0.0"}},{"$f":"VLOOKUP(A51,Formelhilfe!$A$15:$P$74,16,FALSE)","v":{"v":0,"d":"0.0"}},{"$f":"SUM(C51:H51,L51:Q51)","v":{"v":0,"d":"0.0"}}]
["Schütze 51",{"$f":"VLOOKUP(A52,'Wettkampf 1'!$B$16:$C$75,2,FALSE)","v":"Verein XI"},{"$f":"VLOOKUP(A52,'Wettkampf 1'!$B$16:$D$75,3,FALSE)","v":{"v":0,"d":"0.0"}},{"$f":"VLOOKUP($A52,'2'!$B$16:$D$75,3,FALSE)","v":{"v":0,"d":"0.0"}},{"$f":"VLOOKUP($A52,'3'!$B$10:$D$75,3,FALSE)","v":{"v":0,"d":"0.0"}},{"$f":"VLOOKUP($A52,'4'!$B$10:$D$75,3,FALSE)","v":{"v":0,"d":"0.0"}},{"$f":"VLOOKUP($A52,'5'!$B$10:$D$75,3,FALSE)","v":{"v":0,"d":"0.0"}},{"$f":"VLOOKUP($A52,'6'!$B$10:$D$75,3,FALSE)","v":{"v":0,"d":"0.0"}},{"$f":"IF(J52 > 0,K52/J52,0)","v":{"v":0,"d":"0.0"}},{"$f":"VLOOKUP(A52,Formelhilfe!$A$15:$H$74,8,FALSE)","v":{"v":0,"d":"0.0"}},{"$f":"SUM(C52:H52)","v":{"v":0,"d":"0.0"}},{"$f":"VLOOKUP($A52,'7'!$B$10:$D$75,3,FALSE)","v":{"v":0,"d":"0.0"}},{"$f":"VLOOKUP($A52,'8'!$B$10:$D$75,3,FALSE)","v":{"v":0,"d":"0.0"}},{"$f":"VLOOKUP($A52,'9'!$B$10:$D$75,3,FALSE)","v":{"v":0,"d":"0.0"}},{"$f":"VLOOKUP($A52,'10'!$B$10:$D$75,3,FALSE)","v":{"v":0,"d":"0.0"}},{"$f":"VLOOKUP($A52,'11'!$B$10:$D$75,3,FALSE)","v":{"v":0,"d":"0.0"}},{"$f":"VLOOKUP($A52,'12'!$B$10:$D$75,3,FALSE)","v":{"v":0,"d":"0.0"}},{"$f":"IF(S52 >0,T52/S52,0)","v":{"v":0,"d":"0.0"}},{"$f":"VLOOKUP(A52,Formelhilfe!$A$15:$O$74,15,FALSE)","v":{"v":0,"d":"0.0"}},{"$f":"SUM(L52:Q52)","v":{"v":0,"d":"0.0"}},{"$f":"IF(V52>0,W52/V52,0)","v":{"v":0,"d":"0.0"}},{"$f":"VLOOKUP(A52,Formelhilfe!$A$15:$P$74,16,FALSE)","v":{"v":0,"d":"0.0"}},{"$f":"SUM(C52:H52,L52:Q52)","v":{"v":0,"d":"0.0"}}]
["Schütze 52",{"$f":"VLOOKUP(A53,'Wettkampf 1'!$B$16:$C$75,2,FALSE)","v":"Verein XI"},{"$f":"VLOOKUP(A53,'Wettkampf 1'!$B$16:$D$75,3,FALSE)","v":{"v":0,"d":"0.0"}},{"$f":"VLOOKUP($A53,'2'!$B$16:$D$75,3,FALSE)","v":{"v":0,"d":"0.0"}},{"$f":"VLOOKUP($A53,'3'!$B$10:$D$75,3,FALSE)","v":{"v":0,"d":"0.0"}},{"$f":"VLOOKUP($A53,'4'!$B$10:$D$75,3,FALSE)","v":{"v":0,"d":"0.0"}},{"$f":"VLOOKUP($A53,'5'!$B$10:$D$75,3,FALSE)","v":{"v":0,"d":"0.0"}},{"$f":"VLOOKUP($A53,'6'!$B$10:$D$75,3,FALSE)","v":{"v":0,"d":"0.0"}},{"$f":"IF(J53 > 0,K53/J53,0)","v":{"v":0,"d":"0.0"}},{"$f":"VLOOKUP(A53,Formelhilfe!$A$15:$H$74,8,FALSE)","v":{"v":0,"d":"0.0"}},{"$f":"SUM(C53:H53)","v":{"v":0,"d":"0.0"}},{"$f":"VLOOKUP($A53,'7'!$B$10:$D$75,3,FALSE)","v":{"v":0,"d":"0.0"}},{"$f":"VLOOKUP($A53,'8'!$B$10:$D$75,3,FALSE)","v":{"v":0,"d":"0.0"}},{"$f":"VLOOKUP($A53,'9'!$B$10:$D$75,3,FALSE)","v":{"v":0,"d":"0.0"}},{"$f":"VLOOKUP($A53,'10'!$B$10:$D$75,3,FALSE)","v":{"v":0,"d":"0.0"}},{"$f":"VLOOKUP($A53,'11'!$B$10:$D$75,3,FALSE)","v":{"v":0,"d":"0.0"}},{"$f":"VLOOKUP($A53,'12'!$B$10:$D$75,3,FALSE)","v":{"v":0,"d":"0.0"}},{"$f":"IF(S53 >0,T53/S53,0)","v":{"v":0,"d":"0.0"}},{"$f":"VLOOKUP(A53,Formelhilfe!$A$15:$O$74,15,FALSE)","v":{"v":0,"d":"0.0"}},{"$f":"SUM(L53:Q53)","v":{"v":0,"d":"0.0"}},{"$f":"IF(V53>0,W53/V53,0)","v":{"v":0,"d":"0.0"}},{"$f":"VLOOKUP(A53,Formelhilfe!$A$15:$P$74,16,FALSE)","v":{"v":0,"d":"0.0"}},{"$f":"SUM(C53:H53,L53:Q53)","v":{"v":0,"d":"0.0"}}]
["Schütze 53",{"$f":"VLOOKUP(A54,'Wettkampf 1'!$B$16:$C$75,2,FALSE)","v":"Verein XI"},{"$f":"VLOOKUP(A54,'Wettkampf 1'!$B$16:$D$75,3,FALSE)","v":{"v":0,"d":"0.0"}},{"$f":"VLOOKUP($A54,'2'!$B$16:$D$75,3,FALSE)","v":{"v":0,"d":"0.0"}},{"$f":"VLOOKUP($A54,'3'!$B$10:$D$75,3,FALSE)","v":{"v":0,"d":"0.0"}},{"$f":"VLOOKUP($A54,'4'!$B$10:$D$75,3,FALSE)","v":{"v":0,"d":"0.0"}},{"$f":"VLOOKUP($A54,'5'!$B$10:$D$75,3,FALSE)","v":{"v":0,"d":"0.0"}},{"$f":"VLOOKUP($A54,'6'!$B$10:$D$75,3,FALSE)","v":{"v":0,"d":"0.0"}},{"$f":"IF(J54 > 0,K54/J54,0)","v":{"v":0,"d":"0.0"}},{"$f":"VLOOKUP(A54,Formelhilfe!$A$15:$H$74,8,FALSE)","v":{"v":0,"d":"0.0"}},{"$f":"SUM(C54:H54)","v":{"v":0,"d":"0.0"}},{"$f":"VLOOKUP($A54,'7'!$B$10:$D$75,3,FALSE)","v":{"v":0,"d":"0.0"}},{"$f":"VLOOKUP($A54,'8'!$B$10:$D$75,3,FALSE)","v":{"v":0,"d":"0.0"}},{"$f":"VLOOKUP($A54,'9'!$B$10:$D$75,3,FALSE)","v":{"v":0,"d":"0.0"}},{"$f":"VLOOKUP($A54,'10'!$B$10:$D$75,3,FALSE)","v":{"v":0,"d":"0.0"}},{"$f":"VLOOKUP($A54,'11'!$B$10:$D$75,3,FALSE)","v":{"v":0,"d":"0.0"}},{"$f":"VLOOKUP($A54,'12'!$B$10:$D$75,3,FALSE)","v":{"v":0,"d":"0.0"}},{"$f":"IF(S54 >0,T54/S54,0)","v":{"v":0,"d":"0.0"}},{"$f":"VLOOKUP(A54,Formelhilfe!$A$15:$O$74,15,FALSE)","v":{"v":0,"d":"0.0"}},{"$f":"SUM(L54:Q54)","v":{"v":0,"d":"0.0"}},{"$f":"IF(V54>0,W54/V54,0)","v":{"v":0,"d":"0.0"}},{"$f":"VLOOKUP(A54,Formelhilfe!$A$15:$P$74,16,FALSE)","v":{"v":0,"d":"0.0"}},{"$f":"SUM(C54:H54,L54:Q54)","v":{"v":0,"d":"0.0"}}]
["Schütze 54",{"$f":"VLOOKUP(A55,'Wettkampf 1'!$B$16:$C$75,2,FALSE)","v":"Verein XI"},{"$f":"VLOOKUP(A55,'Wettkampf 1'!$B$16:$D$75,3,FALSE)","v":{"v":0,"d":"0.0"}},{"$f":"VLOOKUP($A55,'2'!$B$16:$D$75,3,FALSE)","v":{"v":0,"d":"0.0"}},{"$f":"VLOOKUP($A55,'3'!$B$10:$D$75,3,FALSE)","v":{"v":0,"d":"0.0"}},{"$f":"VLOOKUP($A55,'4'!$B$10:$D$75,3,FALSE)","v":{"v":0,"d":"0.0"}},{"$f":"VLOOKUP($A55,'5'!$B$10:$D$75,3,FALSE)","v":{"v":0,"d":"0.0"}},{"$f":"VLOOKUP($A55,'6'!$B$10:$D$75,3,FALSE)","v":{"v":0,"d":"0.0"}},{"$f":"IF(J55 > 0,K55/J55,0)","v":{"v":0,"d":"0.0"}},{"$f":"VLOOKUP(A55,Formelhilfe!$A$15:$H$74,8,FALSE)","v":{"v":0,"d":"0.0"}},{"$f":"SUM(C55:H55)","v":{"v":0,"d":"0.0"}},{"$f":"VLOOKUP($A55,'7'!$B$10:$D$75,3,FALSE)","v":{"v":0,"d":"0.0"}},{"$f":"VLOOKUP($A55,'8'!$B$10:$D$75,3,FALSE)","v":{"v":0,"d":"0.0"}},{"$f":"VLOOKUP($A55,'9'!$B$10:$D$75,3,FALSE)","v":{"v":0,"d":"0.0"}},{"$f":"VLOOKUP($A55,'10'!$B$10:$D$75,3,FALSE)","v":{"v":0,"d":"0.0"}},{"$f":"VLOOKUP($A55,'11'!$B$10:$D$75,3,FALSE)","v":{"v":0,"d":"0.0"}},{"$f":"VLOOKUP($A55,'12'!$B$10:$D$75,3,FALSE)","v":{"v":0,"d":"0.0"}},{"$f":"IF(S55 >0,T55/S55,0)","v":{"v":0,"d":"0.0"}},{"$f":"VLOOKUP(A55,Formelhilfe!$A$15:$O$74,15,FALSE)","v":{"v":0,"d":"0.0"}},{"$f":"SUM(L55:Q55)","v":{"v":0,"d":"0.0"}},{"$f":"IF(V55>0,W55/V55,0)","v":{"v":0,"d":"0.0"}},{"$f":"VLOOKUP(A55,Formelhilfe!$A$15:$P$74,16,FALSE)","v":{"v":0,"d":"0.0"}},{"$f":"SUM(C55:H55,L55:Q55)","v":{"v":0,"d":"0.0"}}]
["Schütze 55",{"$f":"VLOOKUP(A56,'Wettkampf 1'!$B$16:$C$75,2,FALSE)","v":"Verein XI"},{"$f":"VLOOKUP(A56,'Wettkampf 1'!$B$16:$D$75,3,FALSE)","v":{"v":0,"d":"0.0"}},{"$f":"VLOOKUP($A56,'2'!$B$16:$D$75,3,FALSE)","v":{"v":0,"d":"0.0"}},{"$f":"VLOOKUP($A56,'3'!$B$10:$D$75,3,FALSE)","v":{"v":0,"d":"0.0"}},{"$f":"VLOOKUP($A56,'4'!$B$10:$D$75,3,FALSE)","v":{"v":0,"d":"0.0"}},{"$f":"VLOOKUP($A56,'5'!$B$10:$D$75,3,FALSE)","v":{"v":0,"d":"0.0"}},{"$f":"VLOOKUP($A56,'6'!$B$10:$D$75,3,FALSE)","v":{"v":0,"d":"0.0"}},{"$f":"IF(J56 > 0,K56/J56,0)","v":{"v":0,"d":"0.0"}},{"$f":"VLOOKUP(A56,Formelhilfe!$A$15:$H$74,8,FALSE)","v":{"v":0,"d":"0.0"}},{"$f":"SUM(C56:H56)","v":{"v":0,"d":"0.0"}},{"$f":"VLOOKUP($A56,'7'!$B$10:$D$75,3,FALSE)","v":{"v":0,"d":"0.0"}},{"$f":"VLOOKUP($A56,'8'!$B$10:$D$75,3,FALSE)","v":{"v":0,"d":"0.0"}},{"$f":"VLOOKUP($A56,'9'!$B$10:$D$75,3,FALSE)","v":{"v":0,"d":"0.0"}},{"$f":"VLOOKUP($A56,'10'!$B$10:$D$75,3,FALSE)","v":{"v":0,"d":"0.0"}},{"$f":"VLOOKUP($A56,'11'!$B$10:$D$75,3,FALSE)","v":{"v":0,"d":"0.0"}},{"$f":"VLOOKUP($A56,'12'!$B$10:$D$75,3,FALSE)","v":{"v":0,"d":"0.0"}},{"$f":"IF(S56 >0,T56/S56,0)","v":{"v":0,"d":"0.0"}},{"$f":"VLOOKUP(A56,Formelhilfe!$A$15:$O$74,15,FALSE)","v":{"v":0,"d":"0.0"}},{"$f":"SUM(L56:Q56)","v":{"v":0,"d":"0.0"}},{"$f":"IF(V56>0,W56/V56,0)","v":{"v":0,"d":"0.0"}},{"$f":"VLOOKUP(A56,Formelhilfe!$A$15:$P$74,16,FALSE)","v":{"v":0,"d":"0.0"}},{"$f":"SUM(C56:H56,L56:Q56)","v":{"v":0,"d":"0.0"}}]
["Schütze 56",{"$f":"VLOOKUP(A57,'Wettkampf 1'!$B$16:$C$75,2,FALSE)","v":"Verein XII"},{"$f":"VLOOKUP(A57,'Wettkampf 1'!$B$16:$D$75,3,FALSE)","v":{"v":0,"d":"0.0"}},{"$f":"VLOOKUP($A57,'2'!$B$16:$D$75,3,FALSE)","v":{"v":0,"d":"0.0"}},{"$f":"VLOOKUP($A57,'3'!$B$10:$D$75,3,FALSE)","v":{"v":0,"d":"0.0"}},{"$f":"VLOOKUP($A57,'4'!$B$10:$D$75,3,FALSE)","v":{"v":0,"d":"0.0"}},{"$f":"VLOOKUP($A57,'5'!$B$10:$D$75,3,FALSE)","v":{"v":0,"d":"0.0"}},{"$f":"VLOOKUP($A57,'6'!$B$10:$D$75,3,FALSE)","v":{"v":0,"d":"0.0"}},{"$f":"IF(J57 > 0,K57/J57,0)","v":{"v":0,"d":"0.0"}},{"$f":"VLOOKUP(A57,Formelhilfe!$A$15:$H$74,8,FALSE)","v":{"v":0,"d":"0.0"}},{"$f":"SUM(C57:H57)","v":{"v":0,"d":"0.0"}},{"$f":"VLOOKUP($A57,'7'!$B$10:$D$75,3,FALSE)","v":{"v":0,"d":"0.0"}},{"$f":"VLOOKUP($A57,'8'!$B$10:$D$75,3,FALSE)","v":{"v":0,"d":"0.0"}},{"$f":"VLOOKUP($A57,'9'!$B$10:$D$75,3,FALSE)","v":{"v":0,"d":"0.0"}},{"$f":"VLOOKUP($A57,'10'!$B$10:$D$75,3,FALSE)","v":{"v":0,"d":"0.0"}},{"$f":"VLOOKUP($A57,'11'!$B$10:$D$75,3,FALSE)","v":{"v":0,"d":"0.0"}},{"$f":"VLOOKUP($A57,'12'!$B$10:$D$75,3,FALSE)","v":{"v":0,"d":"0.0"}},{"$f":"IF(S57 >0,T57/S57,0)","v":{"v":0,"d":"0.0"}},{"$f":"VLOOKUP(A57,Formelhilfe!$A$15:$O$74,15,FALSE)","v":{"v":0,"d":"0.0"}},{"$f":"SUM(L57:Q57)","v":{"v":0,"d":"0.0"}},{"$f":"IF(V57>0,W57/V57,0)","v":{"v":0,"d":"0.0"}},{"$f":"VLOOKUP(A57,Formelhilfe!$A$15:$P$74,16,FALSE)","v":{"v":0,"d":"0.0"}},{"$f":"SUM(C57:H57,L57:Q57)","v":{"v":0,"d":"0.0"}}]
["Schütze 57",{"$f":"VLOOKUP(A58,'Wettkampf 1'!$B$16:$C$75,2,FALSE)","v":"Verein XII"},{"$f":"VLOOKUP(A58,'Wettkampf 1'!$B$16:$D$75,3,FALSE)","v":{"v":0,"d":"0.0"}},{"$f":"VLOOKUP($A58,'2'!$B$16:$D$75,3,FALSE)","v":{"v":0,"d":"0.0"}},{"$f":"VLOOKUP($A58,'3'!$B$10:$D$75,3,FALSE)","v":{"v":0,"d":"0.0"}},{"$f":"VLOOKUP($A58,'4'!$B$10:$D$75,3,FALSE)","v":{"v":0,"d":"0.0"}},{"$f":"VLOOKUP($A58,'5'!$B$10:$D$75,3,FALSE)","v":{"v":0,"d":"0.0"}},{"$f":"VLOOKUP($A58,'6'!$B$10:$D$75,3,FALSE)","v":{"v":0,"d":"0.0"}},{"$f":"IF(J58 > 0,K58/J58,0)","v":{"v":0,"d":"0.0"}},{"$f":"VLOOKUP(A58,Formelhilfe!$A$15:$H$74,8,FALSE)","v":{"v":0,"d":"0.0"}},{"$f":"SUM(C58:H58)","v":{"v":0,"d":"0.0"}},{"$f":"VLOOKUP($A58,'7'!$B$10:$D$75,3,FALSE)","v":{"v":0,"d":"0.0"}},{"$f":"VLOOKUP($A58,'8'!$B$10:$D$75,3,FALSE)","v":{"v":0,"d":"0.0"}},{"$f":"VLOOKUP($A58,'9'!$B$10:$D$75,3,FALSE)","v":{"v":0,"d":"0.0"}},{"$f":"VLOOKUP($A58,'10'!$B$10:$D$75,3,FALSE)","v":{"v":0,"d":"0.0"}},{"$f":"VLOOKUP($A58,'11'!$B$10:$D$75,3,FALSE)","v":{"v":0,"d":"0.0"}},{"$f":"VLOOKUP($A58,'12'!$B$10:$D$75,3,FALSE)","v":{"v":0,"d":"0.0"}},{"$f":"IF(S58 >0,T58/S58,0)","v":{"v":0,"d":"0.0"}},{"$f":"VLOOKUP(A58,Formelhilfe!$A$15:$O$74,15,FALSE)","v":{"v":0,"d":"0.0"}},{"$f":"SUM(L58:Q58)","v":{"v":0,"d":"0.0"}},{"$f":"IF(V58>0,W58/V58,0)","v":{"v":0,"d":"0.0"}},{"$f":"VLOOKUP(A58,Formelhilfe!$A$15:$P$74,16,FALSE)","v":{"v":0,"d":"0.0"}},{"$f":"SUM(C58:H58,L58:Q58)","v":{"v":0,"d":"0.0"}}]
["Schütze 58",{"$f":"VLOOKUP(A59,'Wettkampf 1'!$B$16:$C$75,2,FALSE)","v":"Verein XII"},{"$f":"VLOOKUP(A59,'Wettkampf 1'!$B$16:$D$75,3,FALSE)","v":{"v":0,"d":"0.0"}},{"$f":"VLOOKUP($A59,'2'!$B$16:$D$75,3,FALSE)","v":{"v":0,"d":"0.0"}},{"$f":"VLOOKUP($A59,'3'!$B$10:$D$75,3,FALSE)","v":{"v":0,"d":"0.0"}},{"$f":"VLOOKUP($A59,'4'!$B$10:$D$75,3,FALSE)","v":{"v":0,"d":"0.0"}},{"$f":"VLOOKUP($A59,'5'!$B$10:$D$75,3,FALSE)","v":{"v":0,"d":"0.0"}},{"$f":"VLOOKUP($A59,'6'!$B$10:$D$75,3,FALSE)","v":{"v":0,"d":"0.0"}},{"$f":"IF(J59 > 0,K59/J59,0)","v":{"v":0,"d":"0.0"}},{"$f":"VLOOKUP(A59,Formelhilfe!$A$15:$H$74,8,FALSE)","v":{"v":0,"d":"0.0"}},{"$f":"SUM(C59:H59)","v":{"v":0,"d":"0.0"}},{"$f":"VLOOKUP($A59,'7'!$B$10:$D$75,3,FALSE)","v":{"v":0,"d":"0.0"}},{"$f":"VLOOKUP($A59,'8'!$B$10:$D$75,3,FALSE)","v":{"v":0,"d":"0.0"}},{"$f":"VLOOKUP($A59,'9'!$B$10:$D$75,3,FALSE)","v":{"v":0,"d":"0.0"}},{"$f":"VLOOKUP($A59,'10'!$B$10:$D$75,3,FALSE)","v":{"v":0,"d":"0.0"}},{"$f":"VLOOKUP($A59,'11'!$B$10:$D$75,3,FALSE)","v":{"v":0,"d":"0.0"}},{"$f":"VLOOKUP($A59,'12'!$B$10:$D$75,3,FALSE)","v":{"v":0,"d":"0.0"}},{"$f":"IF(S59 >0,T59/S59,0)","v":{"v":0,"d":"0.0"}},{"$f":"VLOOKUP(A59,Formelhilfe!$A$15:$O$74,15,FALSE)","v":{"v":0,"d":"0.0"}},{"$f":"SUM(L59:Q59)","v":{"v":0,"d":"0.0"}},{"$f":"IF(V59>0,W59/V59,0)","v":{"v":0,"d":"0.0"}},{"$f":"VLOOKUP(A59,Formelhilfe!$A$15:$P$74,16,FALSE)","v":{"v":0,"d":"0.0"}},{"$f":"SUM(C59:H59,L59:Q59)","v":{"v":0,"d":"0.0"}}]
["Schütze 59",{"$f":"VLOOKUP(A60,'Wettkampf 1'!$B$16:$C$75,2,FALSE)","v":"Verein XII"},{"$f":"VLOOKUP(A60,'Wettkampf 1'!$B$16:$D$75,3,FALSE)","v":{"v":0,"d":"0.0"}},{"$f":"VLOOKUP($A60,'2'!$B$16:$D$75,3,FALSE)","v":{"v":0,"d":"0.0"}},{"$f":"VLOOKUP($A60,'3'!$B$10:$D$75,3,FALSE)","v":{"v":0,"d":"0.0"}},{"$f":"VLOOKUP($A60,'4'!$B$10:$D$75,3,FALSE)","v":{"v":0,"d":"0.0"}},{"$f":"VLOOKUP($A60,'5'!$B$10:$D$75,3,FALSE)","v":{"v":0,"d":"0.0"}},{"$f":"VLOOKUP($A60,'6'!$B$10:$D$75,3,FALSE)","v":{"v":0,"d":"0.0"}},{"$f":"IF(J60 > 0,K60/J60,0)","v":{"v":0,"d":"0.0"}},{"$f":"VLOOKUP(A60,Formelhilfe!$A$15:$H$74,8,FALSE)","v":{"v":0,"d":"0.0"}},{"$f":"SUM(C60:H60)","v":{"v":0,"d":"0.0"}},{"$f":"VLOOKUP($A60,'7'!$B$10:$D$75,3,FALSE)","v":{"v":0,"d":"0.0"}},{"$f":"VLOOKUP($A60,'8'!$B$10:$D$75,3,FALSE)","v":{"v":0,"d":"0.0"}},{"$f":"VLOOKUP($A60,'9'!$B$10:$D$75,3,FALSE)","v":{"v":0,"d":"0.0"}},{"$f":"VLOOKUP($A60,'10'!$B$10:$D$75,3,FALSE)","v":{"v":0,"d":"0.0"}},{"$f":"VLOOKUP($A60,'11'!$B$10:$D$75,3,FALSE)","v":{"v":0,"d":"0.0"}},{"$f":"VLOOKUP($A60,'12'!$B$10:$D$75,3,FALSE)","v":{"v":0,"d":"0.0"}},{"$f":"IF(S60 >0,T60/S60,0)","v":{"v":0,"d":"0.0"}},{"$f":"VLOOKUP(A60,Formelhilfe!$A$15:$O$74,15,FALSE)","v":{"v":0,"d":"0.0"}},{"$f":"SUM(L60:Q60)","v":{"v":0,"d":"0.0"}},{"$f":"IF(V60>0,W60/V60,0)","v":{"v":0,"d":"0.0"}},{"$f":"VLOOKUP(A60,Formelhilfe!$A$15:$P$74,16,FALSE)","v":{"v":0,"d":"0.0"}},{"$f":"SUM(C60:H60,L60:Q60)","v":{"v":0,"d":"0.0"}}]
["Schütze 60",{"$f":"VLOOKUP(A61,'Wettkampf 1'!$B$16:$C$75,2,FALSE)","v":"Verein XII"},{"$f":"VLOOKUP(A61,'Wettkampf 1'!$B$16:$D$75,3,FALSE)","v":{"v":0,"d":"0.0"}},{"$f":"VLOOKUP($A61,'2'!$B$16:$D$75,3,FALSE)","v":{"v":0,"d":"0.0"}},{"$f":"VLOOKUP($A61,'3'!$B$10:$D$75,3,FALSE)","v":{"v":0,"d":"0.0"}},{"$f":"VLOOKUP($A61,'4'!$B$10:$D$75,3,FALSE)","v":{"v":0,"d":"0.0"}},{"$f":"VLOOKUP($A61,'5'!$B$10:$D$75,3,FALSE)","v":{"v":0,"d":"0.0"}},{"$f":"VLOOKUP($A61,'6'!$B$10:$D$75,3,FALSE)","v":{"v":0,"d":"0.0"}},{"$f":"IF(J61 > 0,K61/J61,0)","v":{"v":0,"d":"0.0"}},{"$f":"VLOOKUP(A61,Formelhilfe!$A$15:$H$74,8,FALSE)","v":{"v":0,"d":"0.0"}},{"$f":"SUM(C61:H61)","v":{"v":0,"d":"0.0"}},{"$f":"VLOOKUP($A61,'7'!$B$10:$D$75,3,FALSE)","v":{"v":0,"d":"0.0"}},{"$f":"VLOOKUP($A61,'8'!$B$10:$D$75,3,FALSE)","v":{"v":0,"d":"0.0"}},{"$f":"VLOOKUP($A61,'9'!$B$10:$D$75,3,FALSE)","v":{"v":0,"d":"0.0"}},{"$f":"VLOOKUP($A61,'10'!$B$10:$D$75,3,FALSE)","v":{"v":0,"d":"0.0"}},{"$f":"VLOOKUP($A61,'11'!$B$10:$D$75,3,FALSE)","v":{"v":0,"d":"0.0"}},{"$f":"VLOOKUP($A61,'12'!$B$10:$D$75,3,FALSE)","v":{"v":0,"d":"0.0"}},{"$f":"IF(S61 >0,T61/S61,0)","v":{"v":0,"d":"0.0"}},{"$f":"VLOOKUP(A61,Formelhilfe!$A$15:$O$74,15,FALSE)","v":{"v":0,"d":"0.0"}},{"$f":"SUM(L61:Q61)","v":{"v":0,"d":"0.0"}},{"$f":"IF(V61>0,W61/V61,0)","v":{"v":0,"d":"0.0"}},{"$f":"VLOOKUP(A61,Formelhilfe!$A$15:$P$74,16,FALSE)","v":{"v":0,"d":"0.0"}},{"$f":"SUM(C61:H61,L61:Q61)","v":{"v":0,"d":"0.0"}}]

{"sheet":"Formelhilfe","index":16,"n_rows":75,"n_cols":21,"rows_kept":75,"hidden":true}
[null,1,2,3,4,5,6,"Hinrunde Schnitt",7,8,9,10,11,12,"Rückrunde Schnitt","Gesamt Schnitt",null,null,"Kreisoberliga","Schützen","2023/2024"]
[{"$f":"'Wettkampf 1'!B2","v":"Esterwegen"},{"$f":"IF('Wettkampf 1'!D2>0,1,0)","v":1},{"$f":"IF('2'!$D2>0,1,0)","v":1},{"$f":"IF('3'!$D2>0,1,0)","v":0},{"$f":"IF('4'!$D2>0,1,0)","v":1},{"$f":"IF('5'!$D2>0,1,0)","v":1},{"$f":"IF('6'!$D2>0,1,0)","v":0},{"$f":"SUM(B2:G2)","v":4},{"$f":"IF('7'!$D2>0,1,0)","v":1},{"$f":"IF('8'!$D2>0,1,0)","v":0},{"$f":"IF('9'!$D2>0,1,0)","v":0},{"$f":"IF('10'!$D2>0,1,0)","v":0},{"$f":"IF('11'!$D2>0,1,0)","v":0},{"$f":"IF('12'!$D2>0,1,0)","v":0},{"$f":"SUM(I2:N2)","v":1},{"$f":"O2+H2","v":5},null,null,"1. Kreisliga","Damen","2024/2025"]
[{"$f":"'Wettkampf 1'!B3","v":"Lähden Jugend I"},{"$f":"IF('Wettkampf 1'!D3>0,1,0)","v":1},{"$f":"IF('2'!$D3>0,1,0)","v":1},{"$f":"IF('3'!$D3>0,1,0)","v":1},{"$f":"IF('4'!$D3>0,1,0)","v":1},{"$f":"IF('5'!$D3>0,1,0)","v":1},{"$f":"IF('6'!$D3>0,1,0)","v":0},{"$f":"SUM(B3:G3)","v":5},{"$f":"IF('7'!$D3>0,1,0)","v":1},{"$f":"IF('8'!$D3>0,1,0)","v":1},{"$f":"IF('9'!$D3>0,1,0)","v":0},{"$f":"IF('10'!$D3>0,1,0)","v":0},{"$f":"IF('11'!$D3>0,1,0)","v":0},{"$f":"IF('12'!$D3>0,1,0)","v":0},{"$f":"SUM(I3:N3)","v":2},{"$f":"O3+H3","v":7},null,null,"2. Kreisliga","Altersgruppe","2025/2026"]
[{"$f":"'Wettkampf 1'!B4","v":"Börgerwald"},{"$f":"IF('Wettkampf 1'!D4>0,1,0)","v":1},{"$f":"IF('2'!$D4>0,1,0)","v":1},{"$f":"IF('3'!$D4>0,1,0)","v":1},{"$f":"IF('4'!$D4>0,1,0)","v":1},{"$f":"IF('5'!$D4>0,1,0)","v":0},{"$f":"IF('6'!$D4>0,1,0)","v":0},4,{"$f":"IF('7'!$D4>0,1,0)","v":0},{"$f":"IF('8'!$D4>0,1,0)","v":0},{"$f":"IF('9'!$D4>0,1,0)","v":0},{"$f":"IF('10'!$D4>0,1,0)","v":0},{"$f":"IF('11'!$D4>0,1,0)","v":0},{"$f":"IF('12'!$D4>0,1,0)","v":0},0,4,null,null,"1. Kreisklasse","Senioren","2026/2027"]
[{"$f":"'Wettkampf 1'!B5","v":"Börgermoor"},{"$f":"IF('Wettkampf 1'!D5>0,1,0)","v":1},{"$f":"IF('2'!$D5>0,1,0)","v":1},{"$f":"IF('3'!$D5>0,1,0)","v":1},{"$f":"IF('4'!$D5>0,1,0)","v":1},{"$f":"IF('5'!$D5>0,1,0)","v":1},{"$f":"IF('6'!$D5>0,1,0)","v":0},5,{"$f":"IF('7'!$D5>0,1,0)","v":1},{"$f":"IF('8'!$D5>0,1,0)","v":1},{"$f":"IF('9'!$D5>0,1,0)","v":0},{"$f":"IF('10'!$D5>0,1,0)","v":0},{"$f":"IF('11'!$D5>0,1,0)","v":0},{"$f":"IF('12'!$D5>0,1,0)","v":0},2,7,null,null,"2. Kreisklasse","Jugend","2027/2028"]
[{"$f":"'Wettkampf 1'!B6","v":"Spahnharrenstätte"},{"$f":"IF('Wettkampf 1'!D6>0,1,0)","v":1},{"$f":"IF('2'!$D6>0,1,0)","v":1},{"$f":"IF('3'!$D6>0,1,0)","v":1},{"$f":"IF('4'!$D6>0,1,0)","v":1},{"$f":"IF('5'!$D6>0,1,0)","v":1},{"$f":"IF('6'!$D6>0,1,0)","v":0},5,{"$f":"IF('7'!$D6>0,1,0)","v":1},{"$f":"IF('8'!$D6>0,1,0)","v":1},{"$f":"IF('9'!$D6>0,1,0)","v":0},{"$f":"IF('10'!$D6>0,1,0)","v":0},{"$f":"IF('11'!$D6>0,1,0)","v":0},{"$f":"IF('12'!$D6>0,1,0)","v":0},2,7,null,null,"3. Kreisklasse","Schüler","2028/2029"]
[{"$f":"'Wettkampf 1'!B7","v":"Lorup"},{"$f":"IF('Wettkampf 1'!D7>0,1,0)","v":1},{"$f":"IF('2'!$D7>0,1,0)","v":0},{"$f":"IF('3'!$D7>0,1,0)","v":0},{"$f":"IF('4'!$D7>0,1,0)","v":1},{"$f":"IF('5'!$D7>0,1,0)","v":0},{"$f":"IF('6'!$D7>0,1,0)","v":0},2,{"$f":"IF('7'!$D7>0,1,0)","v":0},{"$f":"IF('8'!$D7>0,1,0)","v":0},{"$f":"IF('9'!$D7>0,1,0)","v":0},{"$f":"IF('10'!$D7>0,1,0)","v":0},{"$f":"IF('11'!$D7>0,1,0)","v":0},{"$f":"IF('12'!$D7>0,1,0)","v":0},0,2,null,null,"4. Kreisklasse","offene Klasse FHLG","2039/2030"]
["Verein VII",{"$f":"IF('Wettkampf 1'!D8>0,1,0)","v":1},{"$f":"IF('2'!$D8>0,1,0)","v":1},{"$f":"IF('3'!$D8>0,1,0)","v":1},{"$f":"IF('4'!$D8>0,1,0)","v":1},{"$f":"IF('5'!$D8>0,1,0)","v":1},{"$f":"IF('6'!$D8>0,1,0)","v":0},5,{"$f":"IF('7'!$D8>0,1,0)","v":1},{"$f":"IF('8'!$D8>0,1,0)","v":1},{"$f":"IF('9'!$D8>0,1,0)","v":0},{"$f":"IF('10'!$D8>0,1,0)","v":0},{"$f":"IF('11'!$D8>0,1,0)","v":0},{"$f":"IF('12'!$D8>0,1,0)","v":0},2,7,null,null,"5. Kreisklasse","Luftpistole"]
[{"$f":"'Wettkampf 1'!B9","v":"Sögel"},{"$f":"IF('Wettkampf 1'!D9>0,1,0)","v":0},{"$f":"IF('2'!$D9>0,1,0)","v":0},{"$f":"IF('3'!$D9>0,1,0)","v":0},{"$f":"IF('4'!$D9>0,1,0)","v":1},{"$f":"IF('5'!$D9>0,1,0)","v":0},{"$f":"IF('6'!$D9>0,1,0)","v":0},1,{"$f":"IF('7'!$D9>0,1,0)","v":0},{"$f":"IF('8'!$D9>0,1,0)","v":0},{"$f":"IF('9'!$D9>0,1,0)","v":0},{"$f":"IF('10'!$D9>0,1,0)","v":0},{"$f":"IF('11'!$D9>0,1,0)","v":0},{"$f":"IF('12'!$D9>0,1,0)","v":0},0,1,null,null,"6. Kreisklasse"]
["Verein VII",{"$f":"IF('Wettkampf 1'!D10>0,1,0)","v":0},{"$f":"IF('2'!$D10>0,1,0)","v":0},{"$f":"IF('3'!$D10>0,1,0)","v":0},{"$f":"IF('4'!$D10>0,1,0)","v":0},{"$f":"IF('5'!$D10>0,1,0)","v":0},{"$f":"IF('6'!$D10>0,1,0)","v":0},0,{"$f":"IF('7'!$D10>0,1,0)","v":0},{"$f":"IF('8'!$D10>0,1,0)","v":0},{"$f":"IF('9'!$D10>0,1,0)","v":0},{"$f":"IF('10'!$D10>0,1,0)","v":0},{"$f":"IF('11'!$D10>0,1,0)","v":0},{"$f":"IF('12'!$D10>0,1,0)","v":0},0,0,null,null,"7. Kreisklasse"]
[{"$f":"'Wettkampf 1'!B11","v":"Verein X"},{"$f":"IF('Wettkampf 1'!D11>0,1,0)","v":0},{"$f":"IF('2'!$D11>0,1,0)","v":0},{"$f":"IF('3'!$D11>0,1,0)","v":0},{"$f":"IF('4'!$D11>0,1,0)","v":0},{"$f":"IF('5'!$D11>0,1,0)","v":0},{"$f":"IF('6'!$D11>0,1,0)","v":0},0,{"$f":"IF('7'!$D11>0,1,0)","v":0},{"$f":"IF('8'!$D11>0,1,0)","v":0},{"$f":"IF('9'!$D11>0,1,0)","v":0},{"$f":"IF('10'!$D11>0,1,0)","v":0},{"$f":"IF('11'!$D11>0,1,0)","v":0},{"$f":"IF('12'!$D11>0,1,0)","v":0},0,0]
["Verein VII",{"$f":"IF('Wettkampf 1'!D12>0,1,0)","v":0},{"$f":"IF('2'!$D12>0,1,0)","v":0},{"$f":"IF('3'!$D12>0,1,0)","v":0},{"$f":"IF('4'!$D12>0,1,0)","v":0},{"$f":"IF('5'!$D12>0,1,0)","v":0},{"$f":"IF('6'!$D12>0,1,0)","v":0},0,{"$f":"IF('7'!$D12>0,1,0)","v":0},{"$f":"IF('8'!$D12>0,1,0)","v":0},{"$f":"IF('9'!$D12>0,1,0)","v":0},{"$f":"IF('10'!$D12>0,1,0)","v":0},{"$f":"IF('11'!$D12>0,1,0)","v":0},{"$f":"IF('12'!$D12>0,1,0)","v":0},0,0]
[{"$f":"'Wettkampf 1'!B13","v":"Verein XII"},{"$f":"IF('Wettkampf 1'!D13>0,1,0)","v":0},{"$f":"IF('2'!$D13>0,1,0)","v":0},{"$f":"IF('3'!$D13>0,1,0)","v":0},{"$f":"IF('4'!$D13>0,1,0)","v":0},{"$f":"IF('5'!$D13>0,1,0)","v":0},{"$f":"IF('6'!$D13>0,1,0)","v":0},0,{"$f":"IF('7'!$D13>0,1,0)","v":0},{"$f":"IF('8'!$D13>0,1,0)","v":0},{"$f":"IF('9'!$D13>0,1,0)","v":0},{"$f":"IF('10'!$D13>0,1,0)","v":0},{"$f":"IF('11'!$D13>0,1,0)","v":0},{"$f":"IF('12'!$D13>0,1,0)","v":0},0,0]
["Einzelergebnisse:"]
["Gedecksnis Stefan",{"$f":"IF('Wettkampf 1'!D16>0,1,0)","v":1},{"$f":"IF('2'!$D16>0,1,0)","v":1},{"$f":"IF('3'!$D16>0,1,0)","v":0},{"$f":"IF('4'!$D16>0,1,0)","v":1},{"$f":"IF('5'!$D16>0,1,0)","v":1},{"$f":"IF('6'!$D16>0,1,0)","v":0},4,{"$f":"IF('7'!$D16>0,1,0)","v":1},{"$f":"IF('8'!$D16>0,1,0)","v":0},{"$f":"IF('9'!$D16>0,1,0)","v":0},{"$f":"IF('10'!$D16>0,1,0)","v":0},{"$f":"IF('11'!$D16>0,1,0)","v":0},{"$f":"IF('12'!$D16>0,1,0)","v":0},1,{"$f":"O15+H15","v":5}]
["Wübben Jasper",{"$f":"IF('Wettkampf 1'!D17>0,1,0)","v":0},{"$f":"IF('2'!$D17>0,1,0)","v":0},{"$f":"IF('3'!$D17>0,1,0)","v":0},{"$f":"IF('4'!$D17>0,1,0)","v":0},{"$f":"IF('5'!$D17>0,1,0)","v":0},{"$f":"IF('6'!$D17>0,1,0)","v":0},0,{"$f":"IF('7'!$D17>0,1,0)","v":0},{"$f":"IF('8'!$D17>0,1,0)","v":0},{"$f":"IF('9'!$D17>0,1,0)","v":0},{"$f":"IF('10'!$D17>0,1,0)","v":0},{"$f":"IF('11'!$D17>0,1,0)","v":0},{"$f":"IF('12'!$D17>0,1,0)","v":0},0,{"$f":"O16+H16","v":0}]
["Engbers Julian",{"$f":"IF('Wettkampf 1'!D18>0,1,0)","v":0},{"$f":"IF('2'!$D18>0,1,0)","v":0},{"$f":"IF('3'!$D18>0,1,0)","v":0},{"$f":"IF('4'!$D18>0,1,0)","v":0},{"$f":"IF('5'!$D18>0,1,0)","v":0},{"$f":"IF('6'!$D18>0,1,0)","v":0},0,{"$f":"IF('7'!$D18>0,1,0)","v":0},{"$f":"IF('8'!$D18>0,1,0)","v":0},{"$f":"IF('9'!$D18>0,1,0)","v":0},{"$f":"IF('10'!$D18>0,1,0)","v":0},{"$f":"IF('11'!$D18>0,1,0)","v":0},{"$f":"IF('12'!$D18>0,1,0)","v":0},0,0]
["Meyer Johan",{"$f":"IF('Wettkampf 1'!D19>0,1,0)","v":0},{"$f":"IF('2'!$D19>0,1,0)","v":0},{"$f":"IF('3'!$D19>0,1,0)","v":0},{"$f":"IF('4'!$D19>0,1,0)","v":0},{"$f":"IF('5'!$D19>0,1,0)","v":0},{"$f":"IF('6'!$D19>0,1,0)","v":0},0,{"$f":"IF('7'!$D19>0,1,0)","v":0},{"$f":"IF('8'!$D19>0,1,0)","v":0},{"$f":"IF('9'!$D19>0,1,0)","v":0},{"$f":"IF('10'!$D19>0,1,0)","v":0},{"$f":"IF('11'!$D19>0,1,0)","v":0},{"$f":"IF('12'!$D19>0,1,0)","v":0},0,0]
["Schütze 5",{"$f":"IF('Wettkampf 1'!D20>0,1,0)","v":0},{"$f":"IF('2'!$D20>0,1,0)","v":0},{"$f":"IF('3'!$D20>0,1,0)","v":0},{"$f":"IF('4'!$D20>0,1,0)","v":0},{"$f":"IF('5'!$D20>0,1,0)","v":0},{"$f":"IF('6'!$D20>0,1,0)","v":0},0,{"$f":"IF('7'!$D20>0,1,0)","v":0},{"$f":"IF('8'!$D20>0,1,0)","v":0},{"$f":"IF('9'!$D20>0,1,0)","v":0},{"$f":"IF('10'!$D20>0,1,0)","v":0},{"$f":"IF('11'!$D20>0,1,0)","v":0},{"$f":"IF('12'!$D20>0,1,0)","v":0},0,0]
["Strüwing Inja",{"$f":"IF('Wettkampf 1'!D21>0,1,0)","v":1},{"$f":"IF('2'!$D21>0,1,0)","v":1},{"$f":"IF('3'!$D21>0,1,0)","v":1},{"$f":"IF('4'!$D21>0,1,0)","v":1},{"$f":"IF('5'!$D21>0,1,0)","v":1},{"$f":"IF('6'!$D21>0,1,0)","v":0},5,{"$f":"IF('7'!$D21>0,1,0)","v":1},{"$f":"IF('8'!$D21>0,1,0)","v":1},{"$f":"IF('9'!$D21>0,1,0)","v":0},{"$f":"IF('10'!$D21>0,1,0)","v":0},{"$f":"IF('11'!$D21>0,1,0)","v":0},{"$f":"IF('12'!$D21>0,1,0)","v":0},2,7]
["Bruns Hendrik",{"$f":"IF('Wettkampf 1'!D22>0,1,0)","v":1},{"$f":"IF('2'!$D22>0,1,0)","v":1},{"$f":"IF('3'!$D22>0,1,0)","v":1},{"$f":"IF('4'!$D22>0,1,0)","v":1},{"$f":"IF('5'!$D22>0,1,0)","v":1},{"$f":"IF('6'!$D22>0,1,0)","v":0},5,{"$f":"IF('7'!$D22>0,1,0)","v":1},{"$f":"IF('8'!$D22>0,1,0)","v":1},{"$f":"IF('9'!$D22>0,1,0)","v":0},{"$f":"IF('10'!$D22>0,1,0)","v":0},{"$f":"IF('11'!$D22>0,1,0)","v":0},{"$f":"IF('12'!$D22>0,1,0)","v":0},2,7]
["Feldhaus Vanessa",{"$f":"IF('Wettkampf 1'!D23>0,1,0)","v":1},{"$f":"IF('2'!$D23>0,1,0)","v":0},{"$f":"IF('3'!$D23>0,1,0)","v":1},{"$f":"IF('4'!$D23>0,1,0)","v":1},{"$f":"IF('5'!$D23>0,1,0)","v":0},{"$f":"IF('6'!$D23>0,1,0)","v":0},3,{"$f":"IF('7'!$D23>0,1,0)","v":1},{"$f":"IF('8'!$D23>0,1,0)","v":1},{"$f":"IF('9'!$D23>0,1,0)","v":0},{"$f":"IF('10'!$D23>0,1,0)","v":0},{"$f":"IF('11'!$D23>0,1,0)","v":0},{"$f":"IF('12'!$D23>0,1,0)","v":0},2,5]
["Feldhaus Celien ",{"$f":"IF('Wettkampf 1'!D24>0,1,0)","v":1},{"$f":"IF('2'!$D24>0,1,0)","v":0},{"$f":"IF('3'!$D24>0,1,0)","v":1},{"$f":"IF('4'!$D24>0,1,0)","v":1},{"$f":"IF('5'!$D24>0,1,0)","v":0},{"$f":"IF('6'!$D24>0,1,0)","v":0},3,{"$f":"IF('7'!$D24>0,1,0)","v":1},{"$f":"IF('8'!$D24>0,1,0)","v":1},{"$f":"IF('9'!$D24>0,1,0)","v":0},{"$f":"IF('10'!$D24>0,1,0)","v":0},{"$f":"IF('11'!$D24>0,1,0)","v":0},{"$f":"IF('12'!$D24>0,1,0)","v":0},2,5]
["Stümpler Jan-Luca",{"$f":"IF('Wettkampf 1'!D25>0,1,0)","v":0},{"$f":"IF('2'!$D25>0,1,0)","v":0},{"$f":"IF('3'!$D25>0,1,0)","v":0},{"$f":"IF('4'!$D25>0,1,0)","v":1},{"$f":"IF('5'!$D25>0,1,0)","v":1},{"$f":"IF('6'!$D25>0,1,0)","v":0},2,{"$f":"IF('7'!$D25>0,1,0)","v":1},{"$f":"IF('8'!$D25>0,1,0)","v":1},{"$f":"IF('9'!$D25>0,1,0)","v":0},{"$f":"IF('10'!$D25>0,1,0)","v":0},{"$f":"IF('11'!$D25>0,1,0)","v":0},{"$f":"IF('12'!$D25>0,1,0)","v":0},2,4]
["Hanneken Maren",{"$f":"IF('Wettkampf 1'!D26>0,1,0)","v":1},{"$f":"IF('2'!$D26>0,1,0)","v":1},{"$f":"IF('3'!$D26>0,1,0)","v":1},{"$f":"IF('4'!$D26>0,1,0)","v":1},{"$f":"IF('5'!$D26>0,1,0)","v":0},{"$f":"IF('6'!$D26>0,1,0)","v":0},4,{"$f":"IF('7'!$D26>0,1,0)","v":0},{"$f":"IF('8'!$D26>0,1,0)","v":0},{"$f":"IF('9'!$D26>0,1,0)","v":0},{"$f":"IF('10'!$D26>0,1,0)","v":0},{"$f":"IF('11'!$D26>0,1,0)","v":0},{"$f":"IF('12'!$D26>0,1,0)","v":0},0,4]
["Köstering Nele",{"$f":"IF('Wettkampf 1'!D27>0,1,0)","v":1},{"$f":"IF('2'!$D27>0,1,0)","v":0},{"$f":"IF('3'!$D27>0,1,0)","v":0},{"$f":"IF('4'!$D27>0,1,0)","v":1},{"$f":"IF('5'!$D27>0,1,0)","v":0},{"$f":"IF('6'!$D27>0,1,0)","v":0},2,{"$f":"IF('7'!$D27>0,1,0)","v":0},{"$f":"IF('8'!$D27>0,1,0)","v":0},{"$f":"IF('9'!$D27>0,1,0)","v":0},{"$f":"IF('10'!$D27>0,1,0)","v":0},{"$f":"IF('11'!$D27>0,1,0)","v":0},{"$f":"IF('12'!$D27>0,1,0)","v":0},0,2]
["Lohmann Amy",{"$f":"IF('Wettkampf 1'!D28>0,1,0)","v":0},{"$f":"IF('2'!$D28>0,1,0)","v":0},{"$f":"IF('3'!$D28>0,1,0)","v":1},{"$f":"IF('4'!$D28>0,1,0)","v":1},{"$f":"IF('5'!$D28>0,1,0)","v":0},{"$f":"IF('6'!$D28>0,1,0)","v":0},2,{"$f":"IF('7'!$D28>0,1,0)","v":0},{"$f":"IF('8'!$D28>0,1,0)","v":0},{"$f":"IF('9'!$D28>0,1,0)","v":0},{"$f":"IF('10'!$D28>0,1,0)","v":0},{"$f":"IF('11'!$D28>0,1,0)","v":0},{"$f":"IF('12'!$D28>0,1,0)","v":0},0,2]
["Schütze 14",{"$f":"IF('Wettkampf 1'!D29>0,1,0)","v":0},{"$f":"IF('2'!$D29>0,1,0)","v":0},{"$f":"IF('3'!$D29>0,1,0)","v":0},{"$f":"IF('4'!$D29>0,1,0)","v":0},{"$f":"IF('5'!$D29>0,1,0)","v":0},{"$f":"IF('6'!$D29>0,1,0)","v":0},0,{"$f":"IF('7'!$D29>0,1,0)","v":0},{"$f":"IF('8'!$D29>0,1,0)","v":0},{"$f":"IF('9'!$D29>0,1,0)","v":0},{"$f":"IF('10'!$D29>0,1,0)","v":0},{"$f":"IF('11'!$D29>0,1,0)","v":0},{"$f":"IF('12'!$D29>0,1,0)","v":0},0,0]
["Schütze 15",{"$f":"IF('Wettkampf 1'!D30>0,1,0)","v":0},{"$f":"IF('2'!$D30>0,1,0)","v":0},{"$f":"IF('3'!$D30>0,1,0)","v":0},{"$f":"IF('4'!$D30>0,1,0)","v":0},{"$f":"IF('5'!$D30>0,1,0)","v":0},{"$f":"IF('6'!$D30>0,1,0)","v":0},0,{"$f":"IF('7'!$D30>0,1,0)","v":0},{"$f":"IF('8'!$D30>0,1,0)","v":0},{"$f":"IF('9'!$D30>0,1,0)","v":0},{"$f":"IF('10'!$D30>0,1,0)","v":0},{"$f":"IF('11'!$D30>0,1,0)","v":0},{"$f":"IF('12'!$D30>0,1,0)","v":0},0,0]
["Brandt Mira",{"$f":"IF('Wettkampf 1'!D31>0,1,0)","v":1},{"$f":"IF('2'!$D31>0,1,0)","v":1},{"$f":"IF('3'!$D31>0,1,0)","v":1},{"$f":"IF('4'!$D31>0,1,0)","v":1},{"$f":"IF('5'!$D31>0,1,0)","v":1},{"$f":"IF('6'!$D31>0,1,0)","v":0},5,{"$f":"IF('7'!$D31>0,1,0)","v":1},{"$f":"IF('8'!$D31>0,1,0)","v":1},{"$f":"IF('9'!$D31>0,1,0)","v":0},{"$f":"IF('10'!$D31>0,1,0)","v":0},{"$f":"IF('11'!$D31>0,1,0)","v":0},{"$f":"IF('12'!$D31>0,1,0)","v":0},2,7]
["Eichhorn Luca",{"$f":"IF('Wettkampf 1'!D32>0,1,0)","v":1},{"$f":"IF('2'!$D32>0,1,0)","v":1},{"$f":"IF('3'!$D32>0,1,0)","v":1},{"$f":"IF('4'!$D32>0,1,0)","v":1},{"$f":"IF('5'!$D32>0,1,0)","v":1},{"$f":"IF('6'!$D32>0,1,0)","v":0},5,{"$f":"IF('7'!$D32>0,1,0)","v":1},{"$f":"IF('8'!$D32>0,1,0)","v":1},{"$f":"IF('9'!$D32>0,1,0)","v":0},{"$f":"IF('10'!$D32>0,1,0)","v":0},{"$f":"IF('11'!$D32>0,1,0)","v":0},{"$f":"IF('12'!$D32>0,1,0)","v":0},2,7]
["Kohnen Saskia",{"$f":"IF('Wettkampf 1'!D33>0,1,0)","v":1},{"$f":"IF('2'!$D33>0,1,0)","v":1},{"$f":"IF('3'!$D33>0,1,0)","v":1},{"$f":"IF('4'!$D33>0,1,0)","v":1},{"$f":"IF('5'!$D33>0,1,0)","v":1},{"$f":"IF('6'!$D33>0,1,0)","v":0},5,{"$f":"IF('7'!$D33>0,1,0)","v":1},{"$f":"IF('8'!$D33>0,1,0)","v":1},{"$f":"IF('9'!$D33>0,1,0)","v":0},{"$f":"IF('10'!$D33>0,1,0)","v":0},{"$f":"IF('11'!$D33>0,1,0)","v":0},{"$f":"IF('12'!$D33>0,1,0)","v":0},2,7]
["Schütze 19",{"$f":"IF('Wettkampf 1'!D34>0,1,0)","v":0},{"$f":"IF('2'!$D34>0,1,0)","v":0},{"$f":"IF('3'!$D34>0,1,0)","v":0},{"$f":"IF('4'!$D34>0,1,0)","v":0},{"$f":"IF('5'!$D34>0,1,0)","v":0},{"$f":"IF('6'!$D34>0,1,0)","v":0},0,{"$f":"IF('7'!$D34>0,1,0)","v":0},{"$f":"IF('8'!$D34>0,1,0)","v":0},{"$f":"IF('9'!$D34>0,1,0)","v":0},{"$f":"IF('10'!$D34>0,1,0)","v":0},{"$f":"IF('11'!$D34>0,1,0)","v":0},{"$f":"IF('12'!$D34>0,1,0)","v":0},0,0]
["Schütze 20",{"$f":"IF('Wettkampf 1'!D35>0,1,0)","v":0},{"$f":"IF('2'!$D35>0,1,0)","v":0},{"$f":"IF('3'!$D35>0,1,0)","v":0},{"$f":"IF('4'!$D35>0,1,0)","v":0},{"$f":"IF('5'!$D35>0,1,0)","v":0},{"$f":"IF('6'!$D35>0,1,0)","v":0},0,{"$f":"IF('7'!$D35>0,1,0)","v":0},{"$f":"IF('8'!$D35>0,1,0)","v":0},{"$f":"IF('9'!$D35>0,1,0)","v":0},{"$f":"IF('10'!$D35>0,1,0)","v":0},{"$f":"IF('11'!$D35>0,1,0)","v":0},{"$f":"IF('12'!$D35>0,1,0)","v":0},0,0]
["Runde Marcel",{"$f":"IF('Wettkampf 1'!D36>0,1,0)","v":1},{"$f":"IF('2'!$D36>0,1,0)","v":0},{"$f":"IF('3'!$D36>0,1,0)","v":1},{"$f":"IF('4'!$D36>0,1,0)","v":1},{"$f":"IF('5'!$D36>0,1,0)","v":1},{"$f":"IF('6'!$D36>0,1,0)","v":0},4,{"$f":"IF('7'!$D36>0,1,0)","v":1},{"$f":"IF('8'!$D36>0,1,0)","v":1},{"$f":"IF('9'!$D36>0,1,0)","v":0},{"$f":"IF('10'!$D36>0,1,0)","v":0},{"$f":"IF('11'!$D36>0,1,0)","v":0},{"$f":"IF('12'!$D36>0,1,0)","v":0},2,6]
["Leis Fynn Lucas ",{"$f":"IF('Wettkampf 1'!D37>0,1,0)","v":1},{"$f":"IF('2'!$D37>0,1,0)","v":0},{"$f":"IF('3'!$D37>0,1,0)","v":0},{"$f":"IF('4'!$D37>0,1,0)","v":0},{"$f":"IF('5'!$D37>0,1,0)","v":0},{"$f":"IF('6'!$D37>0,1,0)","v":0},1,{"$f":"IF('7'!$D37>0,1,0)","v":0},{"$f":"IF('8'!$D37>0,1,0)","v":0},{"$f":"IF('9'!$D37>0,1,0)","v":0},{"$f":"IF('10'!$D37>0,1,0)","v":0},{"$f":"IF('11'!$D37>0,1,0)","v":0},{"$f":"IF('12'!$D37>0,1,0)","v":0},0,1]
["Jansen Lars",{"$f":"IF('Wettkampf 1'!D38>0,1,0)","v":1},{"$f":"IF('2'!$D38>0,1,0)","v":1},{"$f":"IF('3'!$D38>0,1,0)","v":0},{"$f":"IF('4'!$D38>0,1,0)","v":1},{"$f":"IF('5'!$D38>0,1,0)","v":1},{"$f":"IF('6'!$D38>0,1,0)","v":0},4,{"$f":"IF('7'!$D38>0,1,0)","v":0},{"$f":"IF('8'!$D38>0,1,0)","v":0},{"$f":"IF('9'!$D38>0,1,0)","v":0},{"$f":"IF('10'!$D38>0,1,0)","v":0},{"$f":"IF('11'!$D38>0,1,0)","v":0},{"$f":"IF('12'!$D38>0,1,0)","v":0},0,4]
["Köster Thilo",{"$f":"IF('Wettkampf 1'!D39>0,1,0)","v":0},{"$f":"IF('2'!$D39>0,1,0)","v":0},{"$f":"IF('3'!$D39>0,1,0)","v":0},{"$f":"IF('4'!$D39>0,1,0)","v":1},{"$f":"IF('5'!$D39>0,1,0)","v":1},{"$f":"IF('6'!$D39>0,1,0)","v":0},2,{"$f":"IF('7'!$D39>0,1,0)","v":0},{"$f":"IF('8'!$D39>0,1,0)","v":0},{"$f":"IF('9'!$D39>0,1,0)","v":0},{"$f":"IF('10'!$D39>0,1,0)","v":0},{"$f":"IF('11'!$D39>0,1,0)","v":0},{"$f":"IF('12'!$D39>0,1,0)","v":0},0,2]
["Schütze 25",{"$f":"IF('Wettkampf 1'!D40>0,1,0)","v":0},{"$f":"IF('2'!$D40>0,1,0)","v":0},{"$f":"IF('3'!$D40>0,1,0)","v":0},{"$f":"IF('4'!$D40>0,1,0)","v":0},{"$f":"IF('5'!$D40>0,1,0)","v":0},{"$f":"IF('6'!$D40>0,1,0)","v":0},0,{"$f":"IF('7'!$D40>0,1,0)","v":0},{"$f":"IF('8'!$D40>0,1,0)","v":0},{"$f":"IF('9'!$D40>0,1,0)","v":0},{"$f":"IF('10'!$D40>0,1,0)","v":0},{"$f":"IF('11'!$D40>0,1,0)","v":0},{"$f":"IF('12'!$D40>0,1,0)","v":0},0,0]
["Dolling Leon",{"$f":"IF('Wettkampf 1'!D41>0,1,0)","v":1},{"$f":"IF('2'!$D41>0,1,0)","v":0},{"$f":"IF('3'!$D41>0,1,0)","v":0},{"$f":"IF('4'!$D41>0,1,0)","v":1},{"$f":"IF('5'!$D41>0,1,0)","v":0},{"$f":"IF('6'!$D41>0,1,0)","v":0},2,{"$f":"IF('7'!$D41>0,1,0)","v":0},{"$f":"IF('8'!$D41>0,1,0)","v":0},{"$f":"IF('9'!$D41>0,1,0)","v":0},{"$f":"IF('10'!$D41>0,1,0)","v":0},{"$f":"IF('11'!$D41>0,1,0)","v":0},{"$f":"IF('12'!$D41>0,1,0)","v":0},0,2]
["Schütze 27",{"$f":"IF('Wettkampf 1'!D42>0,1,0)","v":0},{"$f":"IF('2'!$D42>0,1,0)","v":0},{"$f":"IF('3'!$D42>0,1,0)","v":0},{"$f":"IF('4'!$D42>0,1,0)","v":0},{"$f":"IF('5'!$D42>0,1,0)","v":0},{"$f":"IF('6'!$D42>0,1,0)","v":0},0,{"$f":"IF('7'!$D42>0,1,0)","v":0},{"$f":"IF('8'!$D42>0,1,0)","v":0},{"$f":"IF('9'!$D42>0,1,0)","v":0},{"$f":"IF('10'!$D42>0,1,0)","v":0},{"$f":"IF('11'!$D42>0,1,0)","v":0},{"$f":"IF('12'!$D42>0,1,0)","v":0},0,0]
["Schütze 28",{"$f":"IF('Wettkampf 1'!D43>0,1,0)","v":0},{"$f":"IF('2'!$D43>0,1,0)","v":0},{"$f":"IF('3'!$D43>0,1,0)","v":0},{"$f":"IF('4'!$D43>0,1,0)","v":0},{"$f":"IF('5'!$D43>0,1,0)","v":0},{"$f":"IF('6'!$D43>0,1,0)","v":0},0,{"$f":"IF('7'!$D43>0,1,0)","v":0},{"$f":"IF('8'!$D43>0,1,0)","v":0},{"$f":"IF('9'!$D43>0,1,0)","v":0},{"$f":"IF('10'!$D43>0,1,0)","v":0},{"$f":"IF('11'!$D43>0,1,0)","v":0},{"$f":"IF('12'!$D43>0,1,0)","v":0},0,0]
["Schütze 29",{"$f":"IF('Wettkampf 1'!D44>0,1,0)","v":0},{"$f":"IF('2'!$D44>0,1,0)","v":0},{"$f":"IF('3'!$D44>0,1,0)","v":0},{"$f":"IF('4'!$D44>0,1,0)","v":0},{"$f":"IF('5'!$D44>0,1,0)","v":0},{"$f":"IF('6'!$D44>0,1,0)","v":0},0,{"$f":"IF('7'!$D44>0,1,0)","v":0},{"$f":"IF('8'!$D44>0,1,0)","v":0},{"$f":"IF('9'!$D44>0,1,0)","v":0},{"$f":"IF('10'!$D44>0,1,0)","v":0},{"$f":"IF('11'!$D44>0,1,0)","v":0},{"$f":"IF('12'!$D44>0,1,0)","v":0},0,0]
["Schütze 30",{"$f":"IF('Wettkampf 1'!D45>0,1,0)","v":0},{"$f":"IF('2'!$D45>0,1,0)","v":0},{"$f":"IF('3'!$D45>0,1,0)","v":0},{"$f":"IF('4'!$D45>0,1,0)","v":0},{"$f":"IF('5'!$D45>0,1,0)","v":0},{"$f":"IF('6'!$D45>0,1,0)","v":0},0,{"$f":"IF('7'!$D45>0,1,0)","v":0},{"$f":"IF('8'!$D45>0,1,0)","v":0},{"$f":"IF('9'!$D45>0,1,0)","v":0},{"$f":"IF('10'!$D45>0,1,0)","v":0},{"$f":"IF('11'!$D45>0,1,0)","v":0},{"$f":"IF('12'!$D45>0,1,0)","v":0},0,0]
["Wilken Noah",{"$f":"IF('Wettkampf 1'!D46>0,1,0)","v":1},{"$f":"IF('2'!$D46>0,1,0)","v":1},{"$f":"IF('3'!$D46>0,1,0)","v":1},{"$f":"IF('4'!$D46>0,1,0)","v":1},{"$f":"IF('5'!$D46>0,1,0)","v":1},{"$f":"IF('6'!$D46>0,1,0)","v":0},5,{"$f":"IF('7'!$D46>0,1,0)","v":1},{"$f":"IF('8'!$D46>0,1,0)","v":1},{"$f":"IF('9'!$D46>0,1,0)","v":0},{"$f":"IF('10'!$D46>0,1,0)","v":0},{"$f":"IF('11'!$D46>0,1,0)","v":0},{"$f":"IF('12'!$D46>0,1,0)","v":0},2,{"$f":"O45+H45","v":7}]
["Schulz Mika",{"$f":"IF('Wettkampf 1'!D47>0,1,0)","v":0},{"$f":"IF('2'!$D47>0,1,0)","v":1},{"$f":"IF('3'!$D47>0,1,0)","v":1},{"$f":"IF('4'!$D47>0,1,0)","v":1},{"$f":"IF('5'!$D47>0,1,0)","v":0},{"$f":"IF('6'!$D47>0,1,0)","v":0},3,{"$f":"IF('7'!$D47>0,1,0)","v":1},{"$f":"IF('8'!$D47>0,1,0)","v":1},{"$f":"IF('9'!$D47>0,1,0)","v":0},{"$f":"IF('10'!$D47>0,1,0)","v":0},{"$f":"IF('11'!$D47>0,1,0)","v":0},{"$f":"IF('12'!$D47>0,1,0)","v":0},2,5]
["Schütze 33",{"$f":"IF('Wettkampf 1'!D48>0,1,0)","v":0},{"$f":"IF('2'!$D48>0,1,0)","v":0},{"$f":"IF('3'!$D48>0,1,0)","v":0},{"$f":"IF('4'!$D48>0,1,0)","v":0},{"$f":"IF('5'!$D48>0,1,0)","v":0},{"$f":"IF('6'!$D48>0,1,0)","v":0},0,{"$f":"IF('7'!$D48>0,1,0)","v":0},{"$f":"IF('8'!$D48>0,1,0)","v":0},{"$f":"IF('9'!$D48>0,1,0)","v":0},{"$f":"IF('10'!$D48>0,1,0)","v":0},{"$f":"IF('11'!$D48>0,1,0)","v":0},{"$f":"IF('12'!$D48>0,1,0)","v":0},0,0]
["Schütze 34",{"$f":"IF('Wettkampf 1'!D49>0,1,0)","v":0},{"$f":"IF('2'!$D49>0,1,0)","v":0},{"$f":"IF('3'!$D49>0,1,0)","v":0},{"$f":"IF('4'!$D49>0,1,0)","v":0},{"$f":"IF('5'!$D49>0,1,0)","v":0},{"$f":"IF('6'!$D49>0,1,0)","v":0},0,{"$f":"IF('7'!$D49>0,1,0)","v":0},{"$f":"IF('8'!$D49>0,1,0)","v":0},{"$f":"IF('9'!$D49>0,1,0)","v":0},{"$f":"IF('10'!$D49>0,1,0)","v":0},{"$f":"IF('11'!$D49>0,1,0)","v":0},{"$f":"IF('12'!$D49>0,1,0)","v":0},0,0]
["Schütze 35",{"$f":"IF('Wettkampf 1'!D50>0,1,0)","v":0},{"$f":"IF('2'!$D50>0,1,0)","v":0},{"$f":"IF('3'!$D50>0,1,0)","v":0},{"$f":"IF('4'!$D50>0,1,0)","v":0},{"$f":"IF('5'!$D50>0,1,0)","v":0},{"$f":"IF('6'!$D50>0,1,0)","v":0},0,{"$f":"IF('7'!$D50>0,1,0)","v":0},{"$f":"IF('8'!$D50>0,1,0)","v":0},{"$f":"IF('9'!$D50>0,1,0)","v":0},{"$f":"IF('10'!$D50>0,1,0)","v":0},{"$f":"IF('11'!$D50>0,1,0)","v":0},{"$f":"IF('12'!$D50>0,1,0)","v":0},0,0]
["Tharner Kim",{"$f":"IF('Wettkampf 1'!D51>0,1,0)","v":0},{"$f":"IF('2'!$D51>0,1,0)","v":0},{"$f":"IF('3'!$D51>0,1,0)","v":0},{"$f":"IF('4'!$D51>0,1,0)","v":1},{"$f":"IF('5'!$D51>0,1,0)","v":0},{"$f":"IF('6'!$D51>0,1,0)","v":0},1,{"$f":"IF('7'!$D51>0,1,0)","v":0},{"$f":"IF('8'!$D51>0,1,0)","v":0},{"$f":"IF('9'!$D51>0,1,0)","v":0},{"$f":"IF('10'!$D51>0,1,0)","v":0},{"$f":"IF('11'!$D51>0,1,0)","v":0},{"$f":"IF('12'!$D51>0,1,0)","v":0},0,1]
["Schütze 37",{"$f":"IF('Wettkampf 1'!D52>0,1,0)","v":0},{"$f":"IF('2'!$D52>0,1,0)","v":0},{"$f":"IF('3'!$D52>0,1,0)","v":0},{"$f":"IF('4'!$D52>0,1,0)","v":0},{"$f":"IF('5'!$D52>0,1,0)","v":0},{"$f":"IF('6'!$D52>0,1,0)","v":0},0,{"$f":"IF('7'!$D52>0,1,0)","v":0},{"$f":"IF('8'!$D52>0,1,0)","v":0},{"$f":"IF('9'!$D52>0,1,0)","v":0},{"$f":"IF('10'!$D52>0,1,0)","v":0},{"$f":"IF('11'!$D52>0,1,0)","v":0},{"$f":"IF('12'!$D52>0,1,0)","v":0},0,0]
["Schütze 38",{"$f":"IF('Wettkampf 1'!D53>0,1,0)","v":0},{"$f":"IF('2'!$D53>0,1,0)","v":0},{"$f":"IF('3'!$D53>0,1,0)","v":0},{"$f":"IF('4'!$D53>0,1,0)","v":0},{"$f":"IF('5'!$D53>0,1,0)","v":0},{"$f":"IF('6'!$D53>0,1,0)","v":0},0,{"$f":"IF('7'!$D53>0,1,0)","v":0},{"$f":"IF('8'!$D53>0,1,0)","v":0},{"$f":"IF('9'!$D53>0,1,0)","v":0},{"$f":"IF('10'!$D53>0,1,0)","v":0},{"$f":"IF('11'!$D53>0,1,0)","v":0},{"$f":"IF('12'!$D53>0,1,0)","v":0},0,0]
["Schütze 39",{"$f":"IF('Wettkampf 1'!D54>0,1,0)","v":0},{"$f":"IF('2'!$D54>0,1,0)","v":0},{"$f":"IF('3'!$D54>0,1,0)","v":0},{"$f":"IF('4'!$D54>0,1,0)","v":0},{"$f":"IF('5'!$D54>0,1,0)","v":0},{"$f":"IF('6'!$D54>0,1,0)","v":0},0,{"$f":"IF('7'!$D54>0,1,0)","v":0},{"$f":"IF('8'!$D54>0,1,0)","v":0},{"$f":"IF('9'!$D54>0,1,0)","v":0},{"$f":"IF('10'!$D54>0,1,0)","v":0},{"$f":"IF('11'!$D54>0,1,0)","v":0},{"$f":"IF('12'!$D54>0,1,0)","v":0},0,0]
["Schütze 40",{"$f":"IF('Wettkampf 1'!D55>0,1,0)","v":0},{"$f":"IF('2'!$D55>0,1,0)","v":0},{"$f":"IF('3'!$D55>0,1,0)","v":0},{"$f":"IF('4'!$D55>0,1,0)","v":0},{"$f":"IF('5'!$D55>0,1,0)","v":0},{"$f":"IF('6'!$D55>0,1,0)","v":0},0,{"$f":"IF('7'!$D55>0,1,0)","v":0},{"$f":"IF('8'!$D55>0,1,0)","v":0},{"$f":"IF('9'!$D55>0,1,0)","v":0},{"$f":"IF('10'!$D55>0,1,0)","v":0},{"$f":"IF('11'!$D55>0,1,0)","v":0},{"$f":"IF('12'!$D55>0,1,0)","v":0},0,0]
["Schütze 41",{"$f":"IF('Wettkampf 1'!D56>0,1,0)","v":0},{"$f":"IF('2'!$D56>0,1,0)","v":0},{"$f":"IF('3'!$D56>0,1,0)","v":0},{"$f":"IF('4'!$D56>0,1,0)","v":0},{"$f":"IF('5'!$D56>0,1,0)","v":0},{"$f":"IF('6'!$D56>0,1,0)","v":0},0,{"$f":"IF('7'!$D56>0,1,0)","v":0},{"$f":"IF('8'!$D56>0,1,0)","v":0},{"$f":"IF('9'!$D56>0,1,0)","v":0},{"$f":"IF('10'!$D56>0,1,0)","v":0},{"$f":"IF('11'!$D56>0,1,0)","v":0},{"$f":"IF('12'!$D56>0,1,0)","v":0},0,0]
["Schütze 42",{"$f":"IF('Wettkampf 1'!D57>0,1,0)","v":0},{"$f":"IF('2'!$D57>0,1,0)","v":0},{"$f":"IF('3'!$D57>0,1,0)","v":0},{"$f":"IF('4'!$D57>0,1,0)","v":0},{"$f":"IF('5'!$D57>0,1,0)","v":0},{"$f":"IF('6'!$D57>0,1,0)","v":0},0,{"$f":"IF('7'!$D57>0,1,0)","v":0},{"$f":"IF('8'!$D57>0,1,0)","v":0},{"$f":"IF('9'!$D57>0,1,0)","v":0},{"$f":"IF('10'!$D57>0,1,0)","v":0},{"$f":"IF('11'!$D57>0,1,0)","v":0},{"$f":"IF('12'!$D57>0,1,0)","v":0},0,0]
["Schütze 43",{"$f":"IF('Wettkampf 1'!D58>0,1,0)","v":0},{"$f":"IF('2'!$D58>0,1,0)","v":0},{"$f":"IF('3'!$D58>0,1,0)","v":0},{"$f":"IF('4'!$D58>0,1,0)","v":0},{"$f":"IF('5'!$D58>0,1,0)","v":0},{"$f":"IF('6'!$D58>0,1,0)","v":0},0,{"$f":"IF('7'!$D58>0,1,0)","v":0},{"$f":"IF('8'!$D58>0,1,0)","v":0},{"$f":"IF('9'!$D58>0,1,0)","v":0},{"$f":"IF('10'!$D58>0,1,0)","v":0},{"$f":"IF('11'!$D58>0,1,0)","v":0},{"$f":"IF('12'!$D58>0,1,0)","v":0},0,0]
["Schütze 44",{"$f":"IF('Wettkampf 1'!D59>0,1,0)","v":0},{"$f":"IF('2'!$D59>0,1,0)","v":0},{"$f":"IF('3'!$D59>0,1,0)","v":0},{"$f":"IF('4'!$D59>0,1,0)","v":0},{"$f":"IF('5'!$D59>0,1,0)","v":0},{"$f":"IF('6'!$D59>0,1,0)","v":0},0,{"$f":"IF('7'!$D59>0,1,0)","v":0},{"$f":"IF('8'!$D59>0,1,0)","v":0},{"$f":"IF('9'!$D59>0,1,0)","v":0},{"$f":"IF('10'!$D59>0,1,0)","v":0},{"$f":"IF('11'!$D59>0,1,0)","v":0},{"$f":"IF('12'!$D59>0,1,0)","v":0},0,0]
["Schütze 45",{"$f":"IF('Wettkampf 1'!D60>0,1,0)","v":0},{"$f":"IF('2'!$D60>0,1,0)","v":0},{"$f":"IF('3'!$D60>0,1,0)","v":0},{"$f":"IF('4'!$D60>0,1,0)","v":0},{"$f":"IF('5'!$D60>0,1,0)","v":0},{"$f":"IF('6'!$D60>0,1,0)","v":0},0,{"$f":"IF('7'!$D60>0,1,0)","v":0},{"$f":"IF('8'!$D60>0,1,0)","v":0},{"$f":"IF('9'!$D60>0,1,0)","v":0},{"$f":"IF('10'!$D60>0,1,0)","v":0},{"$f":"IF('11'!$D60>0,1,0)","v":0},{"$f":"IF('12'!$D60>0,1,0)","v":0},0,0]
["Schütze 46",{"$f":"IF('Wettkampf 1'!D61>0,1,0)","v":0},{"$f":"IF('2'!$D61>0,1,0)","v":0},{"$f":"IF('3'!$D61>0,1,0)","v":0},{"$f":"IF('4'!$D61>0,1,0)","v":0},{"$f":"IF('5'!$D61>0,1,0)","v":0},{"$f":"IF('6'!$D61>0,1,0)","v":0},0,{"$f":"IF('7'!$D61>0,1,0)","v":0},{"$f":"IF('8'!$D61>0,1,0)","v":0},{"$f":"IF('9'!$D61>0,1,0)","v":0},{"$f":"IF('10'!$D61>0,1,0)","v":0},{"$f":"IF('11'!$D61>0,1,0)","v":0},{"$f":"IF('12'!$D61>0,1,0)","v":0},0,0]
["Schütze 47",{"$f":"IF('Wettkampf 1'!D62>0,1,0)","v":0},{"$f":"IF('2'!$D62>0,1,0)","v":0},{"$f":"IF('3'!$D62>0,1,0)","v":0},{"$f":"IF('4'!$D62>0,1,0)","v":0},{"$f":"IF('5'!$D62>0,1,0)","v":0},{"$f":"IF('6'!$D62>0,1,0)","v":0},0,{"$f":"IF('7'!$D62>0,1,0)","v":0},{"$f":"IF('8'!$D62>0,1,0)","v":0},{"$f":"IF('9'!$D62>0,1,0)","v":0},{"$f":"IF('10'!$D62>0,1,0)","v":0},{"$f":"IF('11'!$D62>0,1,0)","v":0},{"$f":"IF('12'!$D62>0,1,0)","v":0},0,0]
["Schütze 48",{"$f":"IF('Wettkampf 1'!D63>0,1,0)","v":0},{"$f":"IF('2'!$D63>0,1,0)","v":0},{"$f":"IF('3'!$D63>0,1,0)","v":0},{"$f":"IF('4'!$D63>0,1,0)","v":0},{"$f":"IF('5'!$D63>0,1,0)","v":0},{"$f":"IF('6'!$D63>0,1,0)","v":0},0,{"$f":"IF('7'!$D63>0,1,0)","v":0},{"$f":"IF('8'!$D63>0,1,0)","v":0},{"$f":"IF('9'!$D63>0,1,0)","v":0},{"$f":"IF('10'!$D63>0,1,0)","v":0},{"$f":"IF('11'!$D63>0,1,0)","v":0},{"$f":"IF('12'!$D63>0,1,0)","v":0},0,0]
["Schütze 49",{"$f":"IF('Wettkampf 1'!D64>0,1,0)","v":0},{"$f":"IF('2'!$D64>0,1,0)","v":0},{"$f":"IF('3'!$D64>0,1,0)","v":0},{"$f":"IF('4'!$D64>0,1,0)","v":0},{"$f":"IF('5'!$D64>0,1,0)","v":0},{"$f":"IF('6'!$D64>0,1,0)","v":0},0,{"$f":"IF('7'!$D64>0,1,0)","v":0},{"$f":"IF('8'!$D64>0,1,0)","v":0},{"$f":"IF('9'!$D64>0,1,0)","v":0},{"$f":"IF('10'!$D64>0,1,0)","v":0},{"$f":"IF('11'!$D64>0,1,0)","v":0},{"$f":"IF('12'!$D64>0,1,0)","v":0},0,0]
["Schütze 50",{"$f":"IF('Wettkampf 1'!D65>0,1,0)","v":0},{"$f":"IF('2'!$D65>0,1,0)","v":0},{"$f":"IF('3'!$D65>0,1,0)","v":0},{"$f":"IF('4'!$D65>0,1,0)","v":0},{"$f":"IF('5'!$D65>0,1,0)","v":0},{"$f":"IF('6'!$D65>0,1,0)","v":0},0,{"$f":"IF('7'!$D65>0,1,0)","v":0},{"$f":"IF('8'!$D65>0,1,0)","v":0},{"$f":"IF('9'!$D65>0,1,0)","v":0},{"$f":"IF('10'!$D65>0,1,0)","v":0},{"$f":"IF('11'!$D65>0,1,0)","v":0},{"$f":"IF('12'!$D65>0,1,0)","v":0},0,0]
["Schütze 51",{"$f":"IF('Wettkampf 1'!D66>0,1,0)","v":0},{"$f":"IF('2'!$D66>0,1,0)","v":0},{"$f":"IF('3'!$D66>0,1,0)","v":0},{"$f":"IF('4'!$D66>0,1,0)","v":0},{"$f":"IF('5'!$D66>0,1,0)","v":0},{"$f":"IF('6'!$D66>0,1,0)","v":0},0,{"$f":"IF('7'!$D66>0,1,0)","v":0},{"$f":"IF('8'!$D66>0,1,0)","v":0},{"$f":"IF('9'!$D66>0,1,0)","v":0},{"$f":"IF('10'!$D66>0,1,0)","v":0},{"$f":"IF('11'!$D66>0,1,0)","v":0},{"$f":"IF('12'!$D66>0,1,0)","v":0},0,0]
["Schütze 52",{"$f":"IF('Wettkampf 1'!D67>0,1,0)","v":0},{"$f":"IF('2'!$D67>0,1,0)","v":0},{"$f":"IF('3'!$D67>0,1,0)","v":0},{"$f":"IF('4'!$D67>0,1,0)","v":0},{"$f":"IF('5'!$D67>0,1,0)","v":0},{"$f":"IF('6'!$D67>0,1,0)","v":0},0,{"$f":"IF('7'!$D67>0,1,0)","v":0},{"$f":"IF('8'!$D67>0,1,0)","v":0},{"$f":"IF('9'!$D67>0,1,0)","v":0},{"$f":"IF('10'!$D67>0,1,0)","v":0},{"$f":"IF('11'!$D67>0,1,0)","v":0},{"$f":"IF('12'!$D67>0,1,0)","v":0},0,0]
["Schütze 53",{"$f":"IF('Wettkampf 1'!D68>0,1,0)","v":0},{"$f":"IF('2'!$D68>0,1,0)","v":0},{"$f":"IF('3'!$D68>0,1,0)","v":0},{"$f":"IF('4'!$D68>0,1,0)","v":0},{"$f":"IF('5'!$D68>0,1,0)","v":0},{"$f":"IF('6'!$D68>0,1,0)","v":0},{"$f":"SUM(B67:G67)","v":0},{"$f":"IF('7'!$D68>0,1,0)","v":0},{"$f":"IF('8'!$D68>0,1,0)","v":0},{"$f":"IF('9'!$D68>0,1,0)","v":0},{"$f":"IF('10'!$D68>0,1,0)","v":0},{"$f":"IF('11'!$D68>0,1,0)","v":0},{"$f":"IF('12'!$D68>0,1,0)","v":0},{"$f":"SUM(I67:N67)","v":0},0]
["Schütze 54",{"$f":"IF('Wettkampf 1'!D69>0,1,0)","v":0},{"$f":"IF('2'!$D69>0,1,0)","v":0},{"$f":"IF('3'!$D69>0,1,0)","v":0},{"$f":"IF('4'!$D69>0,1,0)","v":0},{"$f":"IF('5'!$D69>0,1,0)","v":0},{"$f":"IF('6'!$D69>0,1,0)","v":0},0,{"$f":"IF('7'!$D69>0,1,0)","v":0},{"$f":"IF('8'!$D69>0,1,0)","v":0},{"$f":"IF('9'!$D69>0,1,0)","v":0},{"$f":"IF('10'!$D69>0,1,0)","v":0},{"$f":"IF('11'!$D69>0,1,0)","v":0},{"$f":"IF('12'!$D69>0,1,0)","v":0},0,0]
["Schütze 55",{"$f":"IF('Wettkampf 1'!D70>0,1,0)","v":0},{"$f":"IF('2'!$D70>0,1,0)","v":0},{"$f":"IF('3'!$D70>0,1,0)","v":0},{"$f":"IF('4'!$D70>0,1,0)","v":0},{"$f":"IF('5'!$D70>0,1,0)","v":0},{"$f":"IF('6'!$D70>0,1,0)","v":0},0,{"$f":"IF('7'!$D70>0,1,0)","v":0},{"$f":"IF('8'!$D70>0,1,0)","v":0},{"$f":"IF('9'!$D70>0,1,0)","v":0},{"$f":"IF('10'!$D70>0,1,0)","v":0},{"$f":"IF('11'!$D70>0,1,0)","v":0},{"$f":"IF('12'!$D70>0,1,0)","v":0},0,0]
["Schütze 56",{"$f":"IF('Wettkampf 1'!D71>0,1,0)","v":0},{"$f":"IF('2'!$D71>0,1,0)","v":0},{"$f":"IF('3'!$D71>0,1,0)","v":0},{"$f":"IF('4'!$D71>0,1,0)","v":0},{"$f":"IF('5'!$D71>0,1,0)","v":0},{"$f":"IF('6'!$D71>0,1,0)","v":0},0,{"$f":"IF('7'!$D71>0,1,0)","v":0},{"$f":"IF('8'!$D71>0,1,0)","v":0},{"$f":"IF('9'!$D71>0,1,0)","v":0},{"$f":"IF('10'!$D71>0,1,0)","v":0},{"$f":"IF('11'!$D71>0,1,0)","v":0},{"$f":"IF('12'!$D71>0,1,0)","v":0},0,0]
["Schütze 57",{"$f":"IF('Wettkampf 1'!D72>0,1,0)","v":0},{"$f":"IF('2'!$D72>0,1,0)","v":0},{"$f":"IF('3'!$D72>0,1,0)","v":0},{"$f":"IF('4'!$D72>0,1,0)","v":0},{"$f":"IF('5'!$D72>0,1,0)","v":0},{"$f":"IF('6'!$D72>0,1,0)","v":0},0,{"$f":"IF('7'!$D72>0,1,0)","v":0},{"$f":"IF('8'!$D72>0,1,0)","v":0},{"$f":"IF('9'!$D72>0,1,0)","v":0},{"$f":"IF('10'!$D72>0,1,0)","v":0},{"$f":"IF('11'!$D72>0,1,0)","v":0},{"$f":"IF('12'!$D72>0,1,0)","v":0},0,0]
["Schütze 58",{"$f":"IF('Wettkampf 1'!D73>0,1,0)","v":0},{"$f":"IF('2'!$D73>0,1,0)","v":0},{"$f":"IF('3'!$D73>0,1,0)","v":0},{"$f":"IF('4'!$D73>0,1,0)","v":0},{"$f":"IF('5'!$D73>0,1,0)","v":0},{"$f":"IF('6'!$D73>0,1,0)","v":0},0,{"$f":"IF('7'!$D73>0,1,0)","v":0},{"$f":"IF('8'!$D73>0,1,0)","v":0},{"$f":"IF('9'!$D73>0,1,0)","v":0},{"$f":"IF('10'!$D73>0,1,0)","v":0},{"$f":"IF('11'!$D73>0,1,0)","v":0},{"$f":"IF('12'!$D73>0,1,0)","v":0},0,0]
["Schütze 59",{"$f":"IF('Wettkampf 1'!D74>0,1,0)","v":0},{"$f":"IF('2'!$D74>0,1,0)","v":0},{"$f":"IF('3'!$D74>0,1,0)","v":0},{"$f":"IF('4'!$D74>0,1,0)","v":0},{"$f":"IF('5'!$D74>0,1,0)","v":0},{"$f":"IF('6'!$D74>0,1,0)","v":0},0,{"$f":"IF('7'!$D74>0,1,0)","v":0},{"$f":"IF('8'!$D74>0,1,0)","v":0},{"$f":"IF('9'!$D74>0,1,0)","v":0},{"$f":"IF('10'!$D74>0,1,0)","v":0},{"$f":"IF('11'!$D74>0,1,0)","v":0},{"$f":"IF('12'!$D74>0,1,0)","v":0},0,0]
["Schütze 60",{"$f":"IF('Wettkampf 1'!D75>0,1,0)","v":0},{"$f":"IF('2'!$D75>0,1,0)","v":0},{"$f":"IF('3'!$D75>0,1,0)","v":0},{"$f":"IF('4'!$D75>0,1,0)","v":0},{"$f":"IF('5'!$D75>0,1,0)","v":0},{"$f":"IF('6'!$D75>0,1,0)","v":0},0,{"$f":"IF('7'!$D75>0,1,0)","v":0},{"$f":"IF('8'!$D75>0,1,0)","v":0},{"$f":"IF('9'!$D75>0,1,0)","v":0},{"$f":"IF('10'!$D75>0,1,0)","v":0},{"$f":"IF('11'!$D75>0,1,0)","v":0},{"$f":"IF('12'!$D75>0,1,0)","v":0},0,0]
[null,{"$f":"SUM(B15:B74)","v":{"v":15,"d":"15.00"}},{"$f":"SUM(C15:C74)","v":{"v":10,"d":"10.00"}},{"v":12,"d":"12.00"},{"v":19,"d":"19.00"},{"v":11,"d":"11.00"},{"v":0,"d":"0.00"},{"$f":"SUM(H15:H74)","v":{"v":67,"d":"67.00"}},{"$f":"SUM(I15:I74)","v":{"v":12,"d":"12.00"}},{"$f":"SUM(J15:J74)","v":{"v":11,"d":"11.00"}},{"$f":"SUM(K15:K74)","v":{"v":0,"d":"0.00"}},{"$f":"SUM(L15:L74)","v":{"v":0,"d":"0.00"}},{"$f":"SUM(M15:M74)","v":{"v":0,"d":"0.00"}},{"$f":"SUM(N15:N74)","v":{"v":0,"d":"0.00"}},{"$f":"SUM(O15:O74)","v":{"v":23,"d":"23.00"}},{"$f":"SUM(P15:P74)","v":{"v":90,"d":"90.00"}}]

{"sheet":"Übersicht Gruppen","index":17,"n_rows":13,"n_cols":20,"rows_kept":13,"hidden":true}
[]
[null,"Lähden Jugend I",{"$f":"VLOOKUP($B$2:$B$13,'Wettkampf 1'!$B$2:$D$13,3,FALSE)","v":{"v":1059.8000000000002,"d":"1,059.8"}},{"$f":"VLOOKUP($B$2:$B$13,'2'!$B$2:$D$19,3,FALSE)","v":741.5},{"$f":"VLOOKUP($B$2:$B$13,'3'!$B$2:$D$19,3,FALSE)","v":{"v":1080.1999999999998,"d":"1,080.2"}},{"$f":"VLOOKUP($B$2:$B$13,'4'!$B$2:$D$19,3,FALSE)","v":{"v":1132.2,"d":"1,132.2"}},{"$f":"VLOOKUP($B$2:$B$13,'5'!$B$2:$D$19,3,FALSE)","v":{"v":1120.3,"d":"1,120.3"}},{"$f":"VLOOKUP($B$2:$B$13,'6'!$B$2:$D$19,3,FALSE)","v":{"v":0,"d":"0.0"}},{"$f":"IF(Formelhilfe!H3 > 0,J2/Formelhilfe!H3,0)","v":{"v":1026.8,"d":"1,026.8"}},{"$f":"SUM(C2:H2)","v":{"v":5134,"d":"5,134.0"}},{"$f":"VLOOKUP($B$2:$B$13,'7'!$B$2:$D$19,3,FALSE)","v":{"v":1158.4,"d":"1,158.4"}},{"$f":"VLOOKUP($B$2:$B$13,'8'!$B$2:$D$19,3,FALSE)","v":{"v":1134.1999999999998,"d":"1,134.2"}},{"$f":"VLOOKUP($B$2:$B$13,'9'!$B$2:$D$19,3,FALSE)","v":{"v":0,"d":"0.0"}},{"$f":"VLOOKUP($B$2:$B$13,'10'!$B$2:$D$19,3,FALSE)","v":{"v":0,"d":"0.0"}},{"$f":"VLOOKUP($B$2:$B$13,'11'!$B$2:$D$19,3,FALSE)","v":{"v":0,"d":"0.0"}},{"$f":"VLOOKUP($B$2:$B$13,'12'!$B$2:$D$19,3,FALSE)","v":{"v":0,"d":"0.0"}},{"$f":"IF(Formelhilfe!O3>0,R2/Formelhilfe!O3,0)","v":{"v":1146.3,"d":"1,146.3"}},{"$f":"SUM(K2:P2)","v":{"v":2292.6,"d":"2,292.6"}},{"$f":"IF(Formelhilfe!P3>0,T2/Formelhilfe!P3,0)","v":{"v":1060.942857142857,"d":"1,060.9"}},{"$f":"SUM(C2:H2,K2:P2)","v":{"v":7426.599999999999,"d":"7,426.6"}}]
[null,"Börgermoor",{"$f":"VLOOKUP($B$2:$B$13,'Wettkampf 1'!$B$2:$D$13,3,FALSE)","v":955.5},{"$f":"VLOOKUP($B$2:$B$13,'2'!$B$2:$D$19,3,FALSE)","v":{"v":1003.7,"d":"1,003.7"}},{"$f":"VLOOKUP($B$2:$B$13,'3'!$B$2:$D$19,3,FALSE)","v":{"v":930.8000000000001,"d":"930.8"}},{"$f":"VLOOKUP($B$2:$B$13,'4'!$B$2:$D$19,3,FALSE)","v":{"v":1014.1000000000001,"d":"1,014.1"}},{"$f":"VLOOKUP($B$2:$B$13,'5'!$B$2:$D$19,3,FALSE)","v":{"v":1015.3,"d":"1,015.3"}},{"$f":"VLOOKUP($B$2:$B$13,'6'!$B$2:$D$19,3,FALSE)","v":{"v":0,"d":"0.0"}},{"$f":"IF(Formelhilfe!H5 > 0,J3/Formelhilfe!H5,0)","v":{"v":983.8800000000001,"d":"983.9"}},{"$f":"SUM(C3:H3)","v":{"v":4919.400000000001,"d":"4,919.4"}},{"$f":"VLOOKUP($B$2:$B$13,'7'!$B$2:$D$19,3,FALSE)","v":{"v":1018.5999999999999,"d":"1,018.6"}},{"$f":"VLOOKUP($B$2:$B$13,'8'!$B$2:$D$19,3,FALSE)","v":{"v":1010,"d":"1,010.0"}},{"$f":"VLOOKUP($B$2:$B$13,'9'!$B$2:$D$19,3,FALSE)","v":{"v":0,"d":"0.0"}},{"$f":"VLOOKUP($B$2:$B$13,'10'!$B$2:$D$19,3,FALSE)","v":{"v":0,"d":"0.0"}},{"$f":"VLOOKUP($B$2:$B$13,'11'!$B$2:$D$19,3,FALSE)","v":{"v":0,"d":"0.0"}},{"$f":"VLOOKUP($B$2:$B$13,'12'!$B$2:$D$19,3,FALSE)","v":{"v":0,"d":"0.0"}},{"$f":"IF(Formelhilfe!O5>0,R3/Formelhilfe!O5,0)","v":{"v":1014.3,"d":"1,014.3"}},{"$f":"SUM(K3:P3)","v":{"v":2028.6,"d":"2,028.6"}},{"$f":"IF(Formelhilfe!P5>0,T3/Formelhilfe!P5,0)","v":{"v":992.5714285714286,"d":"992.6"}},{"$f":"SUM(C3:H3,K3:P3)","v":{"v":6948,"d":"6,948.0"}}]
[null,"Spahnharrenstätte",{"$f":"VLOOKUP($B$2:$B$13,'Wettkampf 1'!$B$2:$D$13,3,FALSE)","v":613.5},{"$f":"VLOOKUP($B$2:$B$13,'2'!$B$2:$D$19,3,FALSE)","v":274.1},{"$f":"VLOOKUP($B$2:$B$13,'3'!$B$2:$D$19,3,FALSE)","v":307.4},{"$f":"VLOOKUP($B$2:$B$13,'4'!$B$2:$D$19,3,FALSE)","v":674.1},{"$f":"VLOOKUP($B$2:$B$13,'5'!$B$2:$D$19,3,FALSE)","v":795.4},{"$f":"VLOOKUP($B$2:$B$13,'6'!$B$2:$D$19,3,FALSE)","v":{"v":0,"d":"0.0"}},{"$f":"IF(Formelhilfe!H4 > 0,J4/Formelhilfe!H4,0)","v":{"v":666.125,"d":"666.1"}},{"$f":"SUM(C4:H4)","v":{"v":2664.5,"d":"2,664.5"}},{"$f":"VLOOKUP($B$2:$B$13,'7'!$B$2:$D$19,3,FALSE)","v":319.5},{"$f":"VLOOKUP($B$2:$B$13,'8'!$B$2:$D$19,3,FALSE)","v":336.5},{"$f":"VLOOKUP($B$2:$B$13,'9'!$B$2:$D$19,3,FALSE)","v":{"v":0,"d":"0.0"}},{"$f":"VLOOKUP($B$2:$B$13,'10'!$B$2:$D$19,3,FALSE)","v":{"v":0,"d":"0.0"}},{"$f":"VLOOKUP($B$2:$B$13,'11'!$B$2:$D$19,3,FALSE)","v":{"v":0,"d":"0.0"}},{"$f":"VLOOKUP($B$2:$B$13,'12'!$B$2:$D$19,3,FALSE)","v":{"v":0,"d":"0.0"}},{"$f":"IF(Formelhilfe!O4>0,R4/Formelhilfe!O4,0)","v":{"v":0,"d":"0.0"}},{"$f":"SUM(K4:P4)","v":{"v":656,"d":"656.0"}},{"$f":"IF(Formelhilfe!P4>0,T4/Formelhilfe!P4,0)","v":{"v":830.125,"d":"830.1"}},{"$f":"SUM(C4:H4,K4:P4)","v":{"v":3320.5,"d":"3,320.5"}}]
[null,"Lahn",{"$f":"VLOOKUP($B$2:$B$13,'Wettkampf 1'!$B$2:$D$13,3,FALSE)","v":{"v":305,"d":"305.0"}},{"$f":"VLOOKUP($B$2:$B$13,'2'!$B$2:$D$19,3,FALSE)","v":590.1},{"$f":"VLOOKUP($B$2:$B$13,'3'!$B$2:$D$19,3,FALSE)","v":553.5},{"$f":"VLOOKUP($B$2:$B$13,'4'!$B$2:$D$19,3,FALSE)","v":{"v":563,"d":"563.0"}},{"$f":"VLOOKUP($B$2:$B$13,'5'!$B$2:$D$19,3,FALSE)","v":284.7},{"$f":"VLOOKUP($B$2:$B$13,'6'!$B$2:$D$19,3,FALSE)","v":{"v":0,"d":"0.0"}},{"$f":"IF(Formelhilfe!H7 > 0,J5/Formelhilfe!H7,0)","v":{"v":1148.1499999999999,"d":"1,148.2"}},{"$f":"SUM(C5:H5)","v":{"v":2296.2999999999997,"d":"2,296.3"}},{"$f":"VLOOKUP($B$2:$B$13,'7'!$B$2:$D$19,3,FALSE)","v":464.9},{"$f":"VLOOKUP($B$2:$B$13,'8'!$B$2:$D$19,3,FALSE)","v":{"v":491,"d":"491.0"}},{"$f":"VLOOKUP($B$2:$B$13,'9'!$B$2:$D$19,3,FALSE)","v":{"v":0,"d":"0.0"}},{"$f":"VLOOKUP($B$2:$B$13,'10'!$B$2:$D$19,3,FALSE)","v":{"v":0,"d":"0.0"}},{"$f":"VLOOKUP($B$2:$B$13,'11'!$B$2:$D$19,3,FALSE)","v":{"v":0,"d":"0.0"}},{"$f":"VLOOKUP($B$2:$B$13,'12'!$B$2:$D$19,3,FALSE)","v":{"v":0,"d":"0.0"}},{"$f":"IF(Formelhilfe!O7>0,R5/Formelhilfe!O7,0)","v":{"v":0,"d":"0.0"}},{"$f":"SUM(K5:P5)","v":955.9},{"$f":"IF(Formelhilfe!P7>0,T5/Formelhilfe!P7,0)","v":{"v":1626.1,"d":"1,626.1"}},{"$f":"SUM(C5:H5,K5:P5)","v":{"v":3252.2,"d":"3,252.2"}}]
[null,"Börgerwald",{"$f":"VLOOKUP($B$2:$B$13,'Wettkampf 1'!$B$2:$D$13,3,FALSE)","v":{"v":674,"d":"674.0"}},{"$f":"VLOOKUP($B$2:$B$13,'2'!$B$2:$D$19,3,FALSE)","v":319.9},{"$f":"VLOOKUP($B$2:$B$13,'3'!$B$2:$D$19,3,FALSE)","v":650.2},{"$f":"VLOOKUP($B$2:$B$13,'4'!$B$2:$D$19,3,FALSE)","v":{"v":1042.5,"d":"1,042.5"}},{"$f":"VLOOKUP($B$2:$B$13,'5'!$B$2:$D$19,3,FALSE)","v":{"v":0,"d":"0.0"}},{"$f":"VLOOKUP($B$2:$B$13,'6'!$B$2:$D$19,3,FALSE)","v":{"v":0,"d":"0.0"}},{"$f":"IF(Formelhilfe!H2 > 0,J6/Formelhilfe!H2,0)","v":{"v":671.65,"d":"671.7"}},{"$f":"SUM(C6:H6)","v":{"v":2686.6,"d":"2,686.6"}},{"$f":"VLOOKUP($B$2:$B$13,'7'!$B$2:$D$19,3,FALSE)","v":{"v":0,"d":"0.0"}},{"$f":"VLOOKUP($B$2:$B$13,'8'!$B$2:$D$19,3,FALSE)","v":{"v":0,"d":"0.0"}},{"$f":"VLOOKUP($B$2:$B$13,'9'!$B$2:$D$19,3,FALSE)","v":{"v":0,"d":"0.0"}},{"$f":"VLOOKUP($B$2:$B$13,'10'!$B$2:$D$19,3,FALSE)","v":{"v":0,"d":"0.0"}},{"$f":"VLOOKUP($B$2:$B$13,'11'!$B$2:$D$19,3,FALSE)","v":{"v":0,"d":"0.0"}},{"$f":"VLOOKUP($B$2:$B$13,'12'!$B$2:$D$19,3,FALSE)","v":{"v":0,"d":"0.0"}},{"$f":"IF(Formelhilfe!O2>0,R6/Formelhilfe!O2,0)","v":{"v":0,"d":"0.0"}},{"$f":"SUM(K6:P6)","v":{"v":0,"d":"0.0"}},{"$f":"IF(Formelhilfe!P2>0,T6/Formelhilfe!P2,0)","v":{"v":537.3199999999999,"d":"537.3"}},{"$f":"SUM(C6:H6,K6:P6)","v":{"v":2686.6,"d":"2,686.6"}}]
[null,"Esterwegen",{"$f":"VLOOKUP($B$2:$B$13,'Wettkampf 1'!$B$2:$D$13,3,FALSE)","v":200.6},{"$f":"VLOOKUP($B$2:$B$13,'2'!$B$2:$D$19,3,FALSE)","v":224.4},{"$f":"VLOOKUP($B$2:$B$13,'3'!$B$2:$D$19,3,FALSE)","v":{"v":0,"d":"0.0"}},{"$f":"VLOOKUP($B$2:$B$13,'4'!$B$2:$D$19,3,FALSE)","v":294.1},{"$f":"VLOOKUP($B$2:$B$13,'5'!$B$2:$D$19,3,FALSE)","v":289.8},{"$f":"VLOOKUP($B$2:$B$13,'6'!$B$2:$D$19,3,FALSE)","v":{"v":0,"d":"0.0"}},{"$f":"IF(Formelhilfe!H6 > 0,J7/Formelhilfe!H6,0)","v":{"v":201.78000000000003,"d":"201.8"}},{"$f":"SUM(C7:H7)","v":{"v":1008.9000000000001,"d":"1,008.9"}},{"$f":"VLOOKUP($B$2:$B$13,'7'!$B$2:$D$19,3,FALSE)","v":279.9},{"$f":"VLOOKUP($B$2:$B$13,'8'!$B$2:$D$19,3,FALSE)","v":{"v":0,"d":"0.0"}},{"$f":"VLOOKUP($B$2:$B$13,'9'!$B$2:$D$19,3,FALSE)","v":{"v":0,"d":"0.0"}},{"$f":"VLOOKUP($B$2:$B$13,'10'!$B$2:$D$19,3,FALSE)","v":{"v":0,"d":"0.0"}},{"$f":"VLOOKUP($B$2:$B$13,'11'!$B$2:$D$19,3,FALSE)","v":{"v":0,"d":"0.0"}},{"$f":"VLOOKUP($B$2:$B$13,'12'!$B$2:$D$19,3,FALSE)","v":{"v":0,"d":"0.0"}},{"$f":"IF(Formelhilfe!O6>0,R7/Formelhilfe!O6,0)","v":{"v":139.95,"d":"140.0"}},{"$f":"SUM(K7:P7)","v":279.9},{"$f":"IF(Formelhilfe!P6>0,T7/Formelhilfe!P6,0)","v":{"v":184.11428571428573,"d":"184.1"}},{"$f":"SUM(C7:H7,K7:P7)","v":{"v":1288.8000000000002,"d":"1,288.8"}}]
[null,"Lorup",{"$f":"VLOOKUP($B$2:$B$13,'Wettkampf 1'!$B$2:$D$13,3,FALSE)","v":274.7},{"$f":"VLOOKUP($B$2:$B$13,'2'!$B$2:$D$19,3,FALSE)","v":{"v":0,"d":"0.0"}},{"$f":"VLOOKUP($B$2:$B$13,'3'!$B$2:$D$19,3,FALSE)","v":{"v":0,"d":"0.0"}},{"$f":"VLOOKUP($B$2:$B$13,'4'!$B$2:$D$19,3,FALSE)","v":287.1},{"$f":"VLOOKUP($B$2:$B$13,'5'!$B$2:$D$19,3,FALSE)","v":{"v":0,"d":"0.0"}},{"$f":"VLOOKUP($B$2:$B$13,'6'!$B$2:$D$19,3,FALSE)","v":{"v":0,"d":"0.0"}},{"$f":"IF(Formelhilfe!H12 > 0,J8/Formelhilfe!H12,0)","v":{"v":0,"d":"0.0"}},{"$f":"SUM(C8:H8)","v":561.8},{"$f":"VLOOKUP($B$2:$B$13,'7'!$B$2:$D$19,3,FALSE)","v":{"v":0,"d":"0.0"}},{"$f":"VLOOKUP($B$2:$B$13,'8'!$B$2:$D$19,3,FALSE)","v":{"v":0,"d":"0.0"}},{"$f":"VLOOKUP($B$2:$B$13,'9'!$B$2:$D$19,3,FALSE)","v":{"v":0,"d":"0.0"}},{"$f":"VLOOKUP($B$2:$B$13,'10'!$B$2:$D$19,3,FALSE)","v":{"v":0,"d":"0.0"}},{"$f":"VLOOKUP($B$2:$B$13,'11'!$B$2:$D$19,3,FALSE)","v":{"v":0,"d":"0.0"}},{"$f":"VLOOKUP($B$2:$B$13,'12'!$B$2:$D$19,3,FALSE)","v":{"v":0,"d":"0.0"}},{"$f":"IF(Formelhilfe!O12>0,R8/Formelhilfe!O12,0)","v":{"v":0,"d":"0.0"}},{"$f":"SUM(K8:P8)","v":{"v":0,"d":"0.0"}},{"$f":"IF(Formelhilfe!P12>0,T8/Formelhilfe!P12,0)","v":{"v":0,"d":"0.0"}},{"$f":"SUM(C8:H8,K8:P8)","v":561.8}]
[null,"Sögel",{"$f":"VLOOKUP($B$2:$B$13,'Wettkampf 1'!$B$2:$D$13,3,FALSE)","v":{"v":0,"d":"0.0"}},{"$f":"VLOOKUP($B$2:$B$13,'2'!$B$2:$D$19,3,FALSE)","v":{"v":0,"d":"0.0"}},{"$f":"VLOOKUP($B$2:$B$13,'3'!$B$2:$D$19,3,FALSE)","v":{"v":0,"d":"0.0"}},{"$f":"VLOOKUP($B$2:$B$13,'4'!$B$2:$D$19,3,FALSE)","v":358.1},{"$f":"VLOOKUP($B$2:$B$13,'5'!$B$2:$D$19,3,FALSE)","v":{"v":0,"d":"0.0"}},{"$f":"VLOOKUP($B$2:$B$13,'6'!$B$2:$D$19,3,FALSE)","v":{"v":0,"d":"0.0"}},{"$f":"IF(Formelhilfe!H8 > 0,J9/Formelhilfe!H8,0)","v":{"v":71.62,"d":"71.6"}},{"$f":"SUM(C9:H9)","v":358.1},{"$f":"VLOOKUP($B$2:$B$13,'7'!$B$2:$D$19,3,FALSE)","v":{"v":0,"d":"0.0"}},{"$f":"VLOOKUP($B$2:$B$13,'8'!$B$2:$D$19,3,FALSE)","v":{"v":0,"d":"0.0"}},{"$f":"VLOOKUP($B$2:$B$13,'9'!$B$2:$D$19,3,FALSE)","v":{"v":0,"d":"0.0"}},{"$f":"VLOOKUP($B$2:$B$13,'10'!$B$2:$D$19,3,FALSE)","v":{"v":0,"d":"0.0"}},{"$f":"VLOOKUP($B$2:$B$13,'11'!$B$2:$D$19,3,FALSE)","v":{"v":0,"d":"0.0"}},{"$f":"VLOOKUP($B$2:$B$13,'12'!$B$2:$D$19,3,FALSE)","v":{"v":0,"d":"0.0"}},{"$f":"IF(Formelhilfe!O8>0,R9/Formelhilfe!O8,0)","v":{"v":0,"d":"0.0"}},{"$f":"SUM(K9:P9)","v":{"v":0,"d":"0.0"}},{"$f":"IF(Formelhilfe!P8>0,T9/Formelhilfe!P8,0)","v":{"v":51.15714285714286,"d":"51.2"}},{"$f":"SUM(C9:H9,K9:P9)","v":358.1}]
[null,"Verein IX",{"$f":"VLOOKUP($B$2:$B$13,'Wettkampf 1'!$B$2:$D$13,3,FALSE)","v":{"v":0,"d":"0.0"}},{"$f":"VLOOKUP($B$2:$B$13,'2'!$B$2:$D$19,3,FALSE)","v":{"v":0,"d":"0.0"}},{"$f":"VLOOKUP($B$2:$B$13,'3'!$B$2:$D$19,3,FALSE)","v":{"v":0,"d":"0.0"}},{"$f":"VLOOKUP($B$2:$B$13,'4'!$B$2:$D$19,3,FALSE)","v":{"v":0,"d":"0.0"}},{"$f":"VLOOKUP($B$2:$B$13,'5'!$B$2:$D$19,3,FALSE)","v":{"v":0,"d":"0.0"}},{"$f":"VLOOKUP($B$2:$B$13,'6'!$B$2:$D$19,3,FALSE)","v":{"v":0,"d":"0.0"}},{"$f":"IF(Formelhilfe!H9 > 0,J10/Formelhilfe!H9,0)","v":{"v":0,"d":"0.0"}},{"$f":"SUM(C10:H10)","v":{"v":0,"d":"0.0"}},{"$f":"VLOOKUP($B$2:$B$13,'7'!$B$2:$D$19,3,FALSE)","v":{"v":0,"d":"0.0"}},{"$f":"VLOOKUP($B$2:$B$13,'8'!$B$2:$D$19,3,FALSE)","v":{"v":0,"d":"0.0"}},{"$f":"VLOOKUP($B$2:$B$13,'9'!$B$2:$D$19,3,FALSE)","v":{"v":0,"d":"0.0"}},{"$f":"VLOOKUP($B$2:$B$13,'10'!$B$2:$D$19,3,FALSE)","v":{"v":0,"d":"0.0"}},{"$f":"VLOOKUP($B$2:$B$13,'11'!$B$2:$D$19,3,FALSE)","v":{"v":0,"d":"0.0"}},{"$f":"VLOOKUP($B$2:$B$13,'12'!$B$2:$D$19,3,FALSE)","v":{"v":0,"d":"0.0"}},{"$f":"IF(Formelhilfe!O9>0,R10/Formelhilfe!O9,0)","v":{"v":0,"d":"0.0"}},{"$f":"SUM(K10:P10)","v":{"v":0,"d":"0.0"}},{"$f":"IF(Formelhilfe!P9>0,T10/Formelhilfe!P9,0)","v":{"v":0,"d":"0.0"}},{"$f":"SUM(C10:H10,K10:P10)","v":{"v":0,"d":"0.0"}}]
[null,"Verein X",{"$f":"VLOOKUP($B$2:$B$13,'Wettkampf 1'!$B$2:$D$13,3,FALSE)","v":{"v":0,"d":"0.0"}},{"$f":"VLOOKUP($B$2:$B$13,'2'!$B$2:$D$19,3,FALSE)","v":{"v":0,"d":"0.0"}},{"$f":"VLOOKUP($B$2:$B$13,'3'!$B$2:$D$19,3,FALSE)","v":{"v":0,"d":"0.0"}},{"$f":"VLOOKUP($B$2:$B$13,'4'!$B$2:$D$19,3,FALSE)","v":{"v":0,"d":"0.0"}},{"$f":"VLOOKUP($B$2:$B$13,'5'!$B$2:$D$19,3,FALSE)","v":{"v":0,"d":"0.0"}},{"$f":"VLOOKUP($B$2:$B$13,'6'!$B$2:$D$19,3,FALSE)","v":{"v":0,"d":"0.0"}},{"$f":"IF(Formelhilfe!H10 > 0,J11/Formelhilfe!H10,0)","v":{"v":0,"d":"0.0"}},{"$f":"SUM(C11:H11)","v":{"v":0,"d":"0.0"}},{"$f":"VLOOKUP($B$2:$B$13,'7'!$B$2:$D$19,3,FALSE)","v":{"v":0,"d":"0.0"}},{"$f":"VLOOKUP($B$2:$B$13,'8'!$B$2:$D$19,3,FALSE)","v":{"v":0,"d":"0.0"}},{"$f":"VLOOKUP($B$2:$B$13,'9'!$B$2:$D$19,3,FALSE)","v":{"v":0,"d":"0.0"}},{"$f":"VLOOKUP($B$2:$B$13,'10'!$B$2:$D$19,3,FALSE)","v":{"v":0,"d":"0.0"}},{"$f":"VLOOKUP($B$2:$B$13,'11'!$B$2:$D$19,3,FALSE)","v":{"v":0,"d":"0.0"}},{"$f":"VLOOKUP($B$2:$B$13,'12'!$B$2:$D$19,3,FALSE)","v":{"v":0,"d":"0.0"}},{"$f":"IF(Formelhilfe!O10>0,R11/Formelhilfe!O10,0)","v":{"v":0,"d":"0.0"}},{"$f":"SUM(K11:P11)","v":{"v":0,"d":"0.0"}},{"$f":"IF(Formelhilfe!P10>0,T11/Formelhilfe!P10,0)","v":{"v":0,"d":"0.0"}},{"$f":"SUM(C11:H11,K11:P11)","v":{"v":0,"d":"0.0"}}]
[null,"Verein XI",{"$f":"VLOOKUP($B$2:$B$13,'Wettkampf 1'!$B$2:$D$13,3,FALSE)","v":{"v":0,"d":"0.0"}},{"$f":"VLOOKUP($B$2:$B$13,'2'!$B$2:$D$19,3,FALSE)","v":{"v":0,"d":"0.0"}},{"$f":"VLOOKUP($B$2:$B$13,'3'!$B$2:$D$19,3,FALSE)","v":{"v":0,"d":"0.0"}},{"$f":"VLOOKUP($B$2:$B$13,'4'!$B$2:$D$19,3,FALSE)","v":{"v":0,"d":"0.0"}},{"$f":"VLOOKUP($B$2:$B$13,'5'!$B$2:$D$19,3,FALSE)","v":{"v":0,"d":"0.0"}},{"$f":"VLOOKUP($B$2:$B$13,'6'!$B$2:$D$19,3,FALSE)","v":{"v":0,"d":"0.0"}},{"$f":"IF(Formelhilfe!H11 > 0,J12/Formelhilfe!H11,0)","v":{"v":0,"d":"0.0"}},{"$f":"SUM(C12:H12)","v":{"v":0,"d":"0.0"}},{"$f":"VLOOKUP($B$2:$B$13,'7'!$B$2:$D$19,3,FALSE)","v":{"v":0,"d":"0.0"}},{"$f":"VLOOKUP($B$2:$B$13,'8'!$B$2:$D$19,3,FALSE)","v":{"v":0,"d":"0.0"}},{"$f":"VLOOKUP($B$2:$B$13,'9'!$B$2:$D$19,3,FALSE)","v":{"v":0,"d":"0.0"}},{"$f":"VLOOKUP($B$2:$B$13,'10'!$B$2:$D$19,3,FALSE)","v":{"v":0,"d":"0.0"}},{"$f":"VLOOKUP($B$2:$B$13,'11'!$B$2:$D$19,3,FALSE)","v":{"v":0,"d":"0.0"}},{"$f":"VLOOKUP($B$2:$B$13,'12'!$B$2:$D$19,3,FALSE)","v":{"v":0,"d":"0.0"}},{"$f":"IF(Formelhilfe!O11>0,R12/Formelhilfe!O11,0)","v":{"v":0,"d":"0.0"}},{"$f":"SUM(K12:P12)","v":{"v":0,"d":"0.0"}},{"$f":"IF(Formelhilfe!P11>0,T12/Formelhilfe!P11,0)","v":{"v":0,"d":"0.0"}},{"$f":"SUM(C12:H12,K12:P12)","v":{"v":0,"d":"0.0"}}]
[null,"Verein XII",{"$f":"VLOOKUP($B$2:$B$13,'Wettkampf 1'!$B$2:$D$13,3,FALSE)","v":{"v":0,"d":"0.0"}},{"$f":"VLOOKUP($B$2:$B$13,'2'!$B$2:$D$19,3,FALSE)","v":{"v":0,"d":"0.0"}},{"$f":"VLOOKUP($B$2:$B$13,'3'!$B$2:$D$19,3,FALSE)","v":{"v":0,"d":"0.0"}},{"$f":"VLOOKUP($B$2:$B$13,'4'!$B$2:$D$19,3,FALSE)","v":{"v":0,"d":"0.0"}},{"$f":"VLOOKUP($B$2:$B$13,'5'!$B$2:$D$19,3,FALSE)","v":{"v":0,"d":"0.0"}},{"$f":"VLOOKUP($B$2:$B$13,'6'!$B$2:$D$19,3,FALSE)","v":{"v":0,"d":"0.0"}},{"$f":"IF(Formelhilfe!H13 > 0,J13/Formelhilfe!H13,0)","v":{"v":0,"d":"0.0"}},{"$f":"SUM(C13:H13)","v":{"v":0,"d":"0.0"}},{"$f":"VLOOKUP($B$2:$B$13,'7'!$B$2:$D$19,3,FALSE)","v":{"v":0,"d":"0.0"}},{"$f":"VLOOKUP($B$2:$B$13,'8'!$B$2:$D$19,3,FALSE)","v":{"v":0,"d":"0.0"}},{"$f":"VLOOKUP($B$2:$B$13,'9'!$B$2:$D$19,3,FALSE)","v":{"v":0,"d":"0.0"}},{"$f":"VLOOKUP($B$2:$B$13,'10'!$B$2:$D$19,3,FALSE)","v":{"v":0,"d":"0.0"}},{"$f":"VLOOKUP($B$2:$B$13,'11'!$B$2:$D$19,3,FALSE)","v":{"v":0,"d":"0.0"}},{"$f":"VLOOKUP($B$2:$B$13,'12'!$B$2:$D$19,3,FALSE)","v":{"v":0,"d":"0.0"}},{"$f":"IF(Formelhilfe!O13>0,R13/Formelhilfe!O13,0)","v":{"v":0,"d":"0.0"}},{"$f":"SUM(K13:P13)","v":{"v":0,"d":"0.0"}},{"$f":"IF(Formelhilfe!P13>0,T13/Formelhilfe!P13,0)","v":{"v":0,"d":"0.0"}},{"$f":"SUM(C13:H13,K13:P13)","v":{"v":0,"d":"0.0"}}]